www-infrastructure-issues mailing list archives

Site index · List index
Message view « Date » · « Thread »
Top « Date » · « Thread »
From Hervé Boutemy (JIRA) <j...@apache.org>
Subject [jira] [Commented] (INFRA-6218) Jenkins - Bunch of Apache Camel builds end up with some weird Jenkins/Maven exceptions/errors.
Date Sun, 15 Dec 2013 22:00:07 GMT

    [ https://issues.apache.org/jira/browse/INFRA-6218?page=com.atlassian.jira.plugin.system.issuetabpanels:comment-tabpanel&focusedCommentId=13848696#comment-13848696
] 

Hervé Boutemy commented on INFRA-6218:
--------------------------------------

ok, I see the problem didn't completely disappear: https://builds.apache.org/view/S-Z/view/Sling/job/sling-trunk-1.7/432/console

from previous lines:
15.12.2013 17:24:05.285 *WARN* [Apche Sling JCR Resource Event Queue Processor for path '/']
org.apache.felix.eventadmin EventAdmin: Blacklisting ServiceReference [[org.apache.sling.event.jobs.JobManager,
org.osgi.service.event.EventHandler, org.apache.sling.discovery.TopologyEventListener, java.lang.Runnable]
| Bundle(org.apache.sling.event [66])] due to timeout!
Build timed out (after 150 minutes). Marking the build as failed.
...
[INFO] ------------------------------------------------------------------------
[INFO] BUILD FAILURE
[INFO] ------------------------------------------------------------------------
[INFO] Total time: 2:29:14.366s
[INFO] Finished at: Sun Dec 15 19:29:33 UTC 2013
[INFO] Final Memory: 147M/268M
[INFO] ------------------------------------------------------------------------
[ERROR] Internal error: java.lang.IllegalStateException: Unable to call isArchivingDisabled.
Invalid object ID 100 -> [Help 1]
org.apache.maven.InternalErrorException: Internal error: java.lang.IllegalStateException:
Unable to call isArchivingDisabled. Invalid object ID 100


I suppose there is some weakness in Jenkins in case of timeout

> Jenkins - Bunch of Apache Camel builds end up with some weird Jenkins/Maven exceptions/errors.
> ----------------------------------------------------------------------------------------------
>
>                 Key: INFRA-6218
>                 URL: https://issues.apache.org/jira/browse/INFRA-6218
>             Project: Infrastructure
>          Issue Type: Task
>      Security Level: public(Regular issues) 
>          Components: Jenkins
>            Reporter: Babak Vahdat
>            Assignee: Jake Farrell
>         Attachments: Bildschirmfoto 2013-05-14 um 18.06.38.png, Camel-2.10.x_build_237_Jenkins_log.txt,
Camel.trunk.fulltest-1339-console.txt, Camel.trunk.fulltest.java7-608-console .txt, Camel.trunk.fulltest.java7-616-console.txt,
Camel.trunk.fulltest.java7-870-console.txt, Camel.trunk.notest-1873-console .txt, Camel.trunk.notest-1890-console.txt,
sling-trunk-1.6-failures.zip
>
>
> Recently we're extremely suffering from different weird errors of Apache Camel builds.
In many cases Jenkins says "Ping time out" and gives up the build process so we end up again
& again with broken and incomplete builds shown with red bubbles, following two examples:
> https://builds.apache.org/job/Camel.trunk.fulltest/1324/console
> https://builds.apache.org/job/Camel.trunk.fulltest.java7/591/console
> And the corresponding Jenkins output in console:
> U camel-core/pom.xml
> U tooling/apt/src/main/java/org/apache/camel/tools/apt/EndpointAnnotationProcessor.java
> FATAL: hudson.remoting.RequestAbortedException: hudson.remoting.Channel$OrderlyShutdown
> hudson.remoting.RequestAbortedException: hudson.remoting.RequestAbortedException: hudson.remoting.Channel$OrderlyShutdown
> at hudson.remoting.Request.call(Request.java:174)
> at hudson.remoting.Channel.call(Channel.java:672)
> at hudson.FilePath.act(FilePath.java:854)
> at hudson.FilePath.act(FilePath.java:838)
> at hudson.scm.SubversionSCM.checkout(SubversionSCM.java:743)
> ...
> Or sometimes the build ends up with some wired Jenkins internal errors as you see here:
> https://builds.apache.org/job/Camel.trunk.fulltest.java7/582/console
> And the corresponding Jenkins output in console:
> [JENKINS] Archiving disabled
> [JENKINS] Archiving disabled
> Waiting for Jenkins to finish collecting data
> mavenExecutionResult exceptions not empty
> message : Internal error: java.lang.reflect.UndeclaredThrowableException
> cause : null
> Stack trace : 
> org.apache.maven.InternalErrorException: Internal error: java.lang.reflect.UndeclaredThrowableException
> at org.apache.maven.lifecycle.internal.BuilderCommon.handleBuildError(BuilderCommon.java:128)
> at org.apache.maven.lifecycle.internal.LifecycleModuleBuilder.buildProject(LifecycleModuleBuilder.java:95)
> at org.apache.maven.lifecycle.internal.LifecycleModuleBuilder.buildProject(LifecycleModuleBuilder.java:59)
> at org.apache.maven.lifecycle.internal.LifecycleStarter.singleThreadedBuild(LifecycleStarter.java:183)
> at org.apache.maven.lifecycle.internal.LifecycleStarter.execute(LifecycleStarter.java:161)
> at org.apache.maven.DefaultMaven.doExecute(DefaultMaven.java:320)
> at org.apache.maven.DefaultMaven.execute(DefaultMaven.java:156)
> No idea if all these has to do with the recent Jenkins upgrades @ INFRA. In all cases
this is really annoying and currently almost all our builds end up with red bubbles.



--
This message was sent by Atlassian JIRA
(v6.1.4#6159)

Mime
View raw message