www-builds mailing list archives

Site index · List index
Message view « Date » · « Thread »
Top « Date » · « Thread »
From Andy Seaborne <a...@apache.org>
Subject Re: Build failed in Jenkins: Jena_Development_Test #2451
Date Wed, 10 Aug 2016 08:19:49 GMT
On 09/08/16 15:42, Pono Takamori wrote:
> H10 was rebooted for a kernel upgrade, sorry for the inconvenience. If you
> have persisting issues with any of the nodes please create a JIRA issue.

Done
INFRA-12403

Other H nodes are reported as having the same problem

	Andy



>
> Cheers,
> -Pono
>
> On Tue, Aug 9, 2016 at 8:25 AM, Andy Seaborne <andy@apache.org> wrote:
>
>> It looks like podling Taverna is also affected - I found a bunch of jobs
>> on H0, H4, H8, H9 that have failed recently.
>>
>> One oddity is that
>>
>> H0 : failure : Aug 8th
>> https://builds.apache.org/job/incubator-taverna-commandline-nightly/208/
>>
>> yet:
>>
>> H0 : success : Aug 5th
>> https://builds.apache.org/job/incubator-taverna-commandline-nightly/205/
>> (failed for other reasons)
>>
>> Other H? have had problems earlier than this.
>>
>> This is from:
>> http://mail-archives.apache.org/mod_mbox/taverna-commits/
>>
>>         Andy
>>
>>
>> On 08/08/16 10:00, Keith W wrote:
>>
>>> Yes, we are seeing the same problem on H10 too.
>>>
>>> https://builds.apache.org/view/M-R/view/Qpid/job/Qpid-Java-
>>> Checks/65/consoleFull
>>>
>>> [Qpid-Java-Checks] $ /home/jenkins/tools/java/latest1.8/bin/java
>>> -XX:MaxPermSize=500m -Xmx2G -Xms1G -Djava.awt.headless=true -cp
>>> /home/jenkins/jenkins-slave/maven32-agent.jar:/home/jenkins/
>>> tools/maven/latest3/boot/plexus-classworlds-2.5.2.jar:/
>>> home/jenkins/tools/maven/latest3/conf/logging
>>> jenkins.maven3.agent.Maven32Main /home/jenkins/tools/maven/latest3/
>>> /home/jenkins/jenkins-slave/slave.jar
>>> /home/jenkins/jenkins-slave/maven32-interceptor.jar
>>> /home/jenkins/jenkins-slave/maven3-interceptor-commons.jar 55578
>>> Java HotSpot(TM) 64-Bit Server VM warning: ignoring option
>>> MaxPermSize=500m; support was removed in 8.0
>>> Exception in thread "main" java.lang.ClassNotFoundException:
>>> hudson.remoting.Launcher
>>> at org.codehaus.plexus.classworlds.strategy.SelfFirstStrategy.
>>> loadClass(SelfFirstStrategy.java:50)
>>> at org.codehaus.plexus.classworlds.realm.ClassRealm.unsynchroni
>>> zedLoadClass(ClassRealm.java:271)
>>> at org.codehaus.plexus.classworlds.realm.ClassRealm.loadClass(
>>> ClassRealm.java:247)
>>> at org.codehaus.plexus.classworlds.realm.ClassRealm.loadClass(
>>> ClassRealm.java:239)
>>> at jenkins.maven3.agent.Maven32Main.main(Maven32Main.java:143)
>>> at jenkins.maven3.agent.Maven32Main.main(Maven32Main.java:74)
>>> ERROR: Failed to parse POMs
>>> java.io.EOFException: unexpected stream termination
>>> at hudson.remoting.ChannelBuilder.negotiate(ChannelBuilder.java:365)
>>> at hudson.remoting.ChannelBuilder.build(ChannelBuilder.java:310)
>>> at hudson.slaves.Channels.forProcess(Channels.java:115)
>>> at hudson.maven.AbstractMavenProcessFactory.newProcess(Abstract
>>> MavenProcessFactory.java:297)
>>> at hudson.maven.ProcessCache.get(ProcessCache.java:236)
>>> at hudson.maven.MavenModuleSetBuild$MavenModuleSetBuildExecutio
>>> n.doRun(MavenModuleSetBuild.java:778)
>>> at hudson.model.AbstractBuild$AbstractBuildExecution.run(Abstra
>>> ctBuild.java:534)
>>> at hudson.model.Run.execute(Run.java:1738)
>>> at hudson.maven.MavenModuleSetBuild.run(MavenModuleSetBuild.java:531)
>>> at hudson.model.ResourceController.execute(ResourceController.java:98)
>>> at hudson.model.Executor.run(Executor.java:410)
>>> Archiving artifacts
>>> Sending e-mails to: notifications@qpid.apache.org
>>> Finished: FAILURE
>>>
>>> On 6 August 2016 at 11:43, Andy Seaborne <andy@apache.org> wrote:
>>>
>>>> We're seeing problems on H10 of the form:
>>>>
>>>> Exception in thread "main" java.lang.ClassNotFoundException:
>>>> hudson.remoting.Launcher
>>>>
>>>> As far as I can tell, it's only H10.
>>>>
>>>>         Andy
>>>>
>>>> -------- Forwarded Message --------
>>>> Subject: Build failed in Jenkins: Jena_Development_Test #2451
>>>> Date: Fri, 5 Aug 2016 21:18:44 +0000 (UTC)
>>>> From: Apache Jenkins Server <jenkins@builds.apache.org>
>>>> Reply-To: dev@jena.apache.org
>>>> To: commits@jena.apache.org
>>>>
>>>> See <https://builds.apache.org/job/Jena_Development_Test/2451/changes>
>>>>
>>>> Changes:
>>>>
>>>> [andy] Rename to make clear when processing the server configuration.
>>>>
>>>> [andy] Provide reading and creating DataAccessPoints from a single file.
>>>>
>>>> [andy] Remove some unnecessary logging.
>>>>
>>>> ------------------------------------------
>>>> Started by an SCM change
>>>> [EnvInject] - Loading node environment variables.
>>>> Building remotely on H10 (docker Ubuntu ubuntu yahoo-not-h2) in workspace
>>>> <https://builds.apache.org/job/Jena_Development_Test/ws/>
>>>>  > git rev-parse --is-inside-work-tree # timeout=10
>>>> Fetching changes from the remote Git repository
>>>>  > git config remote.origin.url git://git.apache.org/jena.git #
>>>> timeout=10
>>>> Fetching upstream changes from git://git.apache.org/jena.git
>>>>  > git --version # timeout=10
>>>>  > git -c core.askpass=true fetch --tags --progress
>>>> git://git.apache.org/jena.git +refs/heads/*:refs/remotes/origin/*
>>>>  > git rev-parse origin/master^{commit} # timeout=10
>>>> Checking out Revision b5d4fcbe0037995c99cb86e4f249044497f755cf
>>>> (origin/master)
>>>>  > git config core.sparsecheckout # timeout=10
>>>>  > git checkout -f b5d4fcbe0037995c99cb86e4f249044497f755cf
>>>>  > git rev-list 81cc6f4e5045d311c65cb48be017c09cdca2f873 # timeout=10
>>>> Parsing POMs
>>>> Modules changed, recalculating dependency graph
>>>> Established TCP socket on 42364
>>>> maven32-agent.jar already up to date
>>>> maven32-interceptor.jar already up to date
>>>> maven3-interceptor-commons.jar already up to date
>>>> [Jena_Development_Test] $
>>>> /home/jenkins/jenkins-slave/tools/hudson.model.JDK/latest1.8/bin/java
>>>> -Xrs
>>>> -cp
>>>> /home/jenkins/jenkins-slave/maven32-agent.jar:/home/jenkins/
>>>> jenkins-slave/tools/hudson.tasks.Maven_MavenInstallation/
>>>> maven-3.3.3/boot/plexus-classworlds-2.5.2.jar:/home/
>>>> jenkins/jenkins-slave/tools/hudson.tasks.Maven_
>>>> MavenInstallation/maven-3.3.3/conf/logging
>>>> jenkins.maven3.agent.Maven32Main
>>>> /home/jenkins/jenkins-slave/tools/hudson.tasks.Maven_MavenIn
>>>> stallation/maven-3.3.3
>>>> /home/jenkins/jenkins-slave/slave.jar
>>>> /home/jenkins/jenkins-slave/maven32-interceptor.jar
>>>> /home/jenkins/jenkins-slave/maven3-interceptor-commons.jar 42364
>>>> Exception in thread "main" java.lang.ClassNotFoundException:
>>>> hudson.remoting.Launcher
>>>>         at
>>>> org.codehaus.plexus.classworlds.strategy.SelfFirstStrategy.
>>>> loadClass(SelfFirstStrategy.java:50)
>>>>         at
>>>> org.codehaus.plexus.classworlds.realm.ClassRealm.unsynchroni
>>>> zedLoadClass(ClassRealm.java:271)
>>>>         at
>>>> org.codehaus.plexus.classworlds.realm.ClassRealm.loadClass(
>>>> ClassRealm.java:247)
>>>>         at
>>>> org.codehaus.plexus.classworlds.realm.ClassRealm.loadClass(
>>>> ClassRealm.java:239)
>>>>         at jenkins.maven3.agent.Maven32Main.main(Maven32Main.java:143)
>>>>         at jenkins.maven3.agent.Maven32Main.main(Maven32Main.java:74)
>>>> ERROR: Failed to parse POMs
>>>> java.io.EOFException: unexpected stream termination
>>>>         at hudson.remoting.ChannelBuilder.negotiate(ChannelBuilder.
>>>> java:365)
>>>>         at hudson.remoting.ChannelBuilder.build(ChannelBuilder.java:310)
>>>>         at hudson.slaves.Channels.forProcess(Channels.java:115)
>>>>         at
>>>> hudson.maven.AbstractMavenProcessFactory.newProcess(Abstract
>>>> MavenProcessFactory.java:297)
>>>>         at hudson.maven.ProcessCache.get(ProcessCache.java:236)
>>>>         at
>>>> hudson.maven.MavenModuleSetBuild$MavenModuleSetBuildExecutio
>>>> n.doRun(MavenModuleSetBuild.java:778)
>>>>         at
>>>> hudson.model.AbstractBuild$AbstractBuildExecution.run(Abstra
>>>> ctBuild.java:534)
>>>>         at hudson.model.Run.execute(Run.java:1738)
>>>>         at
>>>> hudson.maven.MavenModuleSetBuild.run(MavenModuleSetBuild.java:531)
>>>>         at
>>>> hudson.model.ResourceController.execute(ResourceController.java:98)
>>>>         at hudson.model.Executor.run(Executor.java:410)
>>>>
>>>
>>
>


Mime
View raw message