www-builds mailing list archives

Site index · List index
Message view « Date » · « Thread »
Top « Date » · « Thread »
From Lukasz Lenart <lukaszlen...@apache.org>
Subject Fwd: Build failed in Jenkins: Struts-JDK6-support-2.3 #1021
Date Thu, 05 May 2016 05:50:36 GMT
Any idea what can be wrong? This build used to work :(


---------- Forwarded message ----------
From: Apache Jenkins Server <jenkins@builds.apache.org>
Date: 2016-05-04 22:24 GMT+02:00
Subject: Build failed in Jenkins: Struts-JDK6-support-2.3 #1021
To: dev@struts.apache.org


See <https://builds.apache.org/job/Struts-JDK6-support-2.3/1021/changes>

Changes:

[amashchenko] WW-4630 - <s:submit> generates a value attribute for
type=image which

------------------------------------------
[...truncated 4775 lines...]
Generating <https://builds.apache.org/job/Struts-JDK6-support-2.3/ws/core/target/apidocs/org/apache/struts2/components/template//class-use/JspTemplateEngine.html...>
Generating <https://builds.apache.org/job/Struts-JDK6-support-2.3/ws/core/target/apidocs/com/opensymphony/xwork2/config//package-use.html...>
Generating <https://builds.apache.org/job/Struts-JDK6-support-2.3/ws/core/target/apidocs/org/apache/struts2//package-use.html...>
Generating <https://builds.apache.org/job/Struts-JDK6-support-2.3/ws/core/target/apidocs/org/apache/struts2/components//package-use.html...>
Generating <https://builds.apache.org/job/Struts-JDK6-support-2.3/ws/core/target/apidocs/org/apache/struts2/components/template//package-use.html...>
Generating <https://builds.apache.org/job/Struts-JDK6-support-2.3/ws/core/target/apidocs/org/apache/struts2/config//package-use.html...>
Generating <https://builds.apache.org/job/Struts-JDK6-support-2.3/ws/core/target/apidocs/org/apache/struts2/dispatcher//package-use.html...>
Generating <https://builds.apache.org/job/Struts-JDK6-support-2.3/ws/core/target/apidocs/org/apache/struts2/dispatcher/mapper//package-use.html...>
Generating <https://builds.apache.org/job/Struts-JDK6-support-2.3/ws/core/target/apidocs/org/apache/struts2/dispatcher/multipart//package-use.html...>
Generating <https://builds.apache.org/job/Struts-JDK6-support-2.3/ws/core/target/apidocs/org/apache/struts2/dispatcher/ng//package-use.html...>
Generating <https://builds.apache.org/job/Struts-JDK6-support-2.3/ws/core/target/apidocs/org/apache/struts2/dispatcher/ng/filter//package-use.html...>
Generating <https://builds.apache.org/job/Struts-JDK6-support-2.3/ws/core/target/apidocs/org/apache/struts2/dispatcher/ng/listener//package-use.html...>
Generating <https://builds.apache.org/job/Struts-JDK6-support-2.3/ws/core/target/apidocs/org/apache/struts2/dispatcher/ng/servlet//package-use.html...>
Generating <https://builds.apache.org/job/Struts-JDK6-support-2.3/ws/core/target/apidocs/org/apache/struts2/factory//package-use.html...>
Generating <https://builds.apache.org/job/Struts-JDK6-support-2.3/ws/core/target/apidocs/org/apache/struts2/impl//package-use.html...>
Generating <https://builds.apache.org/job/Struts-JDK6-support-2.3/ws/core/target/apidocs/org/apache/struts2/interceptor//package-use.html...>
Generating <https://builds.apache.org/job/Struts-JDK6-support-2.3/ws/core/target/apidocs/org/apache/struts2/interceptor/debugging//package-use.html...>
Generating <https://builds.apache.org/job/Struts-JDK6-support-2.3/ws/core/target/apidocs/org/apache/struts2/interceptor/validation//package-use.html...>
Generating <https://builds.apache.org/job/Struts-JDK6-support-2.3/ws/core/target/apidocs/org/apache/struts2/servlet/interceptor//package-use.html...>
Generating <https://builds.apache.org/job/Struts-JDK6-support-2.3/ws/core/target/apidocs/org/apache/struts2/util//package-use.html...>
Generating <https://builds.apache.org/job/Struts-JDK6-support-2.3/ws/core/target/apidocs/org/apache/struts2/util/fs//package-use.html...>
Generating <https://builds.apache.org/job/Struts-JDK6-support-2.3/ws/core/target/apidocs/org/apache/struts2/util/tomcat/buf//package-use.html...>
Generating <https://builds.apache.org/job/Struts-JDK6-support-2.3/ws/core/target/apidocs/org/apache/struts2/views//package-use.html...>
Generating <https://builds.apache.org/job/Struts-JDK6-support-2.3/ws/core/target/apidocs/org/apache/struts2/views/annotations//package-use.html...>
Generating <https://builds.apache.org/job/Struts-JDK6-support-2.3/ws/core/target/apidocs/org/apache/struts2/views/freemarker//package-use.html...>
Generating <https://builds.apache.org/job/Struts-JDK6-support-2.3/ws/core/target/apidocs/org/apache/struts2/views/freemarker/tags//package-use.html...>
Generating <https://builds.apache.org/job/Struts-JDK6-support-2.3/ws/core/target/apidocs/org/apache/struts2/views/jsp//package-use.html...>
Generating <https://builds.apache.org/job/Struts-JDK6-support-2.3/ws/core/target/apidocs/org/apache/struts2/views/jsp/iterator//package-use.html...>
Generating <https://builds.apache.org/job/Struts-JDK6-support-2.3/ws/core/target/apidocs/org/apache/struts2/views/jsp/ui//package-use.html...>
Generating <https://builds.apache.org/job/Struts-JDK6-support-2.3/ws/core/target/apidocs/org/apache/struts2/views/util//package-use.html...>
Generating <https://builds.apache.org/job/Struts-JDK6-support-2.3/ws/core/target/apidocs/org/apache/struts2/views/velocity//package-use.html...>
Generating <https://builds.apache.org/job/Struts-JDK6-support-2.3/ws/core/target/apidocs/org/apache/struts2/views/velocity/components//package-use.html...>
Generating <https://builds.apache.org/job/Struts-JDK6-support-2.3/ws/core/target/apidocs/org/apache/struts2/views/xslt//package-use.html...>
Building index for all the packages and classes...
Generating <https://builds.apache.org/job/Struts-JDK6-support-2.3/ws/core/target/apidocs/overview-tree.html...>
Generating <https://builds.apache.org/job/Struts-JDK6-support-2.3/ws/core/target/apidocs/index-all.html...>
Generating <https://builds.apache.org/job/Struts-JDK6-support-2.3/ws/core/target/apidocs/deprecated-list.html...>
Building index for all classes...
Generating <https://builds.apache.org/job/Struts-JDK6-support-2.3/ws/core/target/apidocs/allclasses-frame.html...>
Generating <https://builds.apache.org/job/Struts-JDK6-support-2.3/ws/core/target/apidocs/allclasses-noframe.html...>
Generating <https://builds.apache.org/job/Struts-JDK6-support-2.3/ws/core/target/apidocs/index.html...>
Generating <https://builds.apache.org/job/Struts-JDK6-support-2.3/ws/core/target/apidocs/overview-summary.html...>
Generating <https://builds.apache.org/job/Struts-JDK6-support-2.3/ws/core/target/apidocs/help-doc.html...>
Generating <https://builds.apache.org/job/Struts-JDK6-support-2.3/ws/core/target/apidocs/stylesheet.css...>
32 warnings
[WARNING] Javadoc Warnings
[WARNING] <https://builds.apache.org/job/Struts-JDK6-support-2.3/ws/core/src/main/java/org/apache/struts2/config/ServletContextSingleton.java>:40:
warning - Tag @link: reference not found:
org.apache.struts2.lifecycle.SessionLifecycleListener
[WARNING] <https://builds.apache.org/job/Struts-JDK6-support-2.3/ws/core/src/main/java/org/apache/struts2/views/jsp/iterator/IteratorGeneratorTag.java>:156:
warning - @s.tagattribute is an unknown tag.
[WARNING] <https://builds.apache.org/job/Struts-JDK6-support-2.3/ws/core/src/main/java/org/apache/struts2/views/jsp/iterator/IteratorGeneratorTag.java>:165:
warning - @s.tagattribute is an unknown tag.
[WARNING] <https://builds.apache.org/job/Struts-JDK6-support-2.3/ws/core/src/main/java/org/apache/struts2/views/jsp/iterator/SortIteratorTag.java>:92:
warning - @s.tag is an unknown tag.
[WARNING] <https://builds.apache.org/job/Struts-JDK6-support-2.3/ws/core/src/main/java/org/apache/struts2/views/jsp/iterator/SubsetIteratorTag.java>:154:
warning - @s.tag is an unknown tag.
[WARNING] <https://builds.apache.org/job/Struts-JDK6-support-2.3/ws/core/src/main/java/org/apache/struts2/views/jsp/iterator/SubsetIteratorTag.java>:184:
warning - @s.tagattribute is an unknown tag.
[WARNING] <https://builds.apache.org/job/Struts-JDK6-support-2.3/ws/core/src/main/java/org/apache/struts2/views/xslt/AdapterFactory.java>:116:
warning - @return tag has no arguments.
[WARNING] <https://builds.apache.org/job/Struts-JDK6-support-2.3/ws/core/src/main/java/org/apache/struts2/dispatcher/Dispatcher.java>:855:
warning - @return tag has no arguments.
[WARNING] <https://builds.apache.org/job/Struts-JDK6-support-2.3/ws/core/src/main/java/org/apache/struts2/dispatcher/PostbackResult.java>:176:
warning - @return tag cannot be used in method with void return type.
[WARNING] <https://builds.apache.org/job/Struts-JDK6-support-2.3/ws/core/src/main/java/org/apache/struts2/dispatcher/ServletActionRedirectResult.java>:128:
warning - Tag @link: reference not found: ActionMapperFactory
[WARNING] <https://builds.apache.org/job/Struts-JDK6-support-2.3/ws/core/src/main/java/org/apache/struts2/dispatcher/StrutsResultSupport.java>:222:
warning - @return tag has no arguments.
[WARNING] <https://builds.apache.org/job/Struts-JDK6-support-2.3/ws/core/src/main/java/org/apache/struts2/dispatcher/multipart/JakartaStreamMultiPartRequest.java>:158:
warning - @return tag has no arguments.
[WARNING] <https://builds.apache.org/job/Struts-JDK6-support-2.3/ws/core/src/main/java/org/apache/struts2/interceptor/PrincipalProxy.java>:70:
warning - Tag @link: reference not found:
org.apache.struts2.servlet.ServletRequestAware
[WARNING] <https://builds.apache.org/job/Struts-JDK6-support-2.3/ws/core/src/main/java/org/apache/struts2/interceptor/PrincipalProxy.java>:70:
warning - Tag @link: reference not found:
org.apache.struts2.servlet.ServletRequestAware
[WARNING] <https://builds.apache.org/job/Struts-JDK6-support-2.3/ws/core/src/main/java/org/apache/struts2/servlet/interceptor/ServletPrincipalProxy.java>:88:
warning - Tag @link: reference not found:
org.apache.struts2.servlet.ServletRequestAware
[WARNING] <https://builds.apache.org/job/Struts-JDK6-support-2.3/ws/core/src/main/java/org/apache/struts2/servlet/interceptor/ServletPrincipalProxy.java>:88:
warning - Tag @link: reference not found:
org.apache.struts2.servlet.ServletRequestAware
[WARNING] <https://builds.apache.org/job/Struts-JDK6-support-2.3/ws/core/src/main/java/org/apache/struts2/util/ContainUtil.java>:71:
warning - @return tag has no arguments.
[WARNING] <https://builds.apache.org/job/Struts-JDK6-support-2.3/ws/core/src/main/java/org/apache/struts2/util/fs/JBossFileManager.java>:123:
warning - @return tag has no arguments.
[WARNING] <https://builds.apache.org/job/Struts-JDK6-support-2.3/ws/core/src/main/java/org/apache/struts2/components/Form.java>:399:
warning - @return tag has no arguments.
[WARNING] <https://builds.apache.org/job/Struts-JDK6-support-2.3/ws/core/src/main/java/org/apache/struts2/components/TextArea.java>:53:
warning - Tag @see: reference not found: TabbedPanel
[WARNING] <https://builds.apache.org/job/Struts-JDK6-support-2.3/ws/core/src/main/java/org/apache/struts2/components/UpDownSelect.java>:83:
warning - @s.tag is an unknown tag.
[WARNING] <https://builds.apache.org/job/Struts-JDK6-support-2.3/ws/core/src/main/java/org/apache/struts2/components/UrlRenderer.java>:38:
warning - @param argument "urlComponent" is not a parameter name.
[WARNING] <https://builds.apache.org/job/Struts-JDK6-support-2.3/ws/core/src/main/java/org/apache/struts2/components/UrlRenderer.java>:45:
warning - @param argument "urlComponent" is not a parameter name.
[WARNING] <https://builds.apache.org/job/Struts-JDK6-support-2.3/ws/core/src/main/java/org/apache/struts2/dispatcher/ServletActionRedirectResult.java>:128:
warning - Tag @link: reference not found: ActionMapperFactory
[WARNING] <https://builds.apache.org/job/Struts-JDK6-support-2.3/ws/core/src/main/java/org/apache/struts2/dispatcher/ServletActionRedirectResult.java>:128:
warning - Tag @link: reference not found: ActionMapperFactory
[WARNING] <https://builds.apache.org/job/Struts-JDK6-support-2.3/ws/core/src/main/java/org/apache/struts2/dispatcher/ServletActionRedirectResult.java>:128:
warning - Tag @link: reference not found: ActionMapperFactory
[WARNING] <https://builds.apache.org/job/Struts-JDK6-support-2.3/ws/core/src/main/java/org/apache/struts2/dispatcher/ServletActionRedirectResult.java>:128:
warning - Tag @link: reference not found: ActionMapperFactory
[WARNING] <https://builds.apache.org/job/Struts-JDK6-support-2.3/ws/core/src/main/java/org/apache/struts2/interceptor/PrincipalProxy.java>:70:
warning - Tag @link: reference not found:
org.apache.struts2.servlet.ServletRequestAware
[WARNING] <https://builds.apache.org/job/Struts-JDK6-support-2.3/ws/core/src/main/java/org/apache/struts2/servlet/interceptor/ServletPrincipalProxy.java>:88:
warning - Tag @link: reference not found:
org.apache.struts2.servlet.ServletRequestAware
[WARNING] <https://builds.apache.org/job/Struts-JDK6-support-2.3/ws/core/src/main/java/org/apache/struts2/dispatcher/ServletActionRedirectResult.java>:128:
warning - Tag @link: reference not found: ActionMapperFactory
[WARNING] <https://builds.apache.org/job/Struts-JDK6-support-2.3/ws/core/src/main/java/org/apache/struts2/interceptor/PrincipalProxy.java>:70:
warning - Tag @link: reference not found:
org.apache.struts2.servlet.ServletRequestAware
[WARNING] <https://builds.apache.org/job/Struts-JDK6-support-2.3/ws/core/src/main/java/org/apache/struts2/servlet/interceptor/ServletPrincipalProxy.java>:88:
warning - Tag @link: reference not found:
org.apache.struts2.servlet.ServletRequestAware
[INFO] Building jar:
<https://builds.apache.org/job/Struts-JDK6-support-2.3/ws/core/target/struts2-core-2.3.29-SNAPSHOT-javadoc.jar>
[INFO]
[INFO] --- maven-remote-resources-plugin:1.2.1:process (default) @
struts2-core ---
[INFO]
[INFO] --- maven-resources-plugin:2.5:resources (default-resources) @
struts2-core ---
[debug] execute contextualize
[INFO] Using 'UTF-8' encoding to copy filtered resources.
[INFO] Copying 181 resources
[INFO] Copying 3 resources
[INFO]
[INFO] --- maven-compiler-plugin:2.3.2:compile (default-compile) @
struts2-core ---
[INFO] Compiling 405 source files to
<https://builds.apache.org/job/Struts-JDK6-support-2.3/ws/core/target/classes>
[INFO]
[INFO] --- maven-apt-plugin:1.0.15:execute (default) @ struts2-core ---
[INFO] Downloading:
https://repo.maven.apache.org/maven2/org/codehaus/plexus/plexus-compiler-javac/1.5.3/plexus-compiler-javac-1.5.3.pom
[INFO] Downloaded:
https://repo.maven.apache.org/maven2/org/codehaus/plexus/plexus-compiler-javac/1.5.3/plexus-compiler-javac-1.5.3.pom
(797 B at 77.8 KB/sec)
[INFO] Downloading:
https://repo.maven.apache.org/maven2/org/codehaus/plexus/plexus-compilers/1.5.3/plexus-compilers-1.5.3.pom
[INFO] Downloaded:
https://repo.maven.apache.org/maven2/org/codehaus/plexus/plexus-compilers/1.5.3/plexus-compilers-1.5.3.pom
(8 KB at 933.6 KB/sec)
[INFO] Downloading:
https://repo.maven.apache.org/maven2/org/codehaus/plexus/plexus-compiler/1.5.3/plexus-compiler-1.5.3.pom
[INFO] Downloaded:
https://repo.maven.apache.org/maven2/org/codehaus/plexus/plexus-compiler/1.5.3/plexus-compiler-1.5.3.pom
(2 KB at 177.5 KB/sec)
[INFO] Downloading:
https://repo.maven.apache.org/maven2/org/codehaus/plexus/plexus-utils/1.0.5/plexus-utils-1.0.5.pom
[INFO] Downloaded:
https://repo.maven.apache.org/maven2/org/codehaus/plexus/plexus-utils/1.0.5/plexus-utils-1.0.5.pom
(918 B at 99.6 KB/sec)
[INFO] Downloading:
https://repo.maven.apache.org/maven2/org/codehaus/plexus/plexus-compiler-api/1.5.3/plexus-compiler-api-1.5.3.pom
[INFO] Downloaded:
https://repo.maven.apache.org/maven2/org/codehaus/plexus/plexus-compiler-api/1.5.3/plexus-compiler-api-1.5.3.pom
(624 B at 55.4 KB/sec)
[INFO] Downloading:
https://repo.maven.apache.org/maven2/junit/junit/4.4/junit-4.4.pom
[INFO] Downloaded:
https://repo.maven.apache.org/maven2/junit/junit/4.4/junit-4.4.pom (2
KB at 132.5 KB/sec)
[INFO] Downloading:
https://repo.maven.apache.org/maven2/org/apache/maven/maven-plugin-api/2.0.5/maven-plugin-api-2.0.5.pom
[INFO] Downloaded:
https://repo.maven.apache.org/maven2/org/apache/maven/maven-plugin-api/2.0.5/maven-plugin-api-2.0.5.pom
(605 B at 49.2 KB/sec)
[INFO] Downloading:
https://repo.maven.apache.org/maven2/org/codehaus/plexus/plexus-compiler-javac/1.5.3/plexus-compiler-javac-1.5.3.jar
[INFO] Downloading:
https://repo.maven.apache.org/maven2/org/codehaus/plexus/plexus-utils/1.0.5/plexus-utils-1.0.5.jar
[INFO] Downloading:
https://repo.maven.apache.org/maven2/org/codehaus/plexus/plexus-compiler-api/1.5.3/plexus-compiler-api-1.5.3.jar
[INFO] Downloaded:
https://repo.maven.apache.org/maven2/org/codehaus/plexus/plexus-compiler-javac/1.5.3/plexus-compiler-javac-1.5.3.jar
(14 KB at 1146.2 KB/sec)
[INFO] Downloaded:
https://repo.maven.apache.org/maven2/org/codehaus/plexus/plexus-compiler-api/1.5.3/plexus-compiler-api-1.5.3.jar
(20 KB at 1616.9 KB/sec)
[INFO] Downloaded:
https://repo.maven.apache.org/maven2/org/codehaus/plexus/plexus-utils/1.0.5/plexus-utils-1.0.5.jar
(165 KB at 9153.6 KB/sec)
[INFO] ------------------------------------------------------------------------
[INFO] Reactor Summary:
[INFO]
[INFO] Struts 2 Bill of Materials ......................... SUCCESS [  4.509 s]
[INFO] Struts 2 ........................................... SUCCESS [  2.259 s]
[INFO] XWork: Core ........................................ SUCCESS [ 57.151 s]
[INFO] Struts 2 Core ...................................... FAILURE [ 11.349 s]
[INFO] Struts Plugins ..................................... SKIPPED
[INFO] Struts 2 Spring Plugin ............................. SKIPPED
[INFO] Struts 2 Convention Plugin ......................... SKIPPED
[INFO] Struts 2 JUnit Plugin .............................. SKIPPED
[INFO] Struts 2 Webapps ................................... SKIPPED
[INFO] Struts 2 Blank Webapp .............................. SKIPPED
[INFO] Struts 2 JBoss Blank Webapp ........................ SKIPPED
[INFO] Struts 2 Mail Reader Webapp ........................ SKIPPED
[INFO] Struts 2 Portlet Plugin ............................ SKIPPED
[INFO] Struts 2 DWR Plugin ................................ SKIPPED
[INFO] Struts 2 Tiles Plugin .............................. SKIPPED
[INFO] Struts 2 Portlet Tiles Plugin ...................... SKIPPED
[INFO] Struts 2 Portlet Webapp ............................ SKIPPED
[INFO] Struts 2 Struts 1 Plugin ........................... SKIPPED
[INFO] Struts 2 Dojo Plugin ............................... SKIPPED
[INFO] Struts 2 JSF Plugin ................................ SKIPPED
[INFO] Struts 2 Configuration Browser Plugin .............. SKIPPED
[INFO] Struts 2 Sitemesh Plugin ........................... SKIPPED
[INFO] Struts 2 JSON Plugin ............................... SKIPPED
[INFO] Struts 2 Showcase Webapp ........................... SKIPPED
[INFO] Struts 2 REST Plugin ............................... SKIPPED
[INFO] Struts 2 Rest Showcase Webapp ...................... SKIPPED
[INFO] Struts 2 CDI Plugin ................................ SKIPPED
[INFO] Struts 2 Codebehind Plugin ......................... SKIPPED
[INFO] Struts 2 Embedded JSP Plugin ....................... SKIPPED
[INFO] Struts 2 GXP Plugin ................................ SKIPPED
[INFO] Struts 2 Jasper Reports Plugin ..................... SKIPPED
[INFO] Struts 2 Java 8 support plugin ..................... SKIPPED
[INFO] Struts 2 Java Templates Plugin ..................... SKIPPED
[INFO] Struts 2 JFreeChart Plugin ......................... SKIPPED
[INFO] Struts 2 OSGi Plugin ............................... SKIPPED
[INFO] Struts 2 OVal Plugin ............................... SKIPPED
[INFO] Struts 2 Pell Multipart Plugin ..................... SKIPPED
[INFO] Struts 2 Plexus Plugin ............................. SKIPPED
[INFO] Struts 2 Sitegraph Plugin .......................... SKIPPED
[INFO] Struts 2 TestNG Plugin ............................. SKIPPED
[INFO] Struts 2 Tiles 3 Plugin ............................ SKIPPED
[INFO] Struts OSGi Bundles ................................ SKIPPED
[INFO] Struts 2 OSGi Admin Bundle ......................... SKIPPED
[INFO] Struts 2 OSGi Demo Bundle .......................... SKIPPED
[INFO] Struts 2 Maven Archetypes .......................... SKIPPED
[INFO] Struts 2 Archetypes - Angular JS ................... SKIPPED
[INFO] Struts 2 Archetypes - Blank ........................ SKIPPED
[INFO] Struts 2 Archetypes - Blank Convention ............. SKIPPED
[INFO] Struts 2 Archetypes - Database Portlet ............. SKIPPED
[INFO] Struts 2 Archetypes - Plugin ....................... SKIPPED
[INFO] Struts 2 Archetypes - Portlet ...................... SKIPPED
[INFO] Struts 2 Archetypes - Starter ...................... SKIPPED
[INFO] Struts 2 Assembly .................................. SKIPPED
[INFO] ------------------------------------------------------------------------
[INFO] BUILD FAILURE
[INFO] ------------------------------------------------------------------------
[INFO] Total time: 01:43 min
[INFO] Finished at: 2016-05-04T20:22:48+00:00
[INFO] Final Memory: 53M/336M
[INFO] ------------------------------------------------------------------------
[ERROR] Failed to execute goal
org.apache.myfaces.tobago:maven-apt-plugin:1.0.15:execute (default) on
project struts2-core: Error starting apt compiler:
com.sun.tools.apt.Main -> [Help 1]
[ERROR]
[ERROR] To see the full stack trace of the errors, re-run Maven with
the -e switch.
[ERROR] Re-run Maven using the -X switch to enable full debug logging.
[ERROR]
[ERROR] For more information about the errors and possible solutions,
please read the following articles:
[ERROR] [Help 1]
http://cwiki.apache.org/confluence/display/MAVEN/MojoExecutionException
[ERROR]
[ERROR] After correcting the problems, you can resume the build with the command
[ERROR]   mvn <goals> -rf :struts2-core
[JENKINS] Archiving
<https://builds.apache.org/job/Struts-JDK6-support-2.3/ws/plugins/pell-multipart/pom.xml>
to org.apache.struts/struts2-pell-multipart-plugin/2.3.29-SNAPSHOT/struts2-pell-multipart-plugin-2.3.29-SNAPSHOT.pom
[JENKINS] Archiving
<https://builds.apache.org/job/Struts-JDK6-support-2.3/ws/plugins/jfreechart/pom.xml>
to org.apache.struts/struts2-jfreechart-plugin/2.3.29-SNAPSHOT/struts2-jfreechart-plugin-2.3.29-SNAPSHOT.pom
[JENKINS] Archiving
<https://builds.apache.org/job/Struts-JDK6-support-2.3/ws/plugins/java8-support/pom.xml>
to org.apache.struts/struts2-java8-support-plugin/2.3.29-SNAPSHOT/struts2-java8-support-plugin-2.3.29-SNAPSHOT.pom
[JENKINS] Archiving
<https://builds.apache.org/job/Struts-JDK6-support-2.3/ws/plugins/sitemesh/pom.xml>
to org.apache.struts/struts2-sitemesh-plugin/2.3.29-SNAPSHOT/struts2-sitemesh-plugin-2.3.29-SNAPSHOT.pom
[JENKINS] Archiving
<https://builds.apache.org/job/Struts-JDK6-support-2.3/ws/archetypes/struts2-archetype-portlet/pom.xml>
to org.apache.struts/struts2-archetype-portlet/2.3.29-SNAPSHOT/struts2-archetype-portlet-2.3.29-SNAPSHOT.pom
[JENKINS] Archiving
<https://builds.apache.org/job/Struts-JDK6-support-2.3/ws/bundles/demo/pom.xml>
to org.apache.struts/struts2-osgi-demo-bundle/2.3.29-SNAPSHOT/struts2-osgi-demo-bundle-2.3.29-SNAPSHOT.pom
[JENKINS] Archiving
<https://builds.apache.org/job/Struts-JDK6-support-2.3/ws/plugins/portlet-tiles/pom.xml>
to org.apache.struts/struts2-portlet-tiles-plugin/2.3.29-SNAPSHOT/struts2-portlet-tiles-plugin-2.3.29-SNAPSHOT.pom
[JENKINS] Archiving
<https://builds.apache.org/job/Struts-JDK6-support-2.3/ws/plugins/jasperreports/pom.xml>
to org.apache.struts/struts2-jasperreports-plugin/2.3.29-SNAPSHOT/struts2-jasperreports-plugin-2.3.29-SNAPSHOT.pom
[JENKINS] Archiving
<https://builds.apache.org/job/Struts-JDK6-support-2.3/ws/plugins/oval/pom.xml>
to org.apache.struts/struts2-oval-plugin/2.3.29-SNAPSHOT/struts2-oval-plugin-2.3.29-SNAPSHOT.pom
[JENKINS] Archiving
<https://builds.apache.org/job/Struts-JDK6-support-2.3/ws/plugins/tiles3/pom.xml>
to org.apache.struts/struts2-tiles3-plugin/2.3.29-SNAPSHOT/struts2-tiles3-plugin-2.3.29-SNAPSHOT.pom
[JENKINS] Archiving
<https://builds.apache.org/job/Struts-JDK6-support-2.3/ws/xwork-core/pom.xml>
to org.apache.struts.xwork/xwork-core/2.3.29-SNAPSHOT/xwork-core-2.3.29-SNAPSHOT.pom
[JENKINS] Archiving
<https://builds.apache.org/job/Struts-JDK6-support-2.3/ws/xwork-core/target/xwork-core-2.3.29-SNAPSHOT.jar>
to org.apache.struts.xwork/xwork-core/2.3.29-SNAPSHOT/xwork-core-2.3.29-SNAPSHOT.jar
[JENKINS] Archiving
<https://builds.apache.org/job/Struts-JDK6-support-2.3/ws/xwork-core/target/xwork-core-2.3.29-SNAPSHOT-sources.jar>
to org.apache.struts.xwork/xwork-core/2.3.29-SNAPSHOT/xwork-core-2.3.29-SNAPSHOT-sources.jar
[JENKINS] Archiving
<https://builds.apache.org/job/Struts-JDK6-support-2.3/ws/xwork-core/target/xwork-core-2.3.29-SNAPSHOT-javadoc.jar>
to org.apache.struts.xwork/xwork-core/2.3.29-SNAPSHOT/xwork-core-2.3.29-SNAPSHOT-javadoc.jar
[JENKINS] Archiving
<https://builds.apache.org/job/Struts-JDK6-support-2.3/ws/apps/jboss-blank/pom.xml>
to org.apache.struts/struts2-jboss-blank/2.3.29-SNAPSHOT/struts2-jboss-blank-2.3.29-SNAPSHOT.pom
[JENKINS] Archiving
<https://builds.apache.org/job/Struts-JDK6-support-2.3/ws/plugins/cdi/pom.xml>
to org.apache.struts/struts2-cdi-plugin/2.3.29-SNAPSHOT/struts2-cdi-plugin-2.3.29-SNAPSHOT.pom
[JENKINS] Archiving
<https://builds.apache.org/job/Struts-JDK6-support-2.3/ws/core/pom.xml>
to org.apache.struts/struts2-core/2.3.29-SNAPSHOT/struts2-core-2.3.29-SNAPSHOT.pom
[JENKINS] Archiving
<https://builds.apache.org/job/Struts-JDK6-support-2.3/ws/core/target/struts2-core-2.3.29-SNAPSHOT-sources.jar>
to org.apache.struts/struts2-core/2.3.29-SNAPSHOT/struts2-core-2.3.29-SNAPSHOT-sources.jar
[JENKINS] Archiving
<https://builds.apache.org/job/Struts-JDK6-support-2.3/ws/core/target/struts2-core-2.3.29-SNAPSHOT-javadoc.jar>
to org.apache.struts/struts2-core/2.3.29-SNAPSHOT/struts2-core-2.3.29-SNAPSHOT-javadoc.jar
[JENKINS] Archiving
<https://builds.apache.org/job/Struts-JDK6-support-2.3/ws/plugins/tiles/pom.xml>
to org.apache.struts/struts2-tiles-plugin/2.3.29-SNAPSHOT/struts2-tiles-plugin-2.3.29-SNAPSHOT.pom
[JENKINS] Archiving
<https://builds.apache.org/job/Struts-JDK6-support-2.3/ws/archetypes/struts2-archetype-dbportlet/pom.xml>
to org.apache.struts/struts2-archetype-dbportlet/2.3.29-SNAPSHOT/struts2-archetype-dbportlet-2.3.29-SNAPSHOT.pom
[JENKINS] Archiving
<https://builds.apache.org/job/Struts-JDK6-support-2.3/ws/archetypes/pom.xml>
to org.apache.struts/struts2-archetypes/2.3.29-SNAPSHOT/struts2-archetypes-2.3.29-SNAPSHOT.pom
[JENKINS] Archiving
<https://builds.apache.org/job/Struts-JDK6-support-2.3/ws/bom/pom.xml>
to org.apache.struts/struts2-bom/2.3.29-SNAPSHOT/struts2-bom-2.3.29-SNAPSHOT.pom
[JENKINS] Archiving
<https://builds.apache.org/job/Struts-JDK6-support-2.3/ws/plugins/embeddedjsp/pom.xml>
to org.apache.struts/struts2-embeddedjsp-plugin/2.3.29-SNAPSHOT/struts2-embeddedjsp-plugin-2.3.29-SNAPSHOT.pom
[JENKINS] Archiving
<https://builds.apache.org/job/Struts-JDK6-support-2.3/ws/plugins/javatemplates/pom.xml>
to org.apache.struts/struts2-javatemplates-plugin/2.3.29-SNAPSHOT/struts2-javatemplates-plugin-2.3.29-SNAPSHOT.pom
[JENKINS] Archiving
<https://builds.apache.org/job/Struts-JDK6-support-2.3/ws/apps/rest-showcase/pom.xml>
to org.apache.struts/struts2-rest-showcase/2.3.29-SNAPSHOT/struts2-rest-showcase-2.3.29-SNAPSHOT.pom
[JENKINS] Archiving
<https://builds.apache.org/job/Struts-JDK6-support-2.3/ws/bundles/admin/pom.xml>
to org.apache.struts/struts2-osgi-admin-bundle/2.3.29-SNAPSHOT/struts2-osgi-admin-bundle-2.3.29-SNAPSHOT.pom
[JENKINS] Archiving
<https://builds.apache.org/job/Struts-JDK6-support-2.3/ws/apps/pom.xml>
to org.apache.struts/struts2-apps/2.3.29-SNAPSHOT/struts2-apps-2.3.29-SNAPSHOT.pom
[JENKINS] Archiving
<https://builds.apache.org/job/Struts-JDK6-support-2.3/ws/plugins/json/pom.xml>
to org.apache.struts/struts2-json-plugin/2.3.29-SNAPSHOT/struts2-json-plugin-2.3.29-SNAPSHOT.pom
[JENKINS] Archiving
<https://builds.apache.org/job/Struts-JDK6-support-2.3/ws/plugins/junit/pom.xml>
to org.apache.struts/struts2-junit-plugin/2.3.29-SNAPSHOT/struts2-junit-plugin-2.3.29-SNAPSHOT.pom
[JENKINS] Archiving
<https://builds.apache.org/job/Struts-JDK6-support-2.3/ws/archetypes/struts2-archetype-plugin/pom.xml>
to org.apache.struts/struts2-archetype-plugin/2.3.29-SNAPSHOT/struts2-archetype-plugin-2.3.29-SNAPSHOT.pom
[JENKINS] Archiving
<https://builds.apache.org/job/Struts-JDK6-support-2.3/ws/apps/mailreader/pom.xml>
to org.apache.struts/struts2-mailreader/2.3.29-SNAPSHOT/struts2-mailreader-2.3.29-SNAPSHOT.pom
[JENKINS] Archiving
<https://builds.apache.org/job/Struts-JDK6-support-2.3/ws/archetypes/struts2-archetype-angularjs/pom.xml>
to org.apache.struts/struts2-archetype-angularjs/2.3.29-SNAPSHOT/struts2-archetype-angularjs-2.3.29-SNAPSHOT.pom
[JENKINS] Archiving
<https://builds.apache.org/job/Struts-JDK6-support-2.3/ws/plugins/plexus/pom.xml>
to org.apache.struts/struts2-plexus-plugin/2.3.29-SNAPSHOT/struts2-plexus-plugin-2.3.29-SNAPSHOT.pom
[JENKINS] Archiving
<https://builds.apache.org/job/Struts-JDK6-support-2.3/ws/plugins/jsf/pom.xml>
to org.apache.struts/struts2-jsf-plugin/2.3.29-SNAPSHOT/struts2-jsf-plugin-2.3.29-SNAPSHOT.pom
[JENKINS] Archiving
<https://builds.apache.org/job/Struts-JDK6-support-2.3/ws/plugins/config-browser/pom.xml>
to org.apache.struts/struts2-config-browser-plugin/2.3.29-SNAPSHOT/struts2-config-browser-plugin-2.3.29-SNAPSHOT.pom
[JENKINS] Archiving
<https://builds.apache.org/job/Struts-JDK6-support-2.3/ws/plugins/struts1/pom.xml>
to org.apache.struts/struts2-struts1-plugin/2.3.29-SNAPSHOT/struts2-struts1-plugin-2.3.29-SNAPSHOT.pom
[JENKINS] Archiving
<https://builds.apache.org/job/Struts-JDK6-support-2.3/ws/archetypes/struts2-archetype-blank/pom.xml>
to org.apache.struts/struts2-archetype-blank/2.3.29-SNAPSHOT/struts2-archetype-blank-2.3.29-SNAPSHOT.pom
[JENKINS] Archiving
<https://builds.apache.org/job/Struts-JDK6-support-2.3/ws/plugins/gxp/pom.xml>
to org.apache.struts/struts2-gxp-plugin/2.3.29-SNAPSHOT/struts2-gxp-plugin-2.3.29-SNAPSHOT.pom
[JENKINS] Archiving
<https://builds.apache.org/job/Struts-JDK6-support-2.3/ws/plugins/convention/pom.xml>
to org.apache.struts/struts2-convention-plugin/2.3.29-SNAPSHOT/struts2-convention-plugin-2.3.29-SNAPSHOT.pom
[JENKINS] Archiving
<https://builds.apache.org/job/Struts-JDK6-support-2.3/ws/bundles/pom.xml>
to org.apache.struts/struts2-osgi-bundles/2.3.29-SNAPSHOT/struts2-osgi-bundles-2.3.29-SNAPSHOT.pom
[JENKINS] Archiving
<https://builds.apache.org/job/Struts-JDK6-support-2.3/ws/pom.xml> to
org.apache.struts/struts2-parent/2.3.29-SNAPSHOT/struts2-parent-2.3.29-SNAPSHOT.pom
[JENKINS] Archiving
<https://builds.apache.org/job/Struts-JDK6-support-2.3/ws/target/struts2-parent-2.3.29-SNAPSHOT-site.xml>
to org.apache.struts/struts2-parent/2.3.29-SNAPSHOT/struts2-parent-2.3.29-SNAPSHOT-site.xml
Compressed 41.25 KB of artifacts by 77.6% relative to #1020
[JENKINS] Archiving
<https://builds.apache.org/job/Struts-JDK6-support-2.3/ws/plugins/osgi/pom.xml>
to org.apache.struts/struts2-osgi-plugin/2.3.29-SNAPSHOT/struts2-osgi-plugin-2.3.29-SNAPSHOT.pom
[JENKINS] Archiving
<https://builds.apache.org/job/Struts-JDK6-support-2.3/ws/assembly/pom.xml>
to org.apache.struts/struts2-assembly/2.3.29-SNAPSHOT/struts2-assembly-2.3.29-SNAPSHOT.pom
[JENKINS] Archiving
<https://builds.apache.org/job/Struts-JDK6-support-2.3/ws/plugins/dojo/pom.xml>
to org.apache.struts/struts2-dojo-plugin/2.3.29-SNAPSHOT/struts2-dojo-plugin-2.3.29-SNAPSHOT.pom
[JENKINS] Archiving
<https://builds.apache.org/job/Struts-JDK6-support-2.3/ws/apps/showcase/pom.xml>
to org.apache.struts/struts2-showcase/2.3.29-SNAPSHOT/struts2-showcase-2.3.29-SNAPSHOT.pom
[JENKINS] Archiving
<https://builds.apache.org/job/Struts-JDK6-support-2.3/ws/plugins/rest/pom.xml>
to org.apache.struts/struts2-rest-plugin/2.3.29-SNAPSHOT/struts2-rest-plugin-2.3.29-SNAPSHOT.pom
[JENKINS] Archiving
<https://builds.apache.org/job/Struts-JDK6-support-2.3/ws/archetypes/struts2-archetype-convention/pom.xml>
to org.apache.struts/struts2-archetype-convention/2.3.29-SNAPSHOT/struts2-archetype-convention-2.3.29-SNAPSHOT.pom
[JENKINS] Archiving
<https://builds.apache.org/job/Struts-JDK6-support-2.3/ws/plugins/pom.xml>
to org.apache.struts/struts2-plugins/2.3.29-SNAPSHOT/struts2-plugins-2.3.29-SNAPSHOT.pom
[JENKINS] Archiving
<https://builds.apache.org/job/Struts-JDK6-support-2.3/ws/plugins/sitegraph/pom.xml>
to org.apache.struts/struts2-sitegraph-plugin/2.3.29-SNAPSHOT/struts2-sitegraph-plugin-2.3.29-SNAPSHOT.pom
[JENKINS] Archiving
<https://builds.apache.org/job/Struts-JDK6-support-2.3/ws/apps/portlet/pom.xml>
to org.apache.struts/struts2-portlet/2.3.29-SNAPSHOT/struts2-portlet-2.3.29-SNAPSHOT.pom
[JENKINS] Archiving
<https://builds.apache.org/job/Struts-JDK6-support-2.3/ws/plugins/testng/pom.xml>
to org.apache.struts/struts2-testng-plugin/2.3.29-SNAPSHOT/struts2-testng-plugin-2.3.29-SNAPSHOT.pom
[JENKINS] Archiving
<https://builds.apache.org/job/Struts-JDK6-support-2.3/ws/plugins/dwr/pom.xml>
to org.apache.struts/struts2-dwr-plugin/2.3.29-SNAPSHOT/struts2-dwr-plugin-2.3.29-SNAPSHOT.pom
[JENKINS] Archiving
<https://builds.apache.org/job/Struts-JDK6-support-2.3/ws/plugins/codebehind/pom.xml>
to org.apache.struts/struts2-codebehind-plugin/2.3.29-SNAPSHOT/struts2-codebehind-plugin-2.3.29-SNAPSHOT.pom
[JENKINS] Archiving
<https://builds.apache.org/job/Struts-JDK6-support-2.3/ws/plugins/portlet/pom.xml>
to org.apache.struts/struts2-portlet-plugin/2.3.29-SNAPSHOT/struts2-portlet-plugin-2.3.29-SNAPSHOT.pom
[JENKINS] Archiving
<https://builds.apache.org/job/Struts-JDK6-support-2.3/ws/plugins/spring/pom.xml>
to org.apache.struts/struts2-spring-plugin/2.3.29-SNAPSHOT/struts2-spring-plugin-2.3.29-SNAPSHOT.pom
[JENKINS] Archiving
<https://builds.apache.org/job/Struts-JDK6-support-2.3/ws/apps/blank/pom.xml>
to org.apache.struts/struts2-blank/2.3.29-SNAPSHOT/struts2-blank-2.3.29-SNAPSHOT.pom
[JENKINS] Archiving
<https://builds.apache.org/job/Struts-JDK6-support-2.3/ws/archetypes/struts2-archetype-starter/pom.xml>
to org.apache.struts/struts2-archetype-starter/2.3.29-SNAPSHOT/struts2-archetype-starter-2.3.29-SNAPSHOT.pom
[locks-and-latches] Releasing all the locks
[locks-and-latches] All the locks released
channel stopped
Updating WW-4630

---------------------------------------------------------------------
To unsubscribe, e-mail: dev-unsubscribe@struts.apache.org
For additional commands, e-mail: dev-help@struts.apache.org

Mime
View raw message