www-builds mailing list archives

Site index · List index
Message view « Date » · « Thread »
Top « Date » · « Thread »
From "amareshwarisr ." <amareshw...@gmail.com>
Subject Re: Build failed in Jenkins: Lens-Commit #86
Date Fri, 23 Jan 2015 05:55:50 GMT
Can somebody help us with build failure here? Seems there are disk issues.

Thanks
Amareshwari

On Fri, Jan 23, 2015 at 10:53 AM, Jaideep Dhok <jaideep.dhok@inmobi.com>
wrote:

> Is there some disk issue on the jenkins server?
>
> On Fri, Jan 23, 2015 at 10:49 AM, Apache Jenkins Server <
> jenkins@builds.apache.org> wrote:
>
> > See <https://builds.apache.org/job/Lens-Commit/86/>
> >
> > ------------------------------------------
> > Started by an SCM change
> > Building remotely on solaris1 (Solaris) in workspace <
> > https://builds.apache.org/job/Lens-Commit/ws/>
> > java.io.IOException: Failed to install
> > http://archive.apache.org/dist/maven/binaries/apache-maven-3.0.4-bin.zip
> > to /home/jenkins/tools/maven/apache-maven-3.0.4
> >         at hudson.FilePath.installIfNecessaryFrom(FilePath.java:772)
> >         at
> >
> hudson.tools.DownloadFromUrlInstaller.performInstallation(DownloadFromUrlInstaller.java:70)
> >         at
> > hudson.tools.InstallerTranslator.getToolHome(InstallerTranslator.java:68)
> >         at
> >
> hudson.tools.ToolLocationNodeProperty.getToolHome(ToolLocationNodeProperty.java:107)
> >         at
> > hudson.tools.ToolInstallation.translateFor(ToolInstallation.java:204)
> >         at hudson.tasks.Maven$MavenInstallation.forNode(Maven.java:609)
> >         at
> >
> hudson.maven.MavenModuleSetBuild.getEnvironment(MavenModuleSetBuild.java:182)
> >         at hudson.plugins.git.GitSCM.checkout(GitSCM.java:907)
> >         at
> hudson.model.AbstractProject.checkout(AbstractProject.java:1252)
> >         at
> >
> hudson.model.AbstractBuild$AbstractBuildExecution.defaultCheckout(AbstractBuild.java:615)
> >         at
> > jenkins.scm.SCMCheckoutStrategy.checkout(SCMCheckoutStrategy.java:86)
> >         at
> >
> hudson.model.AbstractBuild$AbstractBuildExecution.run(AbstractBuild.java:524)
> >         at hudson.model.Run.execute(Run.java:1706)
> >         at
> > hudson.maven.MavenModuleSetBuild.run(MavenModuleSetBuild.java:529)
> >         at
> > hudson.model.ResourceController.execute(ResourceController.java:88)
> >         at hudson.model.Executor.run(Executor.java:232)
> > Caused by: java.io.IOException: Failed to mkdirs:
> > /home/jenkins/tools/maven/apache-maven-3.0.4
> >         at hudson.FilePath.mkdirs(FilePath.java:1075)
> >         at hudson.FilePath.installIfNecessaryFrom(FilePath.java:738)
> >         ... 15 more
> > Retrying after 10 seconds
> > java.io.IOException: Failed to install
> > http://archive.apache.org/dist/maven/binaries/apache-maven-3.0.4-bin.zip
> > to /home/jenkins/tools/maven/apache-maven-3.0.4
> >         at hudson.FilePath.installIfNecessaryFrom(FilePath.java:772)
> >         at
> >
> hudson.tools.DownloadFromUrlInstaller.performInstallation(DownloadFromUrlInstaller.java:70)
> >         at
> > hudson.tools.InstallerTranslator.getToolHome(InstallerTranslator.java:68)
> >         at
> >
> hudson.tools.ToolLocationNodeProperty.getToolHome(ToolLocationNodeProperty.java:107)
> >         at
> > hudson.tools.ToolInstallation.translateFor(ToolInstallation.java:204)
> >         at hudson.tasks.Maven$MavenInstallation.forNode(Maven.java:609)
> >         at
> >
> hudson.maven.MavenModuleSetBuild.getEnvironment(MavenModuleSetBuild.java:182)
> >         at hudson.plugins.git.GitSCM.checkout(GitSCM.java:907)
> >         at
> hudson.model.AbstractProject.checkout(AbstractProject.java:1252)
> >         at
> >
> hudson.model.AbstractBuild$AbstractBuildExecution.defaultCheckout(AbstractBuild.java:615)
> >         at
> > jenkins.scm.SCMCheckoutStrategy.checkout(SCMCheckoutStrategy.java:86)
> >         at
> >
> hudson.model.AbstractBuild$AbstractBuildExecution.run(AbstractBuild.java:524)
> >         at hudson.model.Run.execute(Run.java:1706)
> >         at
> > hudson.maven.MavenModuleSetBuild.run(MavenModuleSetBuild.java:529)
> >         at
> > hudson.model.ResourceController.execute(ResourceController.java:88)
> >         at hudson.model.Executor.run(Executor.java:232)
> > Caused by: java.io.IOException: Failed to mkdirs:
> > /home/jenkins/tools/maven/apache-maven-3.0.4
> >         at hudson.FilePath.mkdirs(FilePath.java:1075)
> >         at hudson.FilePath.installIfNecessaryFrom(FilePath.java:738)
> >         ... 15 more
> > Retrying after 10 seconds
> > java.io.IOException: Failed to install
> > http://archive.apache.org/dist/maven/binaries/apache-maven-3.0.4-bin.zip
> > to /home/jenkins/tools/maven/apache-maven-3.0.4
> >         at hudson.FilePath.installIfNecessaryFrom(FilePath.java:772)
> >         at
> >
> hudson.tools.DownloadFromUrlInstaller.performInstallation(DownloadFromUrlInstaller.java:70)
> >         at
> > hudson.tools.InstallerTranslator.getToolHome(InstallerTranslator.java:68)
> >         at
> >
> hudson.tools.ToolLocationNodeProperty.getToolHome(ToolLocationNodeProperty.java:107)
> >         at
> > hudson.tools.ToolInstallation.translateFor(ToolInstallation.java:204)
> >         at hudson.tasks.Maven$MavenInstallation.forNode(Maven.java:609)
> >         at
> >
> hudson.maven.MavenModuleSetBuild.getEnvironment(MavenModuleSetBuild.java:182)
> >         at hudson.plugins.git.GitSCM.checkout(GitSCM.java:907)
> >         at
> hudson.model.AbstractProject.checkout(AbstractProject.java:1252)
> >         at
> >
> hudson.model.AbstractBuild$AbstractBuildExecution.defaultCheckout(AbstractBuild.java:615)
> >         at
> > jenkins.scm.SCMCheckoutStrategy.checkout(SCMCheckoutStrategy.java:86)
> >         at
> >
> hudson.model.AbstractBuild$AbstractBuildExecution.run(AbstractBuild.java:524)
> >         at hudson.model.Run.execute(Run.java:1706)
> >         at
> > hudson.maven.MavenModuleSetBuild.run(MavenModuleSetBuild.java:529)
> >         at
> > hudson.model.ResourceController.execute(ResourceController.java:88)
> >         at hudson.model.Executor.run(Executor.java:232)
> > Caused by: java.io.IOException: Failed to mkdirs:
> > /home/jenkins/tools/maven/apache-maven-3.0.4
> >         at hudson.FilePath.mkdirs(FilePath.java:1075)
> >         at hudson.FilePath.installIfNecessaryFrom(FilePath.java:738)
> >         ... 15 more
> > ERROR: Publisher hudson.plugins.testng.Publisher aborted due to exception
> > java.io.IOException: Failed to install
> > http://archive.apache.org/dist/maven/binaries/apache-maven-3.0.4-bin.zip
> > to /home/jenkins/tools/maven/apache-maven-3.0.4
> >         at hudson.FilePath.installIfNecessaryFrom(FilePath.java:772)
> >         at
> >
> hudson.tools.DownloadFromUrlInstaller.performInstallation(DownloadFromUrlInstaller.java:70)
> >         at
> > hudson.tools.InstallerTranslator.getToolHome(InstallerTranslator.java:68)
> >         at
> >
> hudson.tools.ToolLocationNodeProperty.getToolHome(ToolLocationNodeProperty.java:107)
> >         at
> > hudson.tools.ToolInstallation.translateFor(ToolInstallation.java:204)
> >         at hudson.tasks.Maven$MavenInstallation.forNode(Maven.java:609)
> >         at
> >
> hudson.maven.MavenModuleSetBuild.getEnvironment(MavenModuleSetBuild.java:182)
> >         at hudson.plugins.testng.Publisher.perform(Publisher.java:95)
> >         at
> > hudson.tasks.BuildStepMonitor$1.perform(BuildStepMonitor.java:20)
> >         at
> >
> hudson.model.AbstractBuild$AbstractBuildExecution.perform(AbstractBuild.java:756)
> >         at
> >
> hudson.model.AbstractBuild$AbstractBuildExecution.performAllBuildSteps(AbstractBuild.java:720)
> >         at
> >
> hudson.maven.MavenModuleSetBuild$MavenModuleSetBuildExecution.post2(MavenModuleSetBuild.java:1037)
> >         at
> >
> hudson.model.AbstractBuild$AbstractBuildExecution.post(AbstractBuild.java:669)
> >         at hudson.model.Run.execute(Run.java:1731)
> >         at
> > hudson.maven.MavenModuleSetBuild.run(MavenModuleSetBuild.java:529)
> >         at
> > hudson.model.ResourceController.execute(ResourceController.java:88)
> >         at hudson.model.Executor.run(Executor.java:232)
> > Caused by: java.io.IOException: Failed to mkdirs:
> > /home/jenkins/tools/maven/apache-maven-3.0.4
> >         at hudson.FilePath.mkdirs(FilePath.java:1075)
> >         at hudson.FilePath.installIfNecessaryFrom(FilePath.java:738)
> >         ... 16 more
> >
>
> --
> _____________________________________________________________
> The information contained in this communication is intended solely for the
> use of the individual or entity to whom it is addressed and others
> authorized to receive it. It may contain confidential or legally privileged
> information. If you are not the intended recipient you are hereby notified
> that any disclosure, copying, distribution or taking any action in reliance
> on the contents of this information is strictly prohibited and may be
> unlawful. If you have received this communication in error, please notify
> us immediately by responding to this email and then delete it from your
> system. The firm is neither liable for the proper and complete transmission
> of the information contained in this communication nor for any delay in its
> receipt.
>

Mime
  • Unnamed multipart/alternative (inline, None, 0 bytes)
View raw message