www-builds mailing list archives

Site index · List index
Message view « Date » · « Thread »
Top « Date » · « Thread »
From Robert Munteanu <romb...@apache.org>
Subject Maven build on solaris1 failed: java.io.IOException: error=12, Not enough space
Date Fri, 07 Jun 2013 19:12:41 GMT
Hi,

Sling build #1696 just failed. I've pasted the final stack trace below.

Is there anything we can do or is this a slave problem?

Robert


Waiting for Jenkins to finish collecting data
mavenExecutionResult exceptions not empty
message : Failed to execute goal
org.apache.maven.plugins:maven-source-plugin:2.2.1:jar
(attach-sources) on project org.apache.sling.commons.scheduler:
Execution attach-sources of goal
org.apache.maven.plugins:maven-source-plugin:2.2.1:jar failed.
cause : Execution attach-sources of goal
org.apache.maven.plugins:maven-source-plugin:2.2.1:jar failed.
Stack trace :
org.apache.maven.lifecycle.LifecycleExecutionException: Failed to
execute goal org.apache.maven.plugins:maven-source-plugin:2.2.1:jar
(attach-sources) on project org.apache.sling.commons.scheduler:
Execution attach-sources of goal
org.apache.maven.plugins:maven-source-plugin:2.2.1:jar failed.
        at org.apache.maven.lifecycle.internal.MojoExecutor.execute(MojoExecutor.java:225)
        at org.apache.maven.lifecycle.internal.MojoExecutor.execute(MojoExecutor.java:153)
        at org.apache.maven.lifecycle.internal.MojoExecutor.execute(MojoExecutor.java:145)
        at org.apache.maven.lifecycle.internal.LifecycleModuleBuilder.buildProject(LifecycleModuleBuilder.java:84)
        at org.apache.maven.lifecycle.internal.LifecycleModuleBuilder.buildProject(LifecycleModuleBuilder.java:59)
        at org.apache.maven.lifecycle.internal.LifecycleStarter.singleThreadedBuild(LifecycleStarter.java:183)
        at org.apache.maven.lifecycle.internal.LifecycleStarter.execute(LifecycleStarter.java:161)
        at org.apache.maven.DefaultMaven.doExecute(DefaultMaven.java:320)
        at org.apache.maven.DefaultMaven.execute(DefaultMaven.java:156)
        at org.jvnet.hudson.maven3.launcher.Maven3Launcher.main(Maven3Launcher.java:79)
        at sun.reflect.NativeMethodAccessorImpl.invoke0(Native Method)
        at sun.reflect.NativeMethodAccessorImpl.invoke(NativeMethodAccessorImpl.java:39)
        at sun.reflect.DelegatingMethodAccessorImpl.invoke(DelegatingMethodAccessorImpl.java:25)
        at java.lang.reflect.Method.invoke(Method.java:597)
        at org.codehaus.plexus.classworlds.launcher.Launcher.launchStandard(Launcher.java:329)
        at org.codehaus.plexus.classworlds.launcher.Launcher.launch(Launcher.java:239)
        at org.jvnet.hudson.maven3.agent.Maven3Main.launch(Maven3Main.java:158)
        at hudson.maven.Maven3Builder.call(Maven3Builder.java:100)
        at hudson.maven.Maven3Builder.call(Maven3Builder.java:66)
        at hudson.remoting.UserRequest.perform(UserRequest.java:118)
        at hudson.remoting.UserRequest.perform(UserRequest.java:48)
        at hudson.remoting.Request$2.run(Request.java:326)
        at hudson.remoting.InterceptingExecutorService$1.call(InterceptingExecutorService.java:72)
        at java.util.concurrent.FutureTask$Sync.innerRun(FutureTask.java:303)
        at java.util.concurrent.FutureTask.run(FutureTask.java:138)
        at java.util.concurrent.ThreadPoolExecutor$Worker.runTask(ThreadPoolExecutor.java:886)
        at java.util.concurrent.ThreadPoolExecutor$Worker.run(ThreadPoolExecutor.java:908)
        at java.lang.Thread.run(Thread.java:662)
Caused by: org.apache.maven.plugin.PluginExecutionException: Execution
attach-sources of goal
org.apache.maven.plugins:maven-source-plugin:2.2.1:jar failed.
        at org.apache.maven.plugin.DefaultBuildPluginManager.executeMojo(DefaultBuildPluginManager.java:110)
        at org.apache.maven.lifecycle.internal.MojoExecutor.execute(MojoExecutor.java:209)
        ... 27 more
Caused by: java.lang.reflect.UndeclaredThrowableException
        at org.codehaus.plexus.archiver.AbstractArchiver.getFiles(AbstractArchiver.java:576)
        at org.apache.maven.plugin.source.AbstractSourceJarMojo.packageSources(AbstractSourceJarMojo.java:270)
        at org.apache.maven.plugin.source.AbstractSourceJarMojo.packageSources(AbstractSourceJarMojo.java:240)
        at org.apache.maven.plugin.source.AbstractSourceJarMojo.execute(AbstractSourceJarMojo.java:209)
        at org.apache.maven.plugin.DefaultBuildPluginManager.executeMojo(DefaultBuildPluginManager.java:101)
        ... 28 more
Caused by: org.codehaus.plexus.archiver.ArchiverException: Failed to
quote directory:
'<https://builds.apache.org/job/sling-trunk-1.6/ws/trunk/bundles/commons/scheduler/target/maven-shared-archive-resources'>
        at org.codehaus.plexus.archiver.AbstractArchiver$1.hasNext(AbstractArchiver.java:472)
        at org.codehaus.plexus.archiver.AbstractArchiver.getFiles(AbstractArchiver.java:564)
        ... 32 more
Caused by: java.io.IOException: Failed to quote directory:
'<https://builds.apache.org/job/sling-trunk-1.6/ws/trunk/bundles/commons/scheduler/target/maven-shared-archive-resources'>
        at org.codehaus.plexus.components.io.attributes.PlexusIoResourceAttributeUtils.getFileAttributesByPath(PlexusIoResourceAttributeUtils.java:253)
        at org.codehaus.plexus.components.io.attributes.PlexusIoResourceAttributeUtils.getFileAttributesByPath(PlexusIoResourceAttributeUtils.java:192)
        at org.codehaus.plexus.components.io.resources.PlexusIoFileResourceCollection.getResources(PlexusIoFileResourceCollection.java:189)
        at org.codehaus.plexus.archiver.AbstractArchiver$1.hasNext(AbstractArchiver.java:468)
        ... 33 more
Caused by: org.codehaus.plexus.util.cli.CommandLineException: Error
while executing process.
        at org.codehaus.plexus.util.cli.Commandline.execute(Commandline.java:656)
        at org.codehaus.plexus.util.cli.CommandLineUtils.executeCommandLineAsCallable(CommandLineUtils.java:141)
        at org.codehaus.plexus.components.io.attributes.PlexusIoResourceAttributeUtils.getFileAttributesByPath(PlexusIoResourceAttributeUtils.java:244)
        ... 36 more
Caused by: java.io.IOException: Cannot run program "/bin/sh":
error=12, Not enough space
        at java.lang.ProcessBuilder.start(ProcessBuilder.java:460)
        at java.lang.Runtime.exec(Runtime.java:593)
        at java.lang.Runtime.exec(Runtime.java:509)
        at org.codehaus.plexus.util.cli.Commandline.execute(Commandline.java:636)
        ... 38 more
Caused by: java.io.IOException: error=12, Not enough space
        at java.lang.UNIXProcess.forkAndExec(Native Method)
        at java.lang.UNIXProcess.<init>(UNIXProcess.java:53)
        at java.lang.ProcessImpl.start(ProcessImpl.java:65)
        at java.lang.ProcessBuilder.start(ProcessBuilder.java:453)
        ... 41 more
Sending e-mails to: dev@sling.apache.org
channel stopped

Mime
View raw message