www-builds mailing list archives

Site index · List index
Message view « Date » · « Thread »
Top « Date » · « Thread »
From Olivier Lamy <ol...@apache.org>
Subject Re: Corrupt asm m2 cache (was: Build failed in Jenkins: Hcatalog-trunk-build #261)
Date Thu, 06 Sep 2012 19:16:29 GMT
jenkins@asf011:~$ unzip -l /home/jenkins/.m2/repository/asm/asm/3.1/asm-3.1.jar
Archive:  /home/jenkins/.m2/repository/asm/asm/3.1/asm-3.1.jar
  End-of-central-directory signature not found.  Either this file is not
  a zipfile, or it constitutes one disk of a multi-part archive.  In the
  latter case the central directory and zipfile comment will be found on
  the last disk(s) of this archive.
unzip:  cannot find zipfile directory in one of
/home/jenkins/.m2/repository/asm/asm/3.1/asm-3.1.jar or
        /home/jenkins/.m2/repository/asm/asm/3.1/asm-3.1.jar.zip, and
cannot find /home/jenkins/.m2/repository/asm/asm/3.1/asm-3.1.jar.ZIP,
period.

Yup bad file.
Maybe some concurrent access with other builds when downloading the
file. (I don't all the story)
You must probably use your own local repository something like
$WORSPACE/.repository to avoid such issue.

I have cleaned m2 repo on nodes and scheduled a new build.
We will see if that fix  the issue.

2012/9/6 Travis Crawford <traviscrawford@gmail.com>:
> [to += builds]
>
> Hey build gurus -
>
> The HCatalog trunk build is failing due to what looks like a corrupt asm
> maven cache. Can someone with knowledge of the build machine help us out?
>
> The build fails while trying to unzip this file. It would be interesting to
> see if its actually a proper jar file.
>
> /home/jenkins/.m2/repository/asm/asm/3.1/asm-3.1.jar
>
> The build also gives a warning that its pom file (I think it would be the
> file below) is invalid. It would be interesting to see if its a proper pom
> file.
>
> /home/jenkins/.m2/repository/asm/asm/3.1/asm-3.1.pom
>
>
>
> Here's the interesting part copy/pasted from the build log:
>
> mvn-dependencies:
> *[artifact:dependencies] [WARNING] POM for 'asm:asm:pom:3.1:compile' is
> invalid.
> *[artifact:dependencies]
> [artifact:dependencies] Its dependencies (if any) will NOT be available to
> the current build.
> [artifact:dependencies] [INFO] snapshot
> org.apache.hive:hive-builtins:0.10.0-SNAPSHOT: checking for updates from
> datanucleus
> [artifact:dependencies] [INFO] snapshot
> org.apache.hive:hive-builtins:0.10.0-SNAPSHOT: checking for updates from
> Nexus
> [artifact:dependencies] [INFO] snapshot
> org.apache.hive:hive-metastore:0.10.0-SNAPSHOT: checking for updates from
> datanucleus
> [artifact:dependencies] [INFO] snapshot
> org.apache.hive:hive-metastore:0.10.0-SNAPSHOT: checking for updates from
> Nexus
> [artifact:dependencies] [INFO] artifact asm:asm: checking for updates from
> datanucleus
> [artifact:dependencies] [INFO] artifact asm:asm: checking for updates from
> local.repository
> [artifact:dependencies] [INFO] artifact asm:asm: checking for updates from
> DN_M2_Repo
> [artifact:dependencies] [INFO] artifact asm:asm: checking for updates from
> central
> [artifact:dependencies] [INFO] snapshot
> org.apache.hive:hive-common:0.10.0-SNAPSHOT: checking for updates from
> datanucleus
> [artifact:dependencies] [INFO] snapshot
> org.apache.hive:hive-common:0.10.0-SNAPSHOT: checking for updates from Nexus
> [artifact:dependencies] [INFO] snapshot
> org.apache.hive:hive-exec:0.10.0-SNAPSHOT: checking for updates from
> datanucleus
> [artifact:dependencies] [INFO] snapshot
> org.apache.hive:hive-exec:0.10.0-SNAPSHOT: checking for updates from Nexus
> [artifact:dependencies] [INFO] snapshot
> org.apache.hive:hive-shims:0.10.0-SNAPSHOT: checking for updates from
> datanucleus
> [artifact:dependencies] [INFO] snapshot
> org.apache.hive:hive-shims:0.10.0-SNAPSHOT: checking for updates from Nexus
> [artifact:dependencies] [INFO] snapshot
> org.apache.hive:hive-cli:0.10.0-SNAPSHOT: checking for updates from
> datanucleus
> [artifact:dependencies] [INFO] snapshot
> org.apache.hive:hive-cli:0.10.0-SNAPSHOT: checking for updates from Nexus
> [artifact:dependencies] [INFO] snapshot
> org.apache.hive:hive-hbase-handler:0.10.0-SNAPSHOT: checking for updates
> from datanucleus
> [artifact:dependencies] [INFO] snapshot
> org.apache.hive:hive-hbase-handler:0.10.0-SNAPSHOT: checking for updates
> from Nexus
> [artifact:dependencies] [WARNING] POM for 'asm:asm:pom:3.1:compile' is
> invalid.
> [artifact:dependencies]
> [artifact:dependencies] Its dependencies (if any) will NOT be available to
> the current build.
>
> init:
>     [mkdir] Created dir:
> /home/jenkins/jenkins-slave/workspace/Hcatalog-trunk-build/trunk/storage-handlers/hbase/build/hbase-storage-handler-0.4.0-SNAPSTHOT
>     [mkdir] Created dir:
> /home/jenkins/jenkins-slave/workspace/Hcatalog-trunk-build/trunk/storage-handlers/hbase/build/classes
>     [mkdir] Created dir:
> /home/jenkins/jenkins-slave/workspace/Hcatalog-trunk-build/trunk/storage-handlers/hbase/build/test/classes
>
> compile-src:
>     [javac] Compiling 35 source files to
> /home/jenkins/jenkins-slave/workspace/Hcatalog-trunk-build/trunk/storage-handlers/hbase/build/classes
> *    [javac] error: error reading
> /home/jenkins/.m2/repository/asm/asm/3.1/asm-3.1.jar; error in opening zip
> file
> *    [javac] 1 error
>
>
>
> Thanks!
> Travis, on behalf of the HCatalog team
>
>
>
> On Thu, Sep 6, 2012 at 8:05 AM, Travis Crawford <traviscrawford@gmail.com>
> wrote:
>> Looking...
>>
>> On Thu, Sep 6, 2012 at 4:35 AM, Apache Jenkins Server
>> <jenkins@builds.apache.org> wrote:
>>> See <https://builds.apache.org/job/Hcatalog-trunk-build/261/changes>
>>>
>>> Changes:
>>>
>>> [khorgath] HCATALOG-431 document hcat type to java class/pig type
> mapping (lefty via khorgath)
>>>
>>> [khorgath] HCATALOG-492 Document CTAS workaround for Hive with JSON
> serde (lefty via khorgath)
>>>
>>> ------------------------------------------
>>> [...truncated 1869 lines...]
>>> [ivy:retrieve] .. (0kB)
>>> [ivy:retrieve]  [SUCCESSFUL ] com.google.guava#guava;r09!guava.jar (35ms)
>>> [ivy:retrieve] downloading
> /home/jenkins/.m2/repository/com/sun/jersey/jersey-core/1.8/jersey-core-1.8.jar
> ...
>>> [ivy:retrieve] ........ (447kB)
>>> [ivy:retrieve] .. (0kB)
>>> [ivy:retrieve]  [SUCCESSFUL ]
> com.sun.jersey#jersey-core;1.8!jersey-core.jar(bundle) (14ms)
>>> [ivy:retrieve] downloading
> /home/jenkins/.m2/repository/com/sun/jersey/jersey-json/1.8/jersey-json-1.8.jar
> ...
>>> [ivy:retrieve] .... (144kB)
>>> [ivy:retrieve] .. (0kB)
>>> [ivy:retrieve]  [SUCCESSFUL ]
> com.sun.jersey#jersey-json;1.8!jersey-json.jar(bundle) (24ms)
>>> [ivy:retrieve] downloading
> /home/jenkins/.m2/repository/com/sun/jersey/jersey-server/1.8/jersey-server-1.8.jar
> ...
>>> [ivy:retrieve] ............ (678kB)
>>> [ivy:retrieve] .. (0kB)
>>> [ivy:retrieve]  [SUCCESSFUL ]
> com.sun.jersey#jersey-server;1.8!jersey-server.jar(bundle) (44ms)
>>> [ivy:retrieve] downloading
> /home/jenkins/.m2/repository/javax/servlet/jsp/jsp-api/2.1/jsp-api-2.1.jar
> ...
>>> [ivy:retrieve] ... (98kB)
>>> [ivy:retrieve] .. (0kB)
>>> [ivy:retrieve]  [SUCCESSFUL ] javax.servlet.jsp#jsp-api;2.1!jsp-api.jar
> (126ms)
>>> [ivy:retrieve] downloading
> /home/jenkins/.m2/repository/commons-logging/commons-logging-api/1.1/commons-logging-api-1.1.jar
> ...
>>> [ivy:retrieve] .. (43kB)
>>> [ivy:retrieve] .. (0kB)
>>> [ivy:retrieve]  [SUCCESSFUL ]
> commons-logging#commons-logging-api;1.1!commons-logging-api.jar (60ms)
>>> [ivy:retrieve] downloading
> /home/jenkins/.m2/repository/log4j/log4j/1.2.15/log4j-1.2.15.jar ...
>>> [ivy:retrieve] ....... (382kB)
>>> [ivy:retrieve] .. (0kB)
>>> [ivy:retrieve]  [SUCCESSFUL ] log4j#log4j;1.2.15!log4j.jar (15ms)
>>> [ivy:retrieve] downloading
> /home/jenkins/.m2/repository/net/java/dev/jets3t/jets3t/0.6.1/jets3t-0.6.1.jar
> ...
>>> [ivy:retrieve] ...... (314kB)
>>> [ivy:retrieve] .. (0kB)
>>> [ivy:retrieve]  [SUCCESSFUL ]
> net.java.dev.jets3t#jets3t;0.6.1!jets3t.jar (12ms)
>>> [ivy:retrieve] downloading
> http://repo2.maven.org/maven2/hsqldb/hsqldb/1.8.0.7/hsqldb-1.8.0.7.jar ...
>>> [ivy:retrieve]
> ..........................................................................................
> (628kB)
>>> [ivy:retrieve] .. (0kB)
>>> [ivy:retrieve]  [SUCCESSFUL ] hsqldb#hsqldb;1.8.0.7!hsqldb.jar (26ms)
>>> [ivy:retrieve] downloading
> /home/jenkins/.m2/repository/org/aspectj/aspectjrt/1.6.5/aspectjrt-1.6.5.jar
> ...
>>> [ivy:retrieve] ... (113kB)
>>> [ivy:retrieve] .. (0kB)
>>> [ivy:retrieve]  [SUCCESSFUL ] org.aspectj#aspectjrt;1.6.5!aspectjrt.jar
> (16ms)
>>> [ivy:retrieve] downloading
> http://repo2.maven.org/maven2/org/apache/hadoop/hadoop-auth/0.23.1/hadoop-auth-0.23.1.jar...
>>> [ivy:retrieve] .... (41kB)
>>> [ivy:retrieve] .. (0kB)
>>> [ivy:retrieve]  [SUCCESSFUL ]
> org.apache.hadoop#hadoop-auth;0.23.1!hadoop-auth.jar (13ms)
>>> [ivy:retrieve] downloading
> /home/jenkins/.m2/repository/com/googlecode/json-simple/json-simple/1.1/json-simple-1.1.jar
> ...
>>> [ivy:retrieve] .. (15kB)
>>> [ivy:retrieve] .. (0kB)
>>> [ivy:retrieve]  [SUCCESSFUL ]
> com.googlecode.json-simple#json-simple;1.1!json-simple.jar (51ms)
>>> [ivy:retrieve] downloading
> /home/jenkins/.m2/repository/com/sun/xml/bind/jaxb-impl/2.2.3-1/jaxb-impl-2.2.3-1.jar
> ...
>>> [ivy:retrieve] ............... (869kB)
>>> [ivy:retrieve] .. (0kB)
>>> [ivy:retrieve]  [SUCCESSFUL ]
> com.sun.xml.bind#jaxb-impl;2.2.3-1!jaxb-impl.jar (24ms)
>>> [ivy:retrieve] downloading
> http://repo2.maven.org/maven2/org/codehaus/jackson/jackson-core-asl/1.7.1/jackson-core-asl-1.7.1.jar...
>>> [ivy:retrieve] ....... (202kB)
>>> [ivy:retrieve] .. (0kB)
>>> [ivy:retrieve]  [SUCCESSFUL ]
> org.codehaus.jackson#jackson-core-asl;1.7.1!jackson-core-asl.jar (93ms)
>>> [ivy:retrieve] downloading
> http://repo2.maven.org/maven2/org/codehaus/jackson/jackson-jaxrs/1.7.1/jackson-jaxrs-1.7.1.jar...
>>> [ivy:retrieve] ... (17kB)
>>> [ivy:retrieve] .. (0kB)
>>> [ivy:retrieve]  [SUCCESSFUL ]
> org.codehaus.jackson#jackson-jaxrs;1.7.1!jackson-jaxrs.jar (14ms)
>>> [ivy:retrieve] downloading
> http://repo2.maven.org/maven2/org/codehaus/jackson/jackson-xc/1.7.1/jackson-xc-1.7.1.jar...
>>> [ivy:retrieve] ... (30kB)
>>> [ivy:retrieve] .. (0kB)
>>> [ivy:retrieve]  [SUCCESSFUL ]
> org.codehaus.jackson#jackson-xc;1.7.1!jackson-xc.jar (16ms)
>>> [ivy:retrieve] downloading
> /home/jenkins/.m2/repository/javax/xml/bind/jaxb-api/2.2.2/jaxb-api-2.2.2.jar
> ...
>>> [ivy:retrieve] ... (102kB)
>>> [ivy:retrieve] .. (0kB)
>>> [ivy:retrieve]  [SUCCESSFUL ] javax.xml.bind#jaxb-api;2.2.2!jaxb-api.jar
> (188ms)
>>> [ivy:retrieve] downloading
> http://repo2.maven.org/maven2/org/jboss/netty/netty/3.2.3.Final/netty-3.2.3.Final.jar...
>>> [ivy:retrieve]
> .....................................................................
> (767kB)
>>> [ivy:retrieve] .. (0kB)
>>> [ivy:retrieve]  [SUCCESSFUL ]
> org.jboss.netty#netty;3.2.3.Final!netty.jar(bundle) (34ms)
>>> [ivy:retrieve] downloading
> http://repo2.maven.org/maven2/org/apache/hadoop/hadoop-annotations/0.23.1/hadoop-annotations-0.23.1.jar...
>>> [ivy:retrieve] .... (16kB)
>>> [ivy:retrieve] .. (0kB)
>>> [ivy:retrieve]  [SUCCESSFUL ]
> org.apache.hadoop#hadoop-annotations;0.23.1!hadoop-annotations.jar (16ms)
>>> [ivy:retrieve] downloading
> /home/jenkins/.m2/repository/org/apache/ant/ant/1.8.1/ant-1.8.1.jar ...
>>> [ivy:retrieve] ......................... (1478kB)
>>> [ivy:retrieve] .. (0kB)
>>> [ivy:retrieve]  [SUCCESSFUL ] org.apache.ant#ant;1.8.1!ant.jar (46ms)
>>> [ivy:retrieve] downloading
> /home/jenkins/.m2/repository/jdiff/jdiff/1.0.9/jdiff-1.0.9.jar ...
>>> [ivy:retrieve] ... (126kB)
>>> [ivy:retrieve] .. (0kB)
>>> [ivy:retrieve]  [SUCCESSFUL ] jdiff#jdiff;1.0.9!jdiff.jar (11ms)
>>> [ivy:retrieve] downloading
> /home/jenkins/.m2/repository/org/apache/ant/ant-launcher/1.8.1/ant-launcher-1.8.1.jar
> ...
>>> [ivy:retrieve] .. (12kB)
>>> [ivy:retrieve] .. (0kB)
>>> [ivy:retrieve]  [SUCCESSFUL ]
> org.apache.ant#ant-launcher;1.8.1!ant-launcher.jar (9ms)
>>> [ivy:retrieve] downloading
> http://repo2.maven.org/maven2/org/apache/hadoop/hadoop-yarn-common/0.23.1/hadoop-yarn-common-0.23.1.jar...
>>> [ivy:retrieve]
> ................................................................................................................
> (1056kB)
>>> [ivy:retrieve] .. (0kB)
>>> [ivy:retrieve]  [SUCCESSFUL ]
> org.apache.hadoop#hadoop-yarn-common;0.23.1!hadoop-yarn-common.jar (45ms)
>>> [ivy:retrieve] downloading
> /home/jenkins/.m2/repository/com/google/inject/extensions/guice-servlet/3.0/guice-servlet-3.0.jar
> ...
>>> [ivy:retrieve] .. (63kB)
>>> [ivy:retrieve] .. (0kB)
>>> [ivy:retrieve]  [SUCCESSFUL ]
> com.google.inject.extensions#guice-servlet;3.0!guice-servlet.jar (3ms)
>>> [ivy:retrieve] downloading
> /home/jenkins/.m2/repository/junit/junit/4.8.2/junit-4.8.2.jar ...
>>> [ivy:retrieve] ..... (231kB)
>>> [ivy:retrieve] .. (0kB)
>>> [ivy:retrieve]  [SUCCESSFUL ] junit#junit;4.8.2!junit.jar (16ms)
>>> [ivy:retrieve] downloading
> /home/jenkins/.m2/repository/com/cenqua/clover/clover/3.0.2/clover-3.0.2.jar
> ...
>>> [ivy:retrieve]
> ....................................................................................................................................................................................
> (11446kB)
>>> [ivy:retrieve] .. (0kB)
>>> [ivy:retrieve]  [SUCCESSFUL ] com.cenqua.clover#clover;3.0.2!clover.jar
> (159ms)
>>> [ivy:retrieve] downloading
> http://repo2.maven.org/maven2/org/apache/hadoop/hadoop-yarn-api/0.23.1/hadoop-yarn-api-0.23.1.jar...
>>> [ivy:retrieve]
> .........................................................................................
> (870kB)
>>> [ivy:retrieve] .. (0kB)
>>> [ivy:retrieve]  [SUCCESSFUL ]
> org.apache.hadoop#hadoop-yarn-api;0.23.1!hadoop-yarn-api.jar (34ms)
>>> [ivy:retrieve] downloading
> /home/jenkins/.m2/repository/commons-io/commons-io/2.1/commons-io-2.1.jar
> ...
>>> [ivy:retrieve] .... (159kB)
>>> [ivy:retrieve] .. (0kB)
>>> [ivy:retrieve]  [SUCCESSFUL ] commons-io#commons-io;2.1!commons-io.jar
> (12ms)
>>> [ivy:retrieve] downloading
> /home/jenkins/.m2/repository/com/google/inject/guice/3.0/guice-3.0.jar ...
>>> [ivy:retrieve] ............ (693kB)
>>> [ivy:retrieve] .. (0kB)
>>> [ivy:retrieve]  [SUCCESSFUL ] com.google.inject#guice;3.0!guice.jar
> (22ms)
>>> [ivy:retrieve] downloading
> /home/jenkins/.m2/repository/com/sun/jersey/jersey-test-framework/jersey-test-framework-grizzly2/1.8/jersey-test-framework-grizzly2-1.8.jar
> ...
>>> [ivy:retrieve] .. (12kB)
>>> [ivy:retrieve] .. (0kB)
>>> [ivy:retrieve]  [SUCCESSFUL ]
> com.sun.jersey.jersey-test-framework#jersey-test-framework-grizzly2;1.8!jersey-test-framework-grizzly2.jar
> (11ms)
>>> [ivy:retrieve] downloading
> /home/jenkins/.m2/repository/com/sun/jersey/contribs/jersey-guice/1.8/jersey-guice-1.8.jar
> ...
>>> [ivy:retrieve] .. (14kB)
>>> [ivy:retrieve] .. (0kB)
>>> [ivy:retrieve]  [SUCCESSFUL ]
> com.sun.jersey.contribs#jersey-guice;1.8!jersey-guice.jar (3ms)
>>> [ivy:retrieve] downloading
> /home/jenkins/.m2/repository/javax/inject/javax.inject/1/javax.inject-1.jar
> ...
>>> [ivy:retrieve] .. (2kB)
>>> [ivy:retrieve] .. (0kB)
>>> [ivy:retrieve]  [SUCCESSFUL ]
> javax.inject#javax.inject;1!javax.inject.jar (14ms)
>>> [ivy:retrieve] downloading
> /home/jenkins/.m2/repository/aopalliance/aopalliance/1.0/aopalliance-1.0.jar
> ...
>>> [ivy:retrieve] .. (4kB)
>>> [ivy:retrieve] .. (0kB)
>>> [ivy:retrieve]  [SUCCESSFUL ]
> aopalliance#aopalliance;1.0!aopalliance.jar (14ms)
>>> [ivy:retrieve] downloading
> http://repo2.maven.org/maven2/org/sonatype/sisu/inject/cglib/2.2.1-v20090111/cglib-2.2.1-v20090111.jar...
>>> [ivy:retrieve] ........ (272kB)
>>> [ivy:retrieve] .. (0kB)
>>> [ivy:retrieve]  [SUCCESSFUL ]
> org.sonatype.sisu.inject#cglib;2.2.1-v20090111!cglib.jar (32ms)
>>> [ivy:retrieve] downloading
> http://repo2.maven.org/maven2/org/apache/hadoop/hadoop-mapreduce-client-jobclient/0.23.1/hadoop-mapreduce-client-jobclient-0.23.1.jar...
>>> [ivy:retrieve] ... (32kB)
>>> [ivy:retrieve] .. (0kB)
>>> [ivy:retrieve]  [SUCCESSFUL ]
> org.apache.hadoop#hadoop-mapreduce-client-jobclient;0.23.1!hadoop-mapreduce-client-jobclient.jar
> (90ms)
>>> [ivy:retrieve] downloading
> http://repo2.maven.org/maven2/org/apache/hadoop/hadoop-mapreduce-client-common/0.23.1/hadoop-mapreduce-client-common-0.23.1.jar...
>>> [ivy:retrieve] ....................................................
> (577kB)
>>> [ivy:retrieve] .. (0kB)
>>> [ivy:retrieve]  [SUCCESSFUL ]
> org.apache.hadoop#hadoop-mapreduce-client-common;0.23.1!hadoop-mapreduce-client-common.jar
> (42ms)
>>> [ivy:retrieve] downloading
> http://repo2.maven.org/maven2/org/apache/hadoop/hadoop-mapreduce-client-shuffle/0.23.1/hadoop-mapreduce-client-shuffle-0.23.1.jar...
>>> [ivy:retrieve] .. (15kB)
>>> [ivy:retrieve] .. (0kB)
>>> [ivy:retrieve]  [SUCCESSFUL ]
> org.apache.hadoop#hadoop-mapreduce-client-shuffle;0.23.1!hadoop-mapreduce-client-shuffle.jar
> (47ms)
>>> [ivy:retrieve] downloading
> http://repo2.maven.org/maven2/org/apache/hadoop/hadoop-yarn-server-common/0.23.1/hadoop-yarn-server-common-0.23.1.jar...
>>> [ivy:retrieve] ........... (130kB)
>>> [ivy:retrieve] .. (0kB)
>>> [ivy:retrieve]  [SUCCESSFUL ]
> org.apache.hadoop#hadoop-yarn-server-common;0.23.1!hadoop-yarn-server-common.jar
> (74ms)
>>> [ivy:retrieve] downloading
> /home/jenkins/.m2/repository/org/apache/zookeeper/zookeeper/3.4.2/zookeeper-3.4.2.jar
> ...
>>> [ivy:retrieve] ............. (746kB)
>>> [ivy:retrieve] .. (0kB)
>>> [ivy:retrieve]  [SUCCESSFUL ]
> org.apache.zookeeper#zookeeper;3.4.2!zookeeper.jar (33ms)
>>> [ivy:retrieve] downloading
> http://repo2.maven.org/maven2/org/apache/hadoop/hadoop-yarn-server-nodemanager/0.23.1/hadoop-yarn-server-nodemanager-0.23.1.jar...
>>> [ivy:retrieve] ........................................ (376kB)
>>> [ivy:retrieve] .. (0kB)
>>> [ivy:retrieve]  [SUCCESSFUL ]
> org.apache.hadoop#hadoop-yarn-server-nodemanager;0.23.1!hadoop-yarn-server-nodemanager.jar
> (60ms)
>>> [ivy:retrieve] :: resolution report :: resolve 26569ms :: artifacts dl
> 2979ms
>>> [ivy:retrieve]  :: evicted modules:
>>> [ivy:retrieve]  commons-logging#commons-logging;1.0.4 by
> [commons-logging#commons-logging;1.1.1] in [hadoop23, hadoop20]
>>> [ivy:retrieve]  commons-codec#commons-codec;1.2 by
> [commons-codec#commons-codec;1.4] in [hadoop23, hadoop20]
>>> [ivy:retrieve]  commons-logging#commons-logging;1.0.3 by
> [commons-logging#commons-logging;1.1.1] in [hadoop23, hadoop20]
>>> [ivy:retrieve]  commons-codec#commons-codec;1.3 by
> [commons-codec#commons-codec;1.4] in [hadoop23, hadoop20]
>>> [ivy:retrieve]  commons-logging#commons-logging;1.1 by
> [commons-logging#commons-logging;1.1.1] in [hadoop20]
>>>
> ---------------------------------------------------------------------
>>>         |                  |            modules            ||
> artifacts   |
>>>         |       conf       | number| search|dwnlded|evicted||
> number|dwnlded|
>>>
> ---------------------------------------------------------------------
>>>         |     hadoop20     |   53  |   49  |   7   |   5   ||   50  |
> 14  |
>>>         |     hadoop23     |  105  |  102  |   46  |   4   ||  108  |
> 59  |
>>>
> ---------------------------------------------------------------------
>>> [ivy:retrieve] :: retrieving :: org.apache.hcatalog#shims [sync]
>>> [ivy:retrieve]  confs: [hadoop20, hadoop23]
>>> [ivy:retrieve]  158 artifacts copied, 0 already retrieved (93648kB/389ms)
>>>     [touch] Creating <
> https://builds.apache.org/job/Hcatalog-trunk-build/ws/trunk/shims/build/ivy/lib/.ivy-retrieve.complete
>>
>>>
>>> compile:
>>>      [echo] Project: shims
>>>     [javac] Compiling 1 source file to <
> https://builds.apache.org/job/Hcatalog-trunk-build/ws/trunk/build/classes>
>>>     [javac] Compiling 1 source file to <
> https://builds.apache.org/job/Hcatalog-trunk-build/ws/trunk/build/classes>
>>>
>>> jar:
>>>
>>> clientjar:
>>>       [jar] Building jar: <
> https://builds.apache.org/job/Hcatalog-trunk-build/ws/trunk/build/hcatalog/hcatalog-core-0.4.0-SNAPSTHOT.jar
>>
>>> [artifact:install] [INFO] Installing <
> https://builds.apache.org/job/Hcatalog-trunk-build/ws/trunk/build/hcatalog/hcatalog-core-0.4.0-SNAPSTHOT.jar>
> to
> /home/jenkins/.m2/repository/org/apache/hcatalog/hcatalog-core/0.4.0-SNAPSTHOT/hcatalog-core-0.4.0-SNAPSTHOT.jar
>>>
>>> server-extensions:
>>>       [jar] Building jar: <
> https://builds.apache.org/job/Hcatalog-trunk-build/ws/trunk/build/hcatalog/hcatalog-server-extensions-0.4.0-SNAPSTHOT.jar
>>
>>> [artifact:install] [INFO] Installing <
> https://builds.apache.org/job/Hcatalog-trunk-build/ws/trunk/build/hcatalog/hcatalog-server-extensions-0.4.0-SNAPSTHOT.jar>
> to
> /home/jenkins/.m2/repository/org/apache/hcatalog/hcatalog-server-extensions/0.4.0-SNAPSTHOT/hcatalog-server-extensions-0.4.0-SNAPSTHOT.jar
>>>
>>> jar-storage-handlers:
>>>
>>> jar:
>>>      [echo] Generating all handlers
>>>
>>> template:
>>>      [echo] Executing storage-handler "jar" for hbase
>>>
>>> mvn-init:
>>>       [get] Destination already exists (skipping): <
> https://builds.apache.org/job/Hcatalog-trunk-build/ws/trunk/build/maven-ant-tasks-2.1.3.jar
>>
>>>
>>> mvn-dependencies:
>>> [artifact:dependencies] [WARNING] POM for 'asm:asm:pom:3.1:compile' is
> invalid.
>>> [artifact:dependencies]
>>> [artifact:dependencies] Its dependencies (if any) will NOT be available
> to the current build.
>>> [artifact:dependencies] [INFO] snapshot
> org.apache.hive:hive-builtins:0.10.0-SNAPSHOT: checking for updates from
> datanucleus
>>> [artifact:dependencies] [INFO] snapshot
> org.apache.hive:hive-builtins:0.10.0-SNAPSHOT: checking for updates from
> Nexus
>>> [artifact:dependencies] [INFO] snapshot
> org.apache.hive:hive-metastore:0.10.0-SNAPSHOT: checking for updates from
> datanucleus
>>> [artifact:dependencies] [INFO] snapshot
> org.apache.hive:hive-metastore:0.10.0-SNAPSHOT: checking for updates from
> Nexus
>>> [artifact:dependencies] [INFO] artifact asm:asm: checking for updates
> from datanucleus
>>> [artifact:dependencies] [INFO] artifact asm:asm: checking for updates
> from local.repository
>>> [artifact:dependencies] [INFO] artifact asm:asm: checking for updates
> from DN_M2_Repo
>>> [artifact:dependencies] [INFO] artifact asm:asm: checking for updates
> from central
>>> [artifact:dependencies] [INFO] snapshot
> org.apache.hive:hive-common:0.10.0-SNAPSHOT: checking for updates from
> datanucleus
>>> [artifact:dependencies] [INFO] snapshot
> org.apache.hive:hive-common:0.10.0-SNAPSHOT: checking for updates from Nexus
>>> [artifact:dependencies] [INFO] snapshot
> org.apache.hive:hive-exec:0.10.0-SNAPSHOT: checking for updates from
> datanucleus
>>> [artifact:dependencies] [INFO] snapshot
> org.apache.hive:hive-exec:0.10.0-SNAPSHOT: checking for updates from Nexus
>>> [artifact:dependencies] [INFO] snapshot
> org.apache.hive:hive-shims:0.10.0-SNAPSHOT: checking for updates from
> datanucleus
>>> [artifact:dependencies] [INFO] snapshot
> org.apache.hive:hive-shims:0.10.0-SNAPSHOT: checking for updates from Nexus
>>> [artifact:dependencies] [INFO] snapshot
> org.apache.hive:hive-cli:0.10.0-SNAPSHOT: checking for updates from
> datanucleus
>>> [artifact:dependencies] [INFO] snapshot
> org.apache.hive:hive-cli:0.10.0-SNAPSHOT: checking for updates from Nexus
>>> [artifact:dependencies] [INFO] snapshot
> org.apache.hive:hive-hbase-handler:0.10.0-SNAPSHOT: checking for updates
> from datanucleus
>>> [artifact:dependencies] [INFO] snapshot
> org.apache.hive:hive-hbase-handler:0.10.0-SNAPSHOT: checking for updates
> from Nexus
>>> [artifact:dependencies] [WARNING] POM for 'asm:asm:pom:3.1:compile' is
> invalid.
>>> [artifact:dependencies]
>>> [artifact:dependencies] Its dependencies (if any) will NOT be available
> to the current build.
>>>
>>> init:
>>>     [mkdir] Created dir: <
> https://builds.apache.org/job/Hcatalog-trunk-build/ws/trunk/storage-handlers/hbase/build/hbase-storage-handler-0.4.0-SNAPSTHOT
>>
>>>     [mkdir] Created dir: <
> https://builds.apache.org/job/Hcatalog-trunk-build/ws/trunk/storage-handlers/hbase/build/classes
>>
>>>     [mkdir] Created dir: <
> https://builds.apache.org/job/Hcatalog-trunk-build/ws/trunk/storage-handlers/hbase/build/test/classes
>>
>>>
>>> compile-src:
>>>     [javac] Compiling 35 source files to <
> https://builds.apache.org/job/Hcatalog-trunk-build/ws/trunk/storage-handlers/hbase/build/classes
>>
>>>     [javac] error: error reading
> /home/jenkins/.m2/repository/asm/asm/3.1/asm-3.1.jar; error in opening zip
> file
>>>     [javac] 1 error
>>>
>>> BUILD FAILED
>>> <https://builds.apache.org/job/Hcatalog-trunk-build/ws/trunk/build.xml>:219:
> The following error occurred while executing this line:
>>> <
> https://builds.apache.org/job/Hcatalog-trunk-build/ws/trunk/storage-handlers/build.xml>:39:
> The following error occurred while executing this line:
>>> <
> https://builds.apache.org/job/Hcatalog-trunk-build/ws/trunk/storage-handlers/build.xml>:28:
> The following error occurred while executing this line:
>>> <
> https://builds.apache.org/job/Hcatalog-trunk-build/ws/trunk/storage-handlers/hbase/build.xml>:137:
> Compile failed; see the compiler error output for details.
>>>
>>> Total time: 3 minutes 38 seconds
>>> Build step 'Execute shell' marked build as failure
>>> Archiving artifacts
>>> Recording test results



-- 
Olivier Lamy
Talend: http://coders.talend.com
http://twitter.com/olamy | http://linkedin.com/in/olamy

Mime
View raw message