www-builds mailing list archives

Site index · List index
Message view « Date » · « Thread »
Top « Date » · « Thread »
From "Mattmann, Chris A (388J)" <chris.a.mattm...@jpl.nasa.gov>
Subject Too many open files with Maven+Jenkins? (was Re: Build failed in Jenkins...)
Date Wed, 29 Feb 2012 05:00:18 GMT
Hey Guys,

No worries. I'm taking the email thread to builds@.

Guys, we are seeing a ton of these too many open files issues -- Paul R. from Apache OODT
dug up the
below links. Anyone seeing this too? Do the links below help?

Paul, Brian, not sure if you guys are subscribed to build@ so you may want to subscribe to
the list to
track the replies.

BTW, this seems to be happening on the Ubuntu slaves...

Cheers,
Chris

On Feb 28, 2012, at 8:23 PM, Brian Foster wrote:

> Looks like I sent this to build@ instead of builds@ :(... ill take a look into the link
you sent Paul maybe tonight or tomorrow
>
> -brian
>
> "Ramirez, Paul M (388J)" <paul.m.ramirez@jpl.nasa.gov> wrote:
>
>> Hey Brian,
>>
>> I don't have the cycles to really look at it but I did dig up this http://www.thinkplexx.com/learn/howto/maven2/debug/fixing-too-many-open-files-maven-problem-solution-for-teamcity-hudson-local-and-ssh-shell-environments
>>
>> <http://www.thinkplexx.com/learn/howto/maven2/debug/fixing-too-many-open-files-maven-problem-solution-for-teamcity-hudson-local-and-ssh-shell-environments>The
section on profiling the number of open file handles for our project may help diagnose where
the issue is.
>>
>> Thanks,
>> Paul
>>
>> On Feb 28, 2012, at 1:39 PM, holenoter wrote:
>>
>>
>> hey guys,
>>
>> Our build keeps failing with the following errors... could you reboot the ubuntu1,ubuntu2,ubuntu3,ubuntu4
machines?
>>
>> thanks,
>> -brian
>>
>> [INFO] ------------------------------------------------------------------------
>> [ERROR] BUILD ERROR
>> [INFO] ------------------------------------------------------------------------
>> [INFO] Failed to create assembly: Failed to retrieve OS environment variables. Reason:
Cannot run program "env": java.io.IOException: error=24, Too many open files
>>
>> [INFO] ------------------------------------------------------------------------
>> [INFO] For more information, run Maven with the -e switch
>> [INFO] ------------------------------------------------------------------------
>> [INFO] Total time: 5 minutes 26 seconds
>> [INFO] Finished at: Tue Feb 28 19:20:25 UTC 2012
>> [INFO] Final Memory: 71M/421M
>> [INFO] ------------------------------------------------------------------------
>> Waiting for Jenkins to finish collecting data
>> Maven failed with error.
>> channel stopped
>>
>> Begin forwarded message:
>>
>> From: Apache Jenkins Server <jenkins@builds.apache.org<mailto:jenkins@builds.apache.org>>
>> Date: February 28, 2012 11:20:27 AM
>> To: dev@oodt.apache.org<mailto:dev@oodt.apache.org>
>> Subject: Build failed in Jenkins: oodt-trunk #302
>>
>> See <https://builds.apache.org/job/oodt-trunk/302/changes>
>>
>> Changes:
>>
>> [ahart] resolve OODT-373: patch applied to trunk
>>
>> ------------------------------------------
>> [...truncated 1562 lines...]
>>
>> -------------------------------------------------------
>> T E S T S
>> -------------------------------------------------------
>> Running org.apache.oodt.cas.crawl.option.TestBooleanOptions
>> Tests run: 1, Failures: 0, Errors: 0, Skipped: 0, Time elapsed: 0.034 sec
>>
>> Results :
>>
>> Tests run: 1, Failures: 0, Errors: 0, Skipped: 0
>>
>> [JENKINS] Recording test results
>> [INFO] [jar:jar {execution: default-jar}]
>> [INFO] Building jar: <https://builds.apache.org/job/oodt-trunk/ws/crawler/target/cas-crawler-0.4-SNAPSHOT.jar<https://builds.apacheorg/job/oodt-trunk/ws/crawler/target/cas-crawler-0.4-SNAPSHOT.jar>>
>> [INFO] Preparing javadoc:javadoc
>> [WARNING] Removing: javadoc from forked lifecycle, to prevent recursive invocation.
>> [INFO] No goals needed for project - skipping
>> [WARNING] DEPRECATED [aggregate]: since 2.5. Use the goals <code>javadoc:aggregate</code>
and <code>javadoc:test-aggregate</code> instead.
>> [INFO] [javadoc:javadoc {execution: attach-javadocs}]
>> [INFO] [assembly:single {execution: default}]
>> [INFO] Reading assembly descriptor: src/main/assembly/assembly.xml
>> [INFO] Processing DependencySet (output=lib)
>> [INFO] Building tar : <https://builds.apache.org/job/oodt-trunk/ws/crawler/target/cas-crawler-0.4-SNAPSHOT-dist.tar.gz>
>> [INFO] Processing DependencySet (output=lib)
>> [INFO] Building zip: <https://builds.apache.org/job/oodt-trunk/ws/crawler/target/cas-crawler-0.4-SNAPSHOT-dist.zip>
>> [INFO] [install:install {execution: default-install}]
>> [INFO] Installing <https://builds.apache.org/job/oodt-trunk/ws/crawler/target/cas-crawler-0.4-SNAPSHOT.jar>
to <https://builds.apache.org/job/oodt-trunk/ws/.repository/org/apache/oodt/cas-crawler/0.4-SNAPSHOT/cas-crawler-0.4-SNAPSHOT.jar>
>> [INFO] Installing <https://builds.apache.org/job/oodt-trunk/ws/crawler/target/cas-crawler-0.4-SNAPSHOT-dist.tar.gz>
to <https://builds.apache.org/job/oodt-trunk/ws/.repository/org/apache/oodt/cas-crawler/0.4-SNAPSHOT/cas-crawler-0.4-SNAPSHOT-dist.tar.gz<https://builds.apache.org/job/oodt-trunk/ws/.repository/org/apache/oodt/cas-crawler/0.4-SNAPSHOT/cas-crawler-04-SNAPSHOT-dist.tar.gz>>
>> [INFO] Installing <https://builds.apache.org/job/oodt-trunk/ws/crawler/target/cas-crawler-0.4-SNAPSHOT-dist.zip>
to <https://builds.apache.org/job/oodt-trunk/ws/.repository/org/apache/oodt/cas-crawler/04-SNAPSHOT/cas-crawler-0.4-SNAPSHOT-dist.zip<https://builds.apache.org/job/oodt-trunk/ws/.repository/org/apache/oodt/cas-crawler/0.4-SNAPSHOT/cas-crawler-0.4-SNAPSHOT-dist.zip>>
>> [JENKINS] Archiving <https://builds.apache.org/job/oodt-trunk/ws/crawler/pom.xml>
to /home/hudson/hudson/jobs/oodt-trunk/modules/org.apache.oodt$cas-crawler/builds/2012-02-28_19-14-54/archive/org.apache.oodt/cas-crawler/0.4-SNAPSHOT/cas-crawler-0.4-SNAPSHOT.pom
>> [JENKINS] Archiving <https://builds.apache.org/job/oodt-trunk/ws/crawler/target/cas-crawler-0.4-SNAPSHOT.jar>
to /home/hudson/hudson/jobs/oodt-trunk/modules/org.apache.oodt$cas-crawler/builds/2012-02-28_19-14-54/archive/org.apache.oodt/cas-crawler/0.4-SNAPSHOT/cas-crawler-0.4-SNAPSHOT.jar
>> [JENKINS] Archiving <https://builds.apache.org/job/oodt-trunk/ws/crawler/target/cas-crawler-0.4-SNAPSHOT-dist.tar.gz>
to /home/hudson/hudson/jobs/oodt-trunk/modules/org.apache.oodt$cas-crawler/builds/2012-02-28_19-14-54/archive/org.apache.oodt/cas-crawler/0.4-SNAPSHOT/cas-crawler-0.4-SNAPSHOT-dist.tar.gz
>> [JENKINS] Archiving <https://builds.apache.org/job/oodt-trunk/ws/crawler/target/cas-crawler-0.4-SNAPSHOT-dist.zip>
to /home/hudson/hudson/jobs/oodt-trunk/modules/org.apache.oodt$cas-crawler/builds/2012-02-28_19-14-54/archive/org.apache.oodt/cas-crawler/0.4-SNAPSHOT/cas-crawler-0.4-SNAPSHOT-dist.zip
>> [INFO] ------------------------------------------------------------------------
>> [INFO] Building CAS Curation Interface
>> [INFO] task-segment: [install]
>> [INFO] ------------------------------------------------------------------------
>> [INFO] [remote-resources:process {execution: default}]
>> [INFO] [resources:resources {execution: default-resources}]
>> [INFO] Using 'UTF-8' encoding to copy filtered resources.
>> [INFO] Copying 0 resource
>> [INFO] Copying 3 resources
>> [INFO] [compiler:compile {execution: default-compile}]
>> [INFO] Nothing to compile - all classes are up to date
>> [INFO] [resources:testResources {execution: default-testResources}]
>> [INFO] Using 'UTF-8' encoding to copy filtered resources.
>> [INFO] skip non existing resourceDirectory <https://builds.apache.org/job/oodt-trunk/ws/curator/src/test/resources>
>> [INFO] Copying 3 resources
>> [INFO] [compiler:testCompile {execution: default-testCompile}]
>> [INFO] Nothing to compile - all classes are up to date
>> [INFO] [surefire:test {execution: default-test}]
>> [INFO] Surefire report directory: <https://builds.apache.org/job/oodt-trunk/ws/curator/target/surefire-reports>
>>
>> -------------------------------------------------------
>> T E S T S
>> -------------------------------------------------------
>> There are no tests to run.
>>
>> Results :
>>
>> Tests run: 0, Failures: 0, Errors: 0, Skipped: 0
>>
>> [JENKINS] Recording test results
>> [INFO] [war:war {execution: default-war}]
>> [INFO] Packaging webapp
>> [INFO] Assembling webapp[cas-curator] in [<https://builds.apache.org/job/oodt-trunk/ws/curator/target/cas-curator-0.4-SNAPSHOT]>
>> [INFO] Dependency[Dependency {groupId=commons-fileupload, artifactId=commons-fileupload,
version=1.2.1, type=jar}] has changed (was Dependency {groupId=commons-fileupload, artifactId=commons-fileupload,
version=1.2.1, type=jar}).
>> [INFO] Dependency[Dependency {groupId=commons-io, artifactId=commons-io, version=1.3.2,
type=jar}] has changed (was Dependency {groupId=commons-io, artifactId=commons-io, version=1.3.2,
type=jar}).
>> [INFO] Dependency[Dependency {groupId=commons-lang, artifactId=commons-lang, version=2.3,
type=jar}] has changed (was Dependency {groupId=commons-lang, artifactId=commons-lang, version=2.3,
type=jar}).
>> [INFO] Dependency[Dependency {groupId=commons-collections, artifactId=commons-collections,
version=3.2.1, type=jar}] has changed (was Dependency {groupId=commons-collections, artifactId=commons-collections,
version=3.2.1, type=jar}).
>> [INFO] Dependency[Dependency {groupId=org.apache.oodt, artifactId=cas-filemgr, version=0.4-SNAPSHOT,
type=jar}] has changed (was Dependency {groupId=org.apache.oodt, artifactId=cas-filemgr, version=0.4-SNAPSHOT,
type=jar}).
>> [INFO] Dependency[Dependency {groupId=org.apache.oodt, artifactId=oodt-sso, version=0.4-SNAPSHOT,
type=jar}] has changed (was Dependency {groupId=org.apache.oodt, artifactId=oodt-sso, version=0.4-SNAPSHOT,
type=jar}).
>> [INFO] Dependency[Dependency {groupId=org.apache.oodt, artifactId=cas-crawler, version=0.4-SNAPSHOT,
type=jar}] has changed (was Dependency {groupId=org.apache.oodt, artifactId=cas-crawler, version=0.4-SNAPSHOT,
type=jar}).
>> [INFO] Dependency[Dependency {groupId=org.apache.oodt, artifactId=cas-metadata, version=0.4-SNAPSHOT,
type=jar}] has changed (was Dependency {groupId=org.apache.oodt, artifactId=cas-metadata,
version=0.4-SNAPSHOT, type=jar}).
>> [INFO] Dependency[Dependency {groupId=net.sf.json-lib, artifactId=json-lib, version=2.3,
type=jar}] has changed (was Dependency {groupId=net.sf.json-lib, artifactId=json-lib, version=2.3,
type=jar}).
>> [INFO] Dependency[Dependency {groupId=org.apache.cxf, artifactId=cxf-rt-frontend-jaxrs,
version=2.3.1, type=jar}] has changed (was Dependency {groupId=org.apache.cxf, artifactId=cxf-rt-frontend-jaxrs,
version=2.3.1, type=jar}).
>> [INFO] Processing war project
>> [INFO] Copying webapp resources[<https://builds.apache.org/job/oodt-trunk/ws/curator/src/main/webapp]>
>> [INFO] Webapp assembled in[174 msecs]
>> [INFO] Building war: <https://builds.apache.org/job/oodt-trunk/ws/curator/target/cas-curator-0.4-SNAPSHOT.war>
>> [INFO] Preparing javadoc:javadoc
>> [WARNING] Removing: javadoc from forked lifecycle, to prevent recursive invocation.
>> [INFO] No goals needed for project - skipping
>> [WARNING] DEPRECATED [aggregate]: since 2.5 Use the goals <code>javadoc:aggregate</code>
and <code>javadoc:test-aggregate</code> instead.
>> [INFO] [javadoc:javadoc {execution: attach-javadocs}]
>> [INFO] [install:install {execution: default-install}]
>> [INFO] Installing <https://builds.apache.org/job/oodt-trunk/ws/curator/target/cas-curator-0.4-SNAPSHOT.war>
to <https://builds.apache.org/job/oodt-trunk/ws/.repository/org/apache/oodt/cas-curator/0.4-SNAPSHOT/cas-curator-0.4-SNAPSHOT.war>
>> [JENKINS] Archiving <https://builds.apache.org/job/oodt-trunk/ws/curator/pom.xml>
to /home/hudson/hudson/jobs/oodt-trunk/modules/org.apache.oodt$cas-curator/builds/2012-02-28_19-14-54/archive/org.apache.oodt/cas-curator/0.4-SNAPSHOT/cas-curator-0.4-SNAPSHOT.pom
>> [JENKINS] Archiving <https://builds.apache.org/job/oodt-trunk/ws/curator/target/cas-curator-0.4-SNAPSHOT.war>
to /home/hudson/hudson/jobs/oodt-trunk/modules/org.apache.oodt$cas-curator/builds/2012-02-28_19-14-54/archive/orgapache.oodt/cas-curator/0.4-SNAPSHOT/cas-curator-0.4-SNAPSHOT.war
>> [INFO] ------------------------------------------------------------------------
>> [INFO] Building CAS PGE Adaptor Framework
>> [INFO] task-segment: [install]
>> [INFO] ------------------------------------------------------------------------
>> [INFO] [remote-resources:process {execution: default}]
>> [INFO] [resources:resources {execution: default-resources}]
>> [INFO] Using 'UTF-8' encoding to copy filtered resources.
>> [INFO] Copying 7 resources
>> [INFO] Copying 3 resources
>> [INFO] [compiler:compile {execution: default-compile}]
>> [INFO] Nothing to compile - all classes are up to date
>> [INFO] [resources:testResources {execution: default-testResources}]
>> [INFO] Using 'UTF-8' encoding to copy filtered resources.
>> [INFO] skip non existing resourceDirectory <https://builds.apache.org/job/oodt-trunk/ws/pge/src/test/resources>
>> [INFO] Copying 3 resources
>> [INFO] [compiler:testCompile {execution: default-testCompile}]
>> [INFO] Nothing to compile - all classes are up to date
>> [INFO] [surefire:test {execution: default-test}]
>> [INFO] Surefire report directory: <https://builds.apache.org/job/oodt-trunk/ws/pge/target/surefire-reports>
>>
>> -------------------------------------------------------
>> T E S T S
>> -------------------------------------------------------
>> Running org.apache.oodt.cas.pge.util.UtilsTest
>> Tests run: 1, Failures: 0, Errors: 0, Skipped: 0, Time elapsed: 0.009 sec
>>
>> Results :
>>
>> Tests run: 1, Failures: 0, Errors: 0, Skipped: 0
>>
>> [JENKINS] Recording test results
>> [INFO] [jar:jar {execution: default-jar}]
>> [INFO] Building jar: <https://builds.apache.org/job/oodt-trunk/ws/pge/target/cas-pge-0.4-SNAPSHOT.jar<https://builds.apache.org/job/oodt-trunk/ws/pge/target/cas-pge-0.4-SNAPSHOTjar>>
>> [INFO] Preparing javadoc:javadoc
>> [WARNING] Removing: javadoc from forked lifecycle, to prevent recursive invocation.
>> [INFO] No goals needed for project - skipping
>> [WARNING] DEPRECATED [aggregate]: since 2.5. Use the goals <code>javadoc:aggregate</code>
and <code>javadoc:test-aggregate</code> instead.
>> [INFO] [javadoc:javadoc {execution: attach-javadocs}]
>> [INFO] [assembly:single {execution: default}]
>> [INFO] Reading assembly descriptor: src/main/assembly/assembly.xml
>> [INFO] Processing DependencySet (output=lib)
>> [INFO] Building tar : <https://builds.apache.org/job/oodt-trunk/ws/pge/target/cas-pge-0.4-SNAPSHOT-dist.tar.gz>
>> [INFO] Processing DependencySet (output=lib)
>> [INFO] Building zip: <https://builds.apache.org/job/oodt-trunk/ws/pge/target/cas-pge-0.4-SNAPSHOT-dist.zip>
>> [INFO] [install:install {execution: default-install}]
>> [INFO] Installing <https://builds.apache.org/job/oodt-trunk/ws/pge/target/cas-pge-0.4-SNAPSHOT.jar>
to <https://builds.apache.org/job/oodt-trunk/ws/.repository/org/apache/oodt/cas-pge/0.4-SNAPSHOT/cas-pge-0.4-SNAPSHOT.jar>
>> [INFO] Installing <https://builds.apache.org/job/oodt-trunk/ws/pge/target/cas-pge-0.4-SNAPSHOT-dist.tar.gz<https://builds.apacheorg/job/oodt-trunk/ws/pge/target/cas-pge-0.4-SNAPSHOT-dist.tar.gz>>
to <https://builds.apache.org/job/oodt-trunk/ws/.repository/org/apache/oodt/cas-pge/0.4-SNAPSHOT/cas-pge-0.4-SNAPSHOT-dist.tar.gz>
>> [INFO] Installing <https://builds.apache.org/job/oodt-trunk/ws/pge/target/cas-pge-0.4-SNAPSHOT-dist.zip>
to <https://builds.apache.org/job/oodt-trunk/ws/.repository/org/apache/oodt/cas-pge/0.4-SNAPSHOT/cas-pge-0.4-SNAPSHOT-dist.zip>
>> [JENKINS] Archiving <https://builds.apache.org/job/oodt-trunk/ws/pge/pom.xml>
to /home/hudson/hudson/jobs/oodt-trunk/modules/org.apache.oodt$cas-pge/builds/2012-02-28_19-14-54/archive/org.apache.oodt/cas-pge/0.4-SNAPSHOT/cas-pge-0.4-SNAPSHOT.pom
>> [JENKINS] Archiving <https://builds.apache.org/job/oodt-trunk/ws/pge/target/cas-pge-0.4-SNAPSHOT.jar>
to /home/hudson/hudson/jobs/oodt-trunk/modules/org.apache.oodt$cas-pge/builds/2012-02-28_19-14-54/archive/org.apache.oodt/cas-pge/0.4-SNAPSHOT/cas-pge-0.4-SNAPSHOT.jar
>> [JENKINS] Archiving <https://builds.apache.org/job/oodt-trunk/ws/pge/target/cas-pge-0.4-SNAPSHOT-dist.tar.gz>
to /home/hudson/hudson/jobs/oodt-trunk/modules/org.apache.oodt$cas-pge/builds/2012-02-28_19-14-54/archive/org.apache.oodt/cas-pge/0.4-SNAPSHOT/cas-pge-0.4-SNAPSHOT-dist.tar.gz
>> [JENKINS] Archiving <https://builds.apache.org/job/oodt-trunk/ws/pge/target/cas-pge-0.4-SNAPSHOT-dist.zip>
to /home/hudson/hudson/jobs/oodt-trunk/modules/org.apache.oodt$cas-pge/builds/2012-02-28_19-14-54/archive/org.apache.oodt/cas-pge/0.4-SNAPSHOT/cas-pge-0.4-SNAPSHOT-dist.zip
>> [INFO] ------------------------------------------------------------------------
>> [INFO] Building CAS Installer Maven Mojo
>> [INFO] task-segment: [install]
>> [INFO] ------------------------------------------------------------------------
>> [INFO] [plugin:descriptor {execution: default-descriptor}]
>> [INFO] Using 'UTF-8' encoding to read mojo metadata.
>> [INFO] Applying mojo extractor for language: java
>> [INFO] Mojo extractor for language: java found 1 mojo descriptors.
>> [INFO] Applying mojo extractor for language: bsh
>> [INFO] Mojo extractor for language: bsh found 0 mojo descriptors.
>> [INFO] [remote-resources:process {execution: default}]
>> [INFO] [resources:resources {execution: default-resources}]
>> [INFO] Using 'UTF-8' encoding to copy filtered resources.
>> [INFO] skip non existing resourceDirectory <https://builds.apache.org/job/oodt-trunk/ws/mvn/plugins/cas-install/src/main/resources>
>> [INFO] Copying 3 resources
>> [INFO] [compiler:compile {execution: default-compile}]
>> [INFO] Nothing to compile - all classes are up to date
>> [INFO] [resources:testResources {execution: default-testResources}]
>> [INFO] Using 'UTF-8' encoding to copy filtered resources.
>> [INFO] skip non existing resourceDirectory <https://builds.apache.org/job/oodt-trunk/ws/mvn/plugins/cas-install/src/test/resources>
>> [INFO] Copying 3 resources
>> [INFO] [compiler:testCompile {execution: default-testCompile}]
>> [INFO] No sources to compile
>> [INFO] [surefire:test {execution: default-test}]
>> [INFO] Surefire report directory: <https://builds.apache.org/job/oodt-trunk/ws/mvn/plugins/cas-install/target/surefire-reports>
>>
>> -------------------------------------------------------
>> T E S T S
>> -------------------------------------------------------
>> There are no tests to run.
>>
>> Results :
>>
>> Tests run: 0, Failures: 0, Errors: 0, Skipped: 0
>>
>> [JENKINS] Recording test results
>> [INFO] [jar:jar {execution: default-jar}]
>> [INFO] Building jar: <https://builds.apache.org/job/oodt-trunk/ws/mvn/plugins/cas-install/target/maven-cas-install-plugin-0.4-SNAPSHOT.jar>
>> [INFO] [plugin:addPluginArtifactMetadata {execution: default-addPluginArtifactMetadata}]
>> [INFO] Preparing javadoc:javadoc
>> [WARNING] Removing: javadoc from forked lifecycle, to prevent recursive invocation.
>> [INFO] No goals needed for project - skipping
>> [WARNING] DEPRECATED [aggregate]: since 2.5. Use the goals <code>javadoc:aggregate</code>
and <code>javadoc:test-aggregate</code> instead.
>> [INFO] [javadoc:javadoc {execution: attach-javadocs}]
>> [INFO] [install:install {execution: default-install}]
>> [INFO] Installing <https://builds.apache.org/job/oodt-trunk/ws/mvn/plugins/cas-install/target/maven-cas-install-plugin-0.4-SNAPSHOT.jar>
to <https://builds.apache.org/job/oodt-trunk/ws/.repository/org/apache/oodt/maven-cas-install-plugin/0.4-SNAPSHOT/maven-cas-install-plugin-0.4-SNAPSHOT.jar>
>> [JENKINS] Archiving <https://builds.apache.org/job/oodt-trunk/ws/mvn/plugins/cas-install/pom.xml>
to /home/hudson/hudson/jobs/oodt-trunk/modules/org.apache.oodt$maven-cas-install-plugin/builds/2012-02-28_19-14-54/archive/org.apache.oodt/maven-cas-install-plugin/0.4-SNAPSHOT/maven-cas-install-plugin-0.4-SNAPSHOT.pom
>> [JENKINS] Archiving <https://builds.apache.org/job/oodt-trunk/ws/mvn/plugins/cas-install/target/maven-cas-install-plugin-0.4-SNAPSHOT.jar>
to /home/hudson/hudson/jobs/oodt-trunk/modules/org.apache.oodt$maven-cas-install-plugin/builds/2012-02-28_19-14-54/archive/org.apache.oodt/maven-cas-install-plugin/0.4-SNAPSHOT/maven-cas-install-plugin-0.4-SNAPSHOT.jar
>> [INFO] ------------------------------------------------------------------------
>> [INFO] Building CAS Push-Pull-Framework
>> [INFO] task-segment: [install]
>> [INFO] ------------------------------------------------------------------------
>> [INFO] [remote-resources:process {execution: default}]
>> [INFO] [resources:resources {execution: default-resources}]
>> [INFO] Using 'UTF-8' encoding to copy filtered resources.
>> [INFO] Copying 27 resources
>> [INFO] Copying 3 resources
>> [INFO] [compiler:compile {execution: default-compile}]
>> [INFO] Nothing to compile - all classes are up to date
>> [INFO] [resources:testResources {execution: default-testResources}]
>> [INFO] Using 'UTF-8' encoding to copy filtered resources.
>> [INFO] skip non existing resourceDirectory <https://builds.apache.org/job/oodt-trunk/ws/pushpull/src/test/resources>
>> [INFO] Copying 3 resources
>> [INFO] [compiler:testCompile {execution: default-testCompile}]
>> [INFO] No sources to compile
>> [INFO] [surefire:test {execution: default-test}]
>> [INFO] Surefire report directory: <https://builds.apache.org/job/oodt-trunk/ws/pushpull/target/surefire-reports>
>>
>> -------------------------------------------------------
>> T E S T S
>> -------------------------------------------------------
>> There are no tests to run.
>>
>> Results :
>>
>> Tests run: 0, Failures: 0, Errors: 0, Skipped: 0
>>
>> [JENKINS] Recording test results
>> [INFO] [jar:jar {execution: default-jar}]
>> [INFO] Building jar: <https://builds.apache.org/job/oodt-trunk/ws/pushpull/target/cas-pushpull-0.4-SNAPSHOT.jar>
>> [INFO] Preparing javadoc:javadoc
>> [WARNING] Removing: javadoc from forked lifecycle, to prevent recursive invocation.
>> [INFO] No goals needed for project - skipping
>> [WARNING] DEPRECATED [aggregate]: since 2.5. Use the goals <code>javadoc:aggregate</code>
and <code>javadoc:test-aggregate</code> instead.
>> [INFO] [javadoc:javadoc {execution: attach-javadocs}]
>> [INFO] [assembly:single {execution: default}]
>> [INFO] Reading assembly descriptor: src/main/assembly/assemblyxml
>> [INFO] Processing DependencySet (output=lib)
>> [INFO] Building tar : <https://builds.apache.org/job/oodt-trunk/ws/pushpull/target/cas-pushpull-0.4-SNAPSHOT-dist.tar.gz>
>> [INFO] Processing DependencySet (output=lib)
>> [JENKINS] Archiving <https://builds.apache.org/job/oodt-trunk/ws/pushpull/pom.xml>
to /home/hudson/hudson/jobs/oodt-trunk/modules/org.apache.oodt$cas-pushpull/builds/2012-02-28_19-14-54/archive/org.apache.oodt/cas-pushpull/0.4-SNAPSHOT/cas-pushpull-0.4-SNAPSHOT.pom
>> [JENKINS] Archiving <https://builds.apache.org/job/oodt-trunk/ws/pushpull/target/cas-pushpull-0.4-SNAPSHOT.jar>
to /home/hudson/hudson/jobs/oodt-trunk/modules/org.apache.oodt$cas-pushpull/builds/2012-02-28_19-14-54/archive/org.apache.oodt/cas-pushpull/0.4-SNAPSHOT/cas-pushpull-0.4-SNAPSHOT.jar
>> [JENKINS] Archiving <https://builds.apache.org/job/oodt-trunk/ws/pushpull/target/cas-pushpull-0.4-SNAPSHOT-dist.tar.gz<https://builds.apacheorg/job/oodt-trunk/ws/pushpull/target/cas-pushpull-0.4-SNAPSHOT-dist.tar.gz>>
to /home/hudson/hudson/jobs/oodt-trunk/modules/org.apache.oodt$cas-pushpull/builds/2012-02-28_19-14-54/archive/org.apache.oodt/cas-pushpull/0.4-SNAPSHOT/cas-pushpull-0.4-SNAPSHOT-dist.tar.gz
>> [INFO] ------------------------------------------------------------------------
>> [ERROR] BUILD ERROR
>> [INFO] ------------------------------------------------------------------------
>> [INFO] Failed to create assembly: Failed to retrieve OS environment variables. Reason:
Cannot run program "env": java.io.IOException: error=24, Too many open files
>>
>> [INFO] ------------------------------------------------------------------------
>> [INFO] For more information, run Maven with the -e switch
>> [INFO] ------------------------------------------------------------------------
>> [INFO] Total time: 5 minutes 26 seconds
>> [INFO] Finished at: Tue Feb 28 19:20:25 UTC 2012
>> [INFO] Final Memory: 71M/421M
>> [INFO] ------------------------------------------------------------------------
>> Waiting for Jenkins to finish collecting data
>> Maven failed with error.
>> channel stopped
>>
>>


++++++++++++++++++++++++++++++++++++++++++++++++++++++++++++++++++
Chris Mattmann, Ph.D.
Senior Computer Scientist
NASA Jet Propulsion Laboratory Pasadena, CA 91109 USA
Office: 171-266B, Mailstop: 171-246
Email: chris.a.mattmann@nasa.gov
WWW:   http://sunset.usc.edu/~mattmann/
++++++++++++++++++++++++++++++++++++++++++++++++++++++++++++++++++
Adjunct Assistant Professor, Computer Science Department
University of Southern California, Los Angeles, CA 90089 USA
++++++++++++++++++++++++++++++++++++++++++++++++++++++++++++++++++


Mime
View raw message