www-builds mailing list archives

Site index · List index
Message view « Date » · « Thread »
Top « Date » · « Thread »
From ant elder <ant.el...@gmail.com>
Subject jaxws-maven-plugin ClassNotFoundException: com.sun.mirror.apt.AnnotationProcessorFactory
Date Mon, 21 Feb 2011 08:26:57 GMT
We intermittently but regularly get build fails with a
ClassNotFoundException for
com.sun.mirror.apt.AnnotationProcessorFactory in the
jaxws-maven-plugin (see the bottom of the forwarded log for the
complete error).

I can't find why thats happening, does anyone have any ideas?

   ...ant

---------- Forwarded message ----------
From: Apache Hudson Server <hudson@hudson.apache.org>
Date: Mon, Feb 21, 2011 at 1:01 AM
Subject: Build failed in Hudson: Tuscany-2x #102
To: commits@tuscany.apache.org


See <https://hudson.apache.org/hudson/job/Tuscany-2x/102/>

------------------------------------------
[...truncated 39165 lines...]
[INFO] Apache Tuscany SCA Web JavaScript for DOJO ........ SUCCESS [19.385s]
[INFO] Apache Tuscany SCA Widget Implementation Runtime (Dojo)  SUCCESS [3.808s]
[INFO] Apache Tuscany SCA MyFaces JSF Integration ........ SUCCESS [14.054s]
[INFO] Apache Tuscany SCA Node Launcher .................. SUCCESS [5.816s]
[INFO] Apache Tuscany SCA Node Equinox OSGi Launcher ..... SUCCESS [13.909s]
[INFO] Apache Tuscany SCA Policy WS-Policy Model ......... SUCCESS [6.011s]
[INFO] Apache Tuscany SCA Extension Policy Logging Model . SUCCESS [5.344s]
[INFO] Apache Tuscany SCA Transaction Policy Model ....... SUCCESS [4.462s]
[INFO] Apache Tuscany SCA Transaction Policy Runtime ..... SUCCESS [2.983s]
[INFO] Apache Tuscany SCA Transaction Policy Runtime (Geronimo)
SUCCESS [5.313s]
[INFO] Apache Tuscany SCA AOP-based Logging and Tracing .. SUCCESS [9.083s]
[INFO] Apache Tuscany SCA Contribution OSGi Bundle ....... SUCCESS [3.737s]
[INFO] Apache Tuscany SCA OSGi Implementation Extension .. SUCCESS [7.114s]
[INFO] Apache Tuscany SCA OSGi Implementation Extension Runtime
SUCCESS [3.423s]
[INFO] Apache Tuscany SCA OSGi Node Implementation ....... SUCCESS [10.306s]
[INFO] Apache Tuscany SCA JSE built-in CORBA Host ........ SUCCESS [1:21.392s]
[INFO] Apache Tuscany SCA JEE environment CORBA Host ..... SUCCESS [6.607s]
[INFO] Apache Tuscany SCA CORBA Binding Runtime .......... SUCCESS [8.735s]
[INFO] Apache Tuscany SCA Transient Name Server CORBA Host  SUCCESS [5.754s]
[INFO] Apache Tuscany SCA OSGi Runtime POM ............... SUCCESS [1.423s]
[INFO] Apache Tuscany SCA Samples ........................ SUCCESS [2.150s]
[INFO] Apache Tuscany SCA Integration Tests .............. SUCCESS [1.536s]
[INFO] Apache Tuscany SCA iTest Asynchronous Services .... SUCCESS [14.607s]
[INFO] Apache Tuscany SCA iTest Base ..................... SUCCESS [1.708s]
[INFO] Apache Tuscany SCA iTest Base Dependencies ........ SUCCESS [4.608s]
[INFO] Apache Tuscany SCA iTest Builder .................. SUCCESS [12.367s]
[INFO] Apache Tuscany SCA iTest BPEL Integration Tests ... SUCCESS [1.878s]
[INFO] Apache Tuscany SCA iTest BPEL HelloWorld .......... SUCCESS [17.944s]
[INFO] Apache Tuscany SCA iTest Callback API ............. SUCCESS [7.562s]
[INFO] Apache Tuscany SCA iTest Callback Basic ........... SUCCESS [7.388s]
[INFO] Apache Tuscany SCA iTest Callback Complex Type .... SUCCESS [7.648s]
[INFO] Apache Tuscany SCA iTest Callback With Mutiple Wires  SUCCESS [7.994s]
[INFO] Apache Tuscany SCA iTest Callback Using Separate Thread  SUCCESS [8.419s]
[INFO] Apache Tuscany SCA iTest Callback Two Composites .. SUCCESS [8.501s]
[INFO] Apache Tuscany SCA iTest Callback Two Nodes ....... SUCCESS [9.158s]
[INFO] Apache Tuscany SCA iTest Component Type ........... SUCCESS [7.790s]
[INFO] Apache Tuscany SCA iTest Contribution Folder ...... SUCCESS [6.401s]
[INFO] Apache Tuscany SCA iTest Contribution ZIP ......... SUCCESS [6.214s]
[INFO] Apache Tuscany SCA Databindings Integration Tests . SUCCESS [1.429s]
[INFO] Apache Tuscany SCA iTest Databinding - JAXB Bottom Up  SUCCESS [26.357s]
[INFO] Apache Tuscany SCA iTest Databinding - JAXB Top Down  SUCCESS [17.213s]
[INFO] Apache Tuscany SCA Features ....................... SUCCESS [1.209s]
[INFO] Apache Tuscany SCA All-in-one Feature ............. SUCCESS [4.577s]
[INFO] Apache Tuscany SCA Distributions .................. SUCCESS [1.477s]
[INFO] Apache Tuscany SCA Base Runtime Aggregation ....... SUCCESS [15.110s]
[INFO] Apache Tuscany SCA Binding RMI Runtime Aggregation  SUCCESS [2.393s]
[INFO] Apache Tuscany SCA Binding WS Runtime Axis2 Aggregation
SUCCESS [14.816s]
[INFO] Apache Tuscany SCA All-in-one Distribution ........ SUCCESS [3:09.262s]
[INFO] Apache Tuscany SCA iTest Distribution ............. SUCCESS [7.129s]
[INFO] Apache Tuscany SCA iTest Distribution Legal Checks  SUCCESS [19.335s]
[INFO] Apache Tuscany SCA iTest Exceptions ............... SUCCESS [7.127s]
[INFO] Apache Tuscany SCA iTest Spring Implementation .... SUCCESS [12.523s]
[INFO] Apache Tuscany SCA iTest Import Export ............ SUCCESS [3.131s]
[INFO] Apache Tuscany SCA iTest Import Export Exports .... SUCCESS [5.382s]
[INFO] Apache Tuscany SCA iTest Import Export Imports .... SUCCESS [5.567s]
[INFO] Apache Tuscany SCA iTest Import Export Tests ...... SUCCESS [6.980s]
[INFO] Apache Tuscany SCA iTest Interface ................ SUCCESS [9.188s]
[INFO] Apache Tuscany SCA iTest Java Lifecycle Exceptions  SUCCESS [7.023s]
[INFO] Apache Tuscany SCA iTest JMS ...................... SUCCESS [11.128s]
[INFO] Apache Tuscany SCA iTest JMS Args ................. SUCCESS [6.410s]
[INFO] Apache Tuscany SCA iTest JMS Tests For Callbacks .. SUCCESS [7.400s]
[INFO] Apache Tuscany SCA iTest JMS with Defaults ........ SUCCESS [7.722s]
[INFO] Apache Tuscany SCA iTest JMS with dynamic replyq .. SUCCESS [7.169s]
[INFO] Apache Tuscany SCA iTest JMS NonSCA Client Exceptions  SUCCESS [17.567s]
[INFO] Apache Tuscany SCA iTest JMS with Exceptions1 ..... SUCCESS [11.040s]
[INFO] Apache Tuscany SCA iTest JMS with External JMS Broker  SUCCESS [8.851s]
[INFO] Apache Tuscany SCA iTest JMS Message Format jmsbytes  SUCCESS [7.419s]
[INFO] Apache Tuscany SCA iTest JMS Message Format jmsbytesxml  SUCCESS [7.562s]
[INFO] Apache Tuscany SCA iTest JMS Message Format jmsdefault  SUCCESS [8.117s]
[INFO] Apache Tuscany SCA iTest JMS Message Format jmsmessage  SUCCESS [11.103s]
[INFO] Apache Tuscany SCA iTest JMS Message Format jmsobject  SUCCESS [7.914s]
[INFO] Apache Tuscany SCA iTest JMS Message Format jmstext  SUCCESS [7.488s]
[INFO] Apache Tuscany SCA iTest JMS Message Format jmstextxml  SUCCESS [8.535s]
[INFO] Apache Tuscany SCA iTest JMS Message Format
jmstextxmlinjmsobjectout  SUCCESS [6.020s]
[INFO] Apache Tuscany SCA iTest JMS with Non SCA Client .. SUCCESS [15.237s]
[INFO] Apache Tuscany SCA iTest JMS No replyTo ........... SUCCESS [7.459s]
[INFO] Apache Tuscany SCA iTest JMS Nulls ................ SUCCESS [8.913s]
[INFO] Apache Tuscany SCA iTest JMS with Oneway .......... SUCCESS [8.526s]
[INFO] Apache Tuscany SCA iTest JMS for a oneway service . SUCCESS [6.870s]
[INFO] Apache Tuscany SCA iTest JMS with Policy Headers .. SUCCESS [7.330s]
[INFO] Apache Tuscany SCA iTest JMS with Properties ...... SUCCESS [8.967s]
[INFO] Apache Tuscany SCA iTest JMS Response ConnectionFactory  SUCCESS [9.003s]
[INFO] Apache Tuscany SCA iTest JMS with RPC ............. SUCCESS [8.436s]
[INFO] Apache Tuscany SCA iTest JMS Tests For Selectors .. SUCCESS [10.034s]
[INFO] Apache Tuscany SCA iTest JMS Tests for topics ..... SUCCESS [7.641s]
[INFO] Apache Tuscany SCA iTest JMS Time To Live ......... SUCCESS [7.070s]
[INFO] Apache Tuscany SCA iTest JMS with URI RPC ......... SUCCESS [8.156s]
[INFO] Apache Tuscany SCA iTest Nodes .................... SUCCESS [1.934s]
[INFO] Apache Tuscany SCA iTest Nodes Helloworld IFaces .. SUCCESS [4.079s]
[INFO] Apache Tuscany SCA iTest Nodes Helloworld Service . SUCCESS [3.505s]
[INFO] Apache Tuscany SCA iTest Nodes Helloworld Client .. SUCCESS [3.656s]
[INFO] Apache Tuscany SCA iTest Nodes Helloworld Service and Client
SUCCESS [3.643s]
[INFO] Apache Tuscany SCA iTest Nodes One JVM ............ SUCCESS [6.292s]
[INFO] Apache Tuscany SCA iTest Nodes One JVM Using Hazelcast Registry
 SUCCESS [25.373s]
[INFO] Apache Tuscany SCA iTest Nodes One JVM Using Hazelcast and
client  SUCCESS [5.478s]
[INFO] Apache Tuscany SCA iTest Nodes One JVM Using Tribes Registry
SUCCESS [7.873s]
[INFO] Apache Tuscany SCA iTest Nodes binding.sca Using Hazelcast
Registry  SUCCESS [56.435s]
[INFO] Apache Tuscany SCA iTest Nodes One Node Test ...... SUCCESS [4.787s]
[INFO] Apache Tuscany SCA iTest Node Launcher Exuinox .... SUCCESS [7.901s]
[INFO] Apache Tuscany SCA iTest OneWay ................... SUCCESS [12.033s]
[INFO] Apache Tuscany SCA iTest Policy ................... SUCCESS [1.385s]
[INFO] Apache Tuscany SCA iTest Policy Matching .......... SUCCESS [6.653s]
[INFO] Apache Tuscany SCA iTest Policy WS-Policy ......... SUCCESS [7.565s]
[INFO] Apache Tuscany SCA iTest Policies ................. SUCCESS [6.972s]
[INFO] Apache Tuscany SCA iTest Policy Transaction ....... SUCCESS [10.702s]
[INFO] Apache Tuscany SCA iTest Builder Recusive Multi-Level  SUCCESS [7.110s]
[INFO] Apache Tuscany SCA iTest References ............... SUCCESS [10.487s]
[INFO] Apache Tuscany SCA iTest SCAClient API ............ SUCCESS [7.357s]
[INFO] Apache Tuscany SCA API Feature .................... SUCCESS [0.638s]
[INFO] Apache Tuscany SCA Core Feature ................... SUCCESS [1.922s]
[INFO] Apache Tuscany SCA iTest SCAClient API OSGi ....... SUCCESS [9.643s]
[INFO] Apache Tuscany SCA iTest SCAClient API with Hazelcast client
SUCCESS [8.067s]
[INFO] Apache Tuscany SCA iTest Scopes ................... SUCCESS [7.180s]
[INFO] Apache Tuscany SCA iTest SCDL ..................... SUCCESS [5.781s]
[INFO] Apache Tuscany SCA iTest Services ................. SUCCESS [7.302s]
[INFO] Apache Tuscany SCA iTest ServiceReference ......... SUCCESS [9.329s]
[INFO] Apache Tuscany SCA iTest Wires Basic .............. SUCCESS [7.092s]
[INFO] Apache Tuscany SCA iTest WS ....................... SUCCESS [4.181s]
[INFO] Apache Tuscany SCA iTest WS with Defaults ......... SUCCESS [9.732s]
[INFO] Apache Tuscany SCA iTest WS with Authentication Basic  SUCCESS [8.899s]
[INFO] Apache Tuscany SCA iTest WS HTTP SSL .............. SUCCESS [8.655s]
[INFO] Apache Tuscany SCA iTest WS WSDL .................. SUCCESS [11.921s]
[INFO] Apache Tuscany SCA iTest WS Endpoints ............. SUCCESS [13.410s]
[INFO] Apache Tuscany SCA iTest WS Endpoint References ... SUCCESS [9.828s]
[INFO] Apache Tuscany SCA itest WS Holder Input/MultipleOutputs
SUCCESS [10.442s]
[INFO] Apache Tuscany SCA iTest WS Contribution Java First  FAILURE [6.131s]
[INFO] Apache Tuscany SCA iTest WS Contribution WSDL First  SKIPPED
[INFO] Apache Tuscany SCA iTest WS Contribution Callback . SKIPPED
[INFO] Apache Tuscany SCA iTest WS Contribution Callback Forward
Bindings Specified  SKIPPED
[INFO] Apache Tuscany SCA iTest WS Contribution Callback Fully
Specified  SKIPPED
[INFO] Apache Tuscany SCA iTest WS Contribution Callback Promotion  SKIPPED
[INFO] Apache Tuscany SCA iTest WS Contribution Doc Lit(sometimes
called Bare)  SKIPPED
[INFO] Apache Tuscany SCA iTest WS Contribution Doc Lit Wrapped  SKIPPED
[INFO] Apache Tuscany SCA iTest WS Contribution RPC Lit .. SKIPPED
[INFO] Apache Tuscany SCA iTest WS External Client ....... SKIPPED
[INFO] Apache Tuscany SCA iTest WS External Service ...... SKIPPED
[INFO] Apache Tuscany SCA iTest WS Launcher Axis2 ........ SKIPPED
[INFO] Apache Tuscany SCA iTest WS JAXWS ................. SKIPPED
[INFO] Apache Tuscany SCA iTest WS JAXWS Contribution Java First  SKIPPED
[INFO] Apache Tuscany SCA iTest WS JAXWS Contribution WSDL First  SKIPPED
[INFO] Apache Tuscany SCA iTest WS JAXWS External Client . SKIPPED
[INFO] Apache Tuscany SCA iTest WS JAXWS External Service  SKIPPED
[INFO] Apache Tuscany SCA iTest WS JAXWS Launcher RI ..... SKIPPED
[INFO] Apache Tuscany Async Integration Tests ............ SKIPPED
[INFO] Apache Tuscany Integration Tests SCA Binding Mapper  SKIPPED
[INFO] Apache Tuscany SCA Enterprise Java Feature ........ SKIPPED
[INFO] Apache Tuscany SCA Web Service Feature ............ SKIPPED
[INFO] Apache Tuscany SCA OSGi Remote Services Feature ... SKIPPED
[INFO] Apache Tuscany SCA Process Feature ................ SKIPPED
[INFO] Apache Tuscany SCA Web 2.0 Feature ................ SKIPPED
[INFO] Apache Tuscany SCA WebApp Feature ................. SKIPPED
[INFO] Apache Tuscany SCA SDO Databinding Feature ........ SKIPPED
[INFO] Apache Tuscany SCA Base Runtime Jar including dependencies  SKIPPED
[INFO] Apache Tuscany SCA Distribution Tomcat ............ SKIPPED
[INFO] Apache Tuscany SCA Tomcat Hook .................... SKIPPED
[INFO] Apache Tuscany SCA Tomcat Integration Servlet ..... SKIPPED
[INFO] Apache Tuscany SCA Tomcat Deep Integration WAR .... SKIPPED
[INFO] Apache Tuscany SCA Distribution Tomcat Testing .... SKIPPED
[INFO] Apache Tuscany SCA Tomcat Integration Testing Helloworld
Service Contribution  SKIPPED
[INFO] Apache Tuscany SCA Tomcat Integration Testing Helloworld
Reference Contribution  SKIPPED
[INFO] Apache Tuscany SCA Tomcat Integration Testing Helloworld Webapp
Using SCAClient in a JSP  SKIPPED
[INFO] Apache Tuscany SCA Tomcat Integration Testing Helloworld Webapp
Using SCAClient in a Servlet  SKIPPED
[INFO] Apache Tuscany SCA Tomcat Integration Testing Helloworld Client
Webapp  SKIPPED
[INFO] Apache Tuscany SCA WAR Distribution Legal Checks .. SKIPPED
[INFO] Create an SCA JAR contribution project ............ SKIPPED
[INFO] Create an SCA ZIP contribution project ............ SKIPPED
[INFO] Tuscany SCA ZIP contribution Shared Assembly Descriptor  SKIPPED
[INFO] Create a simple Apache Tuscany SCA webapp project . SKIPPED
[INFO] Create a Tuscany SCA and JSF project .............. SKIPPED
[INFO] Create a simple Apache Tuscany SCA webapp project using the
Stripes Web Framework  SKIPPED
[INFO] Create an SCA Webapp project using BPEL ........... SKIPPED
[INFO] Create a Tuscany binding extension project ........ SKIPPED
[INFO] Apache Tuscany SCA Maven Archetypes ............... SKIPPED
[INFO] Apache Tuscany SCA Compliance Tests ............... SKIPPED
[INFO] Apache Tuscany SCA Specification Compliance Tests Assembly  SKIPPED
[INFO] Apache Tuscany SCA Specification Compliance Tests Java CAA  SKIPPED
[INFO] Apache Tuscany SCA Specification Compliance Tests Java CI  SKIPPED
[INFO] Apache Tuscany SCA Specification Compliance Tests Policy  SKIPPED
[INFO] Apache Tuscany SCA Specification Compliance Tests Binding WS  SKIPPED
[INFO] ------------------------------------------------------------------------
[INFO] BUILD FAILURE
[INFO] ------------------------------------------------------------------------
[INFO] Total time: 54:43.541s
[INFO] Finished at: Mon Feb 21 01:01:53 UTC 2011
[INFO] Final Memory: 271M/742M
[INFO] ------------------------------------------------------------------------
maven builder waiting
mavenExecutionResult exceptions not empty
org.apache.maven.lifecycle.LifecycleExecutionException: Failed to
execute goal org.codehaus.mojo:jaxws-maven-plugin:1.10:wsgen (wsgen1)
on project itest-ws-contribution-java-first: Failed to execute wsgen
       at org.apache.maven.lifecycle.internal.MojoExecutor.execute(MojoExecutor.java:217)
       at org.apache.maven.lifecycle.internal.MojoExecutor.execute(MojoExecutor.java:153)
       at org.apache.maven.lifecycle.internal.MojoExecutor.execute(MojoExecutor.java:145)
       at org.apache.maven.lifecycle.internal.LifecycleModuleBuilder.buildProject(LifecycleModuleBuilder.java:84)
       at org.apache.maven.lifecycle.internal.LifecycleModuleBuilder.buildProject(LifecycleModuleBuilder.java:59)
       at org.apache.maven.lifecycle.internal.LifecycleStarter.singleThreadedBuild(LifecycleStarter.java:183)
       at org.apache.maven.lifecycle.internal.LifecycleStarter.execute(LifecycleStarter.java:161)
       at org.apache.maven.DefaultMaven.doExecute(DefaultMaven.java:319)
       at org.apache.maven.DefaultMaven.execute(DefaultMaven.java:156)
       at org.jvnet.hudson.maven3.launcher.Maven3Launcher.main(Maven3Launcher.java:79)
       at sun.reflect.NativeMethodAccessorImpl.invoke0(Native Method)
       at sun.reflect.NativeMethodAccessorImpl.invoke(NativeMethodAccessorImpl.java:39)
       at sun.reflect.DelegatingMethodAccessorImpl.invoke(DelegatingMethodAccessorImpl.java:25)
       at java.lang.reflect.Method.invoke(Method.java:597)
       at org.codehaus.plexus.classworlds.launcher.Launcher.launchStandard(Launcher.java:329)
       at org.codehaus.plexus.classworlds.launcher.Launcher.launch(Launcher.java:239)
       at org.jvnet.hudson.maven3.agent.Maven3Main.launch(Maven3Main.java:145)
       at hudson.maven.Maven3Builder.call(Maven3Builder.java:124)
       at hudson.maven.Maven3Builder.call(Maven3Builder.java:71)
       at hudson.remoting.UserRequest.perform(UserRequest.java:114)
       at hudson.remoting.UserRequest.perform(UserRequest.java:48)
       at hudson.remoting.Request$2.run(Request.java:270)
       at java.util.concurrent.Executors$RunnableAdapter.call(Executors.java:441)
       at java.util.concurrent.FutureTask$Sync.innerRun(FutureTask.java:303)
       at java.util.concurrent.FutureTask.run(FutureTask.java:138)
       at java.util.concurrent.ThreadPoolExecutor$Worker.runTask(ThreadPoolExecutor.java:885)
       at java.util.concurrent.ThreadPoolExecutor$Worker.run(ThreadPoolExecutor.java:907)
       at java.lang.Thread.run(Thread.java:619)
Caused by: org.apache.maven.plugin.MojoExecutionException: Failed to
execute wsgen
       at org.codehaus.mojo.jaxws.AbstractWsGenMojo.execute(AbstractWsGenMojo.java:102)
       at org.codehaus.mojo.jaxws.MainWsGenMojo.execute(MainWsGenMojo.java:14)
       at org.apache.maven.plugin.DefaultBuildPluginManager.executeMojo(DefaultBuildPluginManager.java:107)
       at org.apache.maven.lifecycle.internal.MojoExecutor.execute(MojoExecutor.java:209)
       ... 27 more
Caused by: java.lang.NoClassDefFoundError:
com/sun/mirror/apt/AnnotationProcessorFactory
       at java.lang.ClassLoader.defineClass1(Native Method)
       at java.lang.ClassLoader.defineClass(ClassLoader.java:620)
       at java.security.SecureClassLoader.defineClass(SecureClassLoader.java:124)
       at java.net.URLClassLoader.defineClass(URLClassLoader.java:260)
       at java.net.URLClassLoader.access$000(URLClassLoader.java:56)
       at java.net.URLClassLoader$1.run(URLClassLoader.java:195)
       at java.security.AccessController.doPrivileged(Native Method)
       at java.net.URLClassLoader.findClass(URLClassLoader.java:188)
       at org.codehaus.plexus.classworlds.realm.ClassRealm.loadClassFromSelf(ClassRealm.java:386)
       at org.codehaus.plexus.classworlds.strategy.SelfFirstStrategy.loadClass(SelfFirstStrategy.java:42)
       at org.codehaus.plexus.classworlds.realm.ClassRealm.loadClass(ClassRealm.java:244)
       at org.codehaus.plexus.classworlds.realm.ClassRealm.loadClass(ClassRealm.java:230)
       at java.lang.ClassLoader.loadClassInternal(ClassLoader.java:319)
       at com.sun.tools.ws.WsGen.doMain(WsGen.java:69)
       at org.codehaus.mojo.jaxws.AbstractWsGenMojo.execute(AbstractWsGenMojo.java:97)
       ... 30 more
Caused by: java.lang.ClassNotFoundException:
com.sun.mirror.apt.AnnotationProcessorFactory
       at org.codehaus.plexus.classworlds.strategy.SelfFirstStrategy.loadClass(SelfFirstStrategy.java:50)
       at org.codehaus.plexus.classworlds.realm.ClassRealm.loadClass(ClassRealm.java:244)
       at org.codehaus.plexus.classworlds.realm.ClassRealm.loadClass(ClassRealm.java:230)
       at java.lang.ClassLoader.loadClassInternal(ClassLoader.java:319)
       ... 45 more
Maven failed with error.
Sending e-mails to: commits@tuscany.apache.org
channel stopped

Mime
View raw message