www-builds mailing list archives

Site index · List index
Message view « Date » · « Thread »
Top « Date » · « Thread »
From "Gav..." <ga...@16degrees.com.au>
Subject RE: tomcat-trunk, tomcat-6-trunk (at buildslave3): cannot find javac compiler
Date Mon, 16 Aug 2010 00:01:33 GMT


> -----Original Message-----
> From: Konstantin Kolinko [mailto:knst.kolinko@gmail.com]
> Sent: Monday, 16 August 2010 9:50 AM
> To: builds@apache.org
> Subject: Re: tomcat-trunk, tomcat-6-trunk (at buildslave3): cannot find
> javac compiler
> 
> 2010/8/15 Gav... <gavin@16degrees.com.au>:
> >
> >
> >> -----Original Message-----
> >> From: Konstantin Kolinko [mailto:knst.kolinko@gmail.com]
> >> Sent: Monday, 16 August 2010 1:12 AM
> >> To: builds@apache.org
> >> Subject: Re: tomcat-trunk, tomcat-6-trunk (at buildslave3): cannot
> find
> >> javac compiler
> >>
> >> No luck here.  It is still failing.
> >>
> >> http://ci.apache.org/builders/tomcat-trunk/builds/376
> >> Aug 15 14:49  - that is 30 minutes ago.
> >
> > Hi,
> >
> > After the OS upgrade from 9.04 to 10.04 it loses the Sun JDK. I've
> just
> > reinstalled it,
> > next build should be fine, if not I'll take another look in the
> morning.
> >
> > Gav...
> >
> 
> Thank you.  Compilation now succeeds.
> 
> Now it fails later, when trying to build a windows installer.
> 
> http://ci.apache.org/builders/tomcat-
> trunk/builds/377/steps/compile/logs/stdio
> 
> > BUILD FAILED
> > /home/buildslave3/slave3/tomcat-trunk/build/build.xml:1545: Execute
> failed: java.io.IOException: Cannot run program "wine" (in directory
> "/home/buildslave3/slave3/tomcat-trunk/build/output/dist"):
> java.io.IOException: error=2, No such file or directory
> 
> 
> 
> We are using wine to run makensis.exe of NSIS, and wine is not
> installed.

Weird, anyway Wine (re)installed.

Gav...

> 
> If the "skip.installer" Ant property is defined that step will be
> skipped, but it would be nice to have it running.
> 
> 
> Best regards,
> Konstantin Kolinko



Mime
View raw message