www-apache-bugdb mailing list archives

Site index · List index
Message view « Date » · « Thread »
Top « Date » · « Thread »
From Thomas Reagan <treagan...@interactiveedge.com>
Subject build/9887: make install fails on aaa modules
Date Wed, 20 Feb 2002 16:44:50 GMT

>Number:         9887
>Category:       build
>Synopsis:       make install fails on aaa modules
>Confidential:   no
>Severity:       serious
>Priority:       medium
>Responsible:    apache
>State:          open
>Quarter:        
>Keywords:       
>Date-Required:
>Class:          sw-bug
>Submitter-Id:   apache
>Arrival-Date:   Wed Feb 20 08:50:00 PST 2002
>Closed-Date:
>Last-Modified:
>Originator:     treagan-ml@interactiveedge.com
>Release:        2.0.32
>Organization:
apache
>Environment:
RedHat Linux 7.2, Linux 2.4.7-10 #1 Thu Sep 6 17:27:27 EDT 2001 i686 unknown   
>Description:
Ok, I'm not sure exactly what causes make install to fail, but in the middle of a make install,
immediately after entering modules/aaa, the install fails.  Here is the text:

Making install in aaa
make[2]: Entering directory `/opt/apache/src/httpd-2.0.32/modules/aaa'
make[3]: Entering directory `/opt/apache/src/httpd-2.0.32/modules/aaa'
cp .libs/mod_access.so /opt/apache/modules/mod_access.so
cp: cannot stat `.libs/mod_access.so': No such file or directory
cp .libs/mod_auth.so /opt/apache/modules/mod_auth.so
cp: cannot stat `.libs/mod_auth.so': No such file or directory
cp .libs/mod_auth_anon.so /opt/apache/modules/mod_auth_anon.so
cp: cannot stat `.libs/mod_auth_anon.so': No such file or directory
cp .libs/mod_auth_dbm.so /opt/apache/modules/mod_auth_dbm.so
cp: cannot stat `.libs/mod_auth_dbm.so': No such file or directory
cp .libs/mod_auth_digest.so /opt/apache/modules/mod_auth_digest.so
cp: cannot stat `.libs/mod_auth_digest.so': No such file or directory
make[3]: *** [install-modules] Error 1
make[3]: Leaving directory `/opt/apache/src/httpd-2.0.32/modules/aaa'
make[2]: *** [install-recursive] Error 1
make[2]: Leaving directory `/opt/apache/src/httpd-2.0.32/modules/aaa'
make[1]: *** [install-recursive] Error 1
make[1]: Leaving directory `/opt/apache/src/httpd-2.0.32/modules'
make: *** [install-recursive] Error 1
>How-To-Repeat:
Download httpd-2.0.32-beta.tar.gz, tar -xzf, 
./configure --prefix=/opt/apache --sysconfdir=/etc/opt/apache --localstatedir=/var/opt/apache
--enable-shared=max --enable-mods-shared=all --enable-ssl=shared
>Fix:

>Release-Note:
>Audit-Trail:
>Unformatted:
 [In order for any reply to be added to the PR database, you need]
 [to include <apbugs@Apache.Org> in the Cc line and make sure the]
 [subject line starts with the report component and number, with ]
 [or without any 'Re:' prefixes (such as "general/1098:" or      ]
 ["Re: general/1098:").  If the subject doesn't match this       ]
 [pattern, your message will be misfiled and ignored.  The       ]
 ["apbugs" address is not added to the Cc line of messages from  ]
 [the database automatically because of the potential for mail   ]
 [loops.  If you do not include this Cc, your reply may be ig-   ]
 [nored unless you are responding to an explicit request from a  ]
 [developer.  Reply only with text; DO NOT SEND ATTACHMENTS!     ]
 
 


Mime
View raw message