ws-kandula-dev mailing list archives

Site index · List index
Message view « Date » · « Thread »
Top « Date » · « Thread »
From Apache Hudson Server <hud...@hudson.zones.apache.org>
Subject Build failed in Hudson: axis2-transports-trunk #98
Date Sun, 13 Jun 2010 13:13:27 GMT
See <http://hudson.zones.apache.org/hudson/job/axis2-transports-trunk/98/>

------------------------------------------
[...truncated 2640 lines...]
	at org.apache.axis2.description.AxisServiceGroup.removeService(AxisServiceGroup.java:149)
	at org.apache.axis2.engine.AxisConfiguration.removeService(AxisConfiguration.java:692)
	at org.apache.axis2.transport.testkit.axis2.endpoint.AxisTestEndpoint.tearDown(AxisTestEndpoint.java:132)
	at sun.reflect.NativeMethodAccessorImpl.invoke0(Native Method)
	at sun.reflect.NativeMethodAccessorImpl.invoke(NativeMethodAccessorImpl.java:39)
	at sun.reflect.DelegatingMethodAccessorImpl.invoke(DelegatingMethodAccessorImpl.java:25)
	at java.lang.reflect.Method.invoke(Method.java:592)
	at org.apache.axis2.transport.testkit.tests.TestResource$MethodInvocation.execute(TestResource.java:53)
	at org.apache.axis2.transport.testkit.tests.TestResource.tearDown(TestResource.java:190)
	at org.apache.axis2.transport.testkit.tests.TestResourceSet.tearDown(TestResourceSet.java:168)
	at org.apache.axis2.transport.testkit.tests.TestResourceSetTransition.tearDown(TestResourceSetTransition.java:70)
	at org.apache.axis2.transport.testkit.ManagedTestSuite.run(ManagedTestSuite.java:108)
	at sun.reflect.NativeMethodAccessorImpl.invoke0(Native Method)
	at sun.reflect.NativeMethodAccessorImpl.invoke(NativeMethodAccessorImpl.java:39)
	at sun.reflect.DelegatingMethodAccessorImpl.invoke(DelegatingMethodAccessorImpl.java:25)
	at java.lang.reflect.Method.invoke(Method.java:592)
	at org.apache.maven.surefire.junit.JUnitTestSet.execute(JUnitTestSet.java:213)
	at org.apache.maven.surefire.suite.AbstractDirectoryTestSuite.executeTestSet(AbstractDirectoryTestSuite.java:138)
	at org.apache.maven.surefire.suite.AbstractDirectoryTestSuite.execute(AbstractDirectoryTestSuite.java:125)
	at org.apache.maven.surefire.Surefire.run(Surefire.java:132)
	at sun.reflect.NativeMethodAccessorImpl.invoke0(Native Method)
	at sun.reflect.NativeMethodAccessorImpl.invoke(NativeMethodAccessorImpl.java:39)
	at sun.reflect.DelegatingMethodAccessorImpl.invoke(DelegatingMethodAccessorImpl.java:25)
	at java.lang.reflect.Method.invoke(Method.java:592)
	at org.apache.maven.surefire.booter.SurefireBooter.runSuitesInProcess(SurefireBooter.java:290)
	at org.apache.maven.surefire.booter.SurefireBooter.main(SurefireBooter.java:818)
ERROR [main] ServiceTaskManager Error stopping shared Connection
org.apache.qpid.client.JMSAMQException: Error: channel is closed [error code 504: channel
error] [error code 504: channel error]
	at org.apache.qpid.client.AMQConnection.stop(AMQConnection.java:903)
	at org.apache.axis2.transport.jms.ServiceTaskManager.stop(ServiceTaskManager.java:232)
	at org.apache.axis2.transport.jms.JMSListener.stopEndpoint(JMSListener.java:112)
	at org.apache.axis2.transport.jms.JMSListener.stopEndpoint(JMSListener.java:46)
	at org.apache.axis2.transport.base.AbstractTransportListenerEx.stopListeningForService(AbstractTransportListenerEx.java:174)
	at org.apache.axis2.transport.base.AbstractTransportListener.internalStopListeningForService(AbstractTransportListener.java:245)
	at org.apache.axis2.transport.base.AbstractTransportListener$2.serviceRemoved(AbstractTransportListener.java:130)
	at org.apache.axis2.transport.base.tracker.AxisServiceTracker.serviceRemoved(AxisServiceTracker.java:224)
	at org.apache.axis2.transport.base.tracker.AxisServiceTracker$1.serviceUpdate(AxisServiceTracker.java:117)
	at org.apache.axis2.engine.AxisConfiguration.notifyObservers(AxisConfiguration.java:648)
	at org.apache.axis2.description.AxisServiceGroup.removeService(AxisServiceGroup.java:149)
	at org.apache.axis2.engine.AxisConfiguration.removeService(AxisConfiguration.java:692)
	at org.apache.axis2.transport.testkit.axis2.endpoint.AxisTestEndpoint.tearDown(AxisTestEndpoint.java:132)
	at sun.reflect.GeneratedMethodAccessor25.invoke(Unknown Source)
	at sun.reflect.DelegatingMethodAccessorImpl.invoke(DelegatingMethodAccessorImpl.java:25)
	at java.lang.reflect.Method.invoke(Method.java:592)
	at org.apache.axis2.transport.testkit.tests.TestResource$MethodInvocation.execute(TestResource.java:53)
	at org.apache.axis2.transport.testkit.tests.TestResource.tearDown(TestResource.java:190)
	at org.apache.axis2.transport.testkit.tests.TestResourceSet.tearDown(TestResourceSet.java:168)
	at org.apache.axis2.transport.testkit.tests.TestResourceSetTransition.tearDown(TestResourceSetTransition.java:70)
	at org.apache.axis2.transport.testkit.ManagedTestSuite.run(ManagedTestSuite.java:108)
	at sun.reflect.NativeMethodAccessorImpl.invoke0(Native Method)
	at sun.reflect.NativeMethodAccessorImpl.invoke(NativeMethodAccessorImpl.java:39)
	at sun.reflect.DelegatingMethodAccessorImpl.invoke(DelegatingMethodAccessorImpl.java:25)
	at java.lang.reflect.Method.invoke(Method.java:592)
	at org.apache.maven.surefire.junit.JUnitTestSet.execute(JUnitTestSet.java:213)
	at org.apache.maven.surefire.suite.AbstractDirectoryTestSuite.executeTestSet(AbstractDirectoryTestSuite.java:138)
	at org.apache.maven.surefire.suite.AbstractDirectoryTestSuite.execute(AbstractDirectoryTestSuite.java:125)
	at org.apache.maven.surefire.Surefire.run(Surefire.java:132)
	at sun.reflect.NativeMethodAccessorImpl.invoke0(Native Method)
	at sun.reflect.NativeMethodAccessorImpl.invoke(NativeMethodAccessorImpl.java:39)
	at sun.reflect.DelegatingMethodAccessorImpl.invoke(DelegatingMethodAccessorImpl.java:25)
	at java.lang.reflect.Method.invoke(Method.java:592)
	at org.apache.maven.surefire.booter.SurefireBooter.runSuitesInProcess(SurefireBooter.java:290)
	at org.apache.maven.surefire.booter.SurefireBooter.main(SurefireBooter.java:818)
ERROR [jms-Worker-2] ServiceTaskManager Error closing JMS session
javax.jms.JMSException: Error closing session: org.apache.qpid.AMQConnectionClosedException:
Error: channel is closed [error code 504: channel error] [error code 504: channel error]
	at org.apache.qpid.client.AMQSession.close(AMQSession.java:624)
	at org.apache.qpid.client.AMQSession.close(AMQSession.java:482)
	at org.apache.axis2.transport.jms.ServiceTaskManager$MessageListenerTask.closeSession(ServiceTaskManager.java:749)
	at org.apache.axis2.transport.jms.ServiceTaskManager$MessageListenerTask.run(ServiceTaskManager.java:462)
	at org.apache.axis2.transport.base.threads.NativeWorkerPool$1.run(NativeWorkerPool.java:58)
	at java.util.concurrent.ThreadPoolExecutor$Worker.runTask(ThreadPoolExecutor.java:651)
	at java.util.concurrent.ThreadPoolExecutor$Worker.run(ThreadPoolExecutor.java:676)
	at java.lang.Thread.run(Thread.java:595)
Tests run: 198, Failures: 0, Errors: 0, Skipped: 0, Time elapsed: 69.891 sec
Running org.apache.axis2.transport.jms.ctype.ContentTypeRuleTest
Tests run: 2, Failures: 0, Errors: 0, Skipped: 0, Time elapsed: 0.017 sec

Results :

Tests run: 200, Failures: 0, Errors: 0, Skipped: 0

[HUDSON] Recording test results
Downloading: http://people.apache.org/repo/m2-incubating-repository//org/apache/neethi/neethi/3.0.0-SNAPSHOT/neethi-3.0.0-SNAPSHOT.jar
Downloading: http://people.apache.org/repo/m2-incubating-repository//org/apache/woden/woden-api/1.0-SNAPSHOT/woden-api-1.0-SNAPSHOT.jar
[INFO] Unable to find resource 'org.apache.neethi:neethi:jar:3.0.0-SNAPSHOT' in repository
apache-incubating (http://people.apache.org/repo/m2-incubating-repository/)
Downloading: http://repository.apache.org/snapshots/org/apache/neethi/neethi/3.0.0-SNAPSHOT/neethi-3.0.0-SNAPSHOT.jar
[INFO] Unable to find resource 'org.apache.woden:woden-api:jar:1.0-SNAPSHOT' in repository
apache-incubating (http://people.apache.org/repo/m2-incubating-repository/)
Downloading: http://repository.apache.org/snapshots/org/apache/woden/woden-api/1.0-SNAPSHOT/woden-api-1.0-SNAPSHOT.jar
[INFO] Unable to find resource 'org.apache.neethi:neethi:jar:3.0.0-SNAPSHOT' in repository
apache.snapshots (http://repository.apache.org/snapshots)
Downloading: http://ws.zones.apache.org/repository2/org/apache/neethi/neethi/3.0.0-SNAPSHOT/neethi-3.0.0-SNAPSHOT.jar
[INFO] Unable to find resource 'org.apache.woden:woden-api:jar:1.0-SNAPSHOT' in repository
apache.snapshots (http://repository.apache.org/snapshots)
Downloading: http://ws.zones.apache.org/repository2/org/apache/woden/woden-api/1.0-SNAPSHOT/woden-api-1.0-SNAPSHOT.jar
[INFO] Unable to find resource 'org.apache.neethi:neethi:jar:3.0.0-SNAPSHOT' in repository
apache-ws-snapshots2 (http://ws.zones.apache.org/repository2)
Downloading: http://dist.wso2.org/maven2/org/apache/neethi/neethi/3.0.0-SNAPSHOT/neethi-3.0.0-SNAPSHOT.jar
[INFO] Unable to find resource 'org.apache.woden:woden-api:jar:1.0-SNAPSHOT' in repository
apache-ws-snapshots2 (http://ws.zones.apache.org/repository2)
Downloading: http://dist.wso2.org/maven2/org/apache/woden/woden-api/1.0-SNAPSHOT/woden-api-1.0-SNAPSHOT.jar
[INFO] Unable to find resource 'org.apache.neethi:neethi:jar:3.0.0-SNAPSHOT' in repository
wso2-maven2-repository (http://dist.wso2.org/maven2)
[INFO] Unable to find resource 'org.apache.woden:woden-api:jar:1.0-SNAPSHOT' in repository
wso2-maven2-repository (http://dist.wso2.org/maven2)
Downloading: http://people.apache.org/repo/m2-incubating-repository//org/apache/woden/woden-impl-dom/1.0-SNAPSHOT/woden-impl-dom-1.0-SNAPSHOT.jar
[INFO] Unable to find resource 'org.apache.woden:woden-impl-dom:jar:1.0-SNAPSHOT' in repository
apache-incubating (http://people.apache.org/repo/m2-incubating-repository/)
Downloading: http://repository.apache.org/snapshots/org/apache/woden/woden-impl-dom/1.0-SNAPSHOT/woden-impl-dom-1.0-SNAPSHOT.jar
[INFO] Unable to find resource 'org.apache.woden:woden-impl-dom:jar:1.0-SNAPSHOT' in repository
apache.snapshots (http://repository.apache.org/snapshots)
Downloading: http://ws.zones.apache.org/repository2/org/apache/woden/woden-impl-dom/1.0-SNAPSHOT/woden-impl-dom-1.0-SNAPSHOT.jar
[INFO] Unable to find resource 'org.apache.woden:woden-impl-dom:jar:1.0-SNAPSHOT' in repository
apache-ws-snapshots2 (http://ws.zones.apache.org/repository2)
Downloading: http://dist.wso2.org/maven2/org/apache/woden/woden-impl-dom/1.0-SNAPSHOT/woden-impl-dom-1.0-SNAPSHOT.jar
[INFO] Unable to find resource 'org.apache.woden:woden-impl-dom:jar:1.0-SNAPSHOT' in repository
wso2-maven2-repository (http://dist.wso2.org/maven2)
Downloading: http://people.apache.org/repo/m2-incubating-repository//org/apache/woden/woden-impl-commons/1.0-SNAPSHOT/woden-impl-commons-1.0-SNAPSHOT.jar
[INFO] Unable to find resource 'org.apache.woden:woden-impl-commons:jar:1.0-SNAPSHOT' in repository
apache-incubating (http://people.apache.org/repo/m2-incubating-repository/)
Downloading: http://repository.apache.org/snapshots/org/apache/woden/woden-impl-commons/1.0-SNAPSHOT/woden-impl-commons-1.0-SNAPSHOT.jar
[INFO] Unable to find resource 'org.apache.woden:woden-impl-commons:jar:1.0-SNAPSHOT' in repository
apache.snapshots (http://repository.apache.org/snapshots)
Downloading: http://ws.zones.apache.org/repository2/org/apache/woden/woden-impl-commons/1.0-SNAPSHOT/woden-impl-commons-1.0-SNAPSHOT.jar
[INFO] Unable to find resource 'org.apache.woden:woden-impl-commons:jar:1.0-SNAPSHOT' in repository
apache-ws-snapshots2 (http://ws.zones.apache.org/repository2)
Downloading: http://dist.wso2.org/maven2/org/apache/woden/woden-impl-commons/1.0-SNAPSHOT/woden-impl-commons-1.0-SNAPSHOT.jar
[INFO] Unable to find resource 'org.apache.woden:woden-impl-commons:jar:1.0-SNAPSHOT' in repository
wso2-maven2-repository (http://dist.wso2.org/maven2)
Downloading: http://repository.apache.org/snapshots/org/apache/woden/woden-impl-commons/1.0-SNAPSHOT/woden-impl-commons-1.0-SNAPSHOT.jar
[INFO] Unable to find resource 'org.apache.woden:woden-impl-commons:jar:1.0-SNAPSHOT' in repository
nexus.snapshots (http://repository.apache.org/snapshots)
Downloading: http://people.apache.org/repo/m2-incubating-repository//org/apache/neethi/neethi/3.0.0-SNAPSHOT/neethi-3.0.0-SNAPSHOT.jar
[INFO] Unable to find resource 'org.apache.neethi:neethi:jar:3.0.0-SNAPSHOT' in repository
apache-incubating (http://people.apache.org/repo/m2-incubating-repository/)
Downloading: http://repository.apache.org/snapshots/org/apache/neethi/neethi/3.0.0-SNAPSHOT/neethi-3.0.0-SNAPSHOT.jar
[INFO] Unable to find resource 'org.apache.neethi:neethi:jar:3.0.0-SNAPSHOT' in repository
apache.snapshots (http://repository.apache.org/snapshots)
Downloading: http://people.apache.org/repo/m2-incubating-repository//org/apache/woden/woden-api/1.0-SNAPSHOT/woden-api-1.0-SNAPSHOT.jar
[INFO] Unable to find resource 'org.apache.woden:woden-api:jar:1.0-SNAPSHOT' in repository
apache-incubating (http://people.apache.org/repo/m2-incubating-repository/)
Downloading: http://repository.apache.org/snapshots/org/apache/woden/woden-api/1.0-SNAPSHOT/woden-api-1.0-SNAPSHOT.jar
[INFO] Unable to find resource 'org.apache.woden:woden-api:jar:1.0-SNAPSHOT' in repository
apache.snapshots (http://repository.apache.org/snapshots)
Downloading: http://people.apache.org/repo/m2-incubating-repository//org/apache/woden/woden-impl-dom/1.0-SNAPSHOT/woden-impl-dom-1.0-SNAPSHOT.jar
[INFO] Unable to find resource 'org.apache.woden:woden-impl-dom:jar:1.0-SNAPSHOT' in repository
apache-incubating (http://people.apache.org/repo/m2-incubating-repository/)
Downloading: http://repository.apache.org/snapshots/org/apache/woden/woden-impl-dom/1.0-SNAPSHOT/woden-impl-dom-1.0-SNAPSHOT.jar
[INFO] Unable to find resource 'org.apache.woden:woden-impl-dom:jar:1.0-SNAPSHOT' in repository
apache.snapshots (http://repository.apache.org/snapshots)
Downloading: http://people.apache.org/repo/m2-incubating-repository//org/apache/woden/woden-impl-commons/1.0-SNAPSHOT/woden-impl-commons-1.0-SNAPSHOT.jar
[INFO] Unable to find resource 'org.apache.woden:woden-impl-commons:jar:1.0-SNAPSHOT' in repository
apache-incubating (http://people.apache.org/repo/m2-incubating-repository/)
Downloading: http://repository.apache.org/snapshots/org/apache/woden/woden-impl-commons/1.0-SNAPSHOT/woden-impl-commons-1.0-SNAPSHOT.jar
[INFO] Unable to find resource 'org.apache.woden:woden-impl-commons:jar:1.0-SNAPSHOT' in repository
apache.snapshots (http://repository.apache.org/snapshots)
[INFO] [bundle:bundle {execution: default-bundle}]
[INFO] Preparing source:jar
[WARNING] Removing: jar from forked lifecycle, to prevent recursive invocation.
[INFO] No goals needed for project - skipping
[INFO] [source:jar {execution: default}]
[INFO] Building jar: <http://hudson.zones.apache.org/hudson/job/axis2-transports-trunk/ws/transports/modules/jms/target/axis2-transport-jms-1.1.0-SNAPSHOT-sources.jar>
[INFO] [install:install {execution: default-install}]
[INFO] Installing <http://hudson.zones.apache.org/hudson/job/axis2-transports-trunk/ws/transports/modules/jms/target/axis2-transport-jms-1.1.0-SNAPSHOT.jar>
to /home/hudson/.m2/repository/org/apache/axis2/axis2-transport-jms/1.1.0-SNAPSHOT/axis2-transport-jms-1.1.0-SNAPSHOT.jar
[INFO] Installing <http://hudson.zones.apache.org/hudson/job/axis2-transports-trunk/ws/transports/modules/jms/target/axis2-transport-jms-1.1.0-SNAPSHOT-sources.jar>
to /home/hudson/.m2/repository/org/apache/axis2/axis2-transport-jms/1.1.0-SNAPSHOT/axis2-transport-jms-1.1.0-SNAPSHOT-sources.jar
[INFO] [bundle:install {execution: default-install}]
[INFO] Parsing file:/home/hudson/.m2/repository/repository.xml
[INFO] Installing org/apache/axis2/axis2-transport-jms/1.1.0-SNAPSHOT/axis2-transport-jms-1.1.0-SNAPSHOT.jar
[INFO] Writing OBR metadata
[HUDSON] Archiving <http://hudson.zones.apache.org/hudson/job/axis2-transports-trunk/ws/transports/modules/jms/pom.xml>
to /export/home/hudson/hudson/jobs/axis2-transports-trunk/modules/org.apache.axis2$axis2-transport-jms/builds/2010-06-13_13-04-41/archive/org.apache.axis2/axis2-transport-jms/1.1.0-SNAPSHOT/pom.xml
[HUDSON] Archiving <http://hudson.zones.apache.org/hudson/job/axis2-transports-trunk/ws/transports/modules/jms/target/axis2-transport-jms-1.1.0-SNAPSHOT.jar>
to /export/home/hudson/hudson/jobs/axis2-transports-trunk/modules/org.apache.axis2$axis2-transport-jms/builds/2010-06-13_13-04-41/archive/org.apache.axis2/axis2-transport-jms/1.1.0-SNAPSHOT/axis2-transport-jms-1.1.0-SNAPSHOT.jar
[HUDSON] Archiving <http://hudson.zones.apache.org/hudson/job/axis2-transports-trunk/ws/transports/modules/jms/target/axis2-transport-jms-1.1.0-SNAPSHOT-sources.jar>
to /export/home/hudson/hudson/jobs/axis2-transports-trunk/modules/org.apache.axis2$axis2-transport-jms/builds/2010-06-13_13-04-41/archive/org.apache.axis2/axis2-transport-jms/1.1.0-SNAPSHOT/axis2-transport-jms-1.1.0-SNAPSHOT-sources.jar
[INFO] ------------------------------------------------------------------------
[INFO] Building Apache Axis2 - Transport - Sms
[INFO]    task-segment: [clean, install]
[INFO] ------------------------------------------------------------------------
[INFO] [clean:clean {execution: default-clean}]
[INFO] Deleting file set: <http://hudson.zones.apache.org/hudson/job/axis2-transports-trunk/ws/transports/modules/sms/target>
(included: [**], excluded: [])
[INFO] [remote-resources:process {execution: default}]
Downloading: http://repository.apache.org/snapshots/org/smslib/smslib/3.4.1/smslib-3.4.1.pom
[INFO] Unable to find resource 'org.smslib:smslib:pom:3.4.1' in repository apache-snapshots
(http://people.apache.org/repo/m2-snapshot-repository/)
Downloading: http://dist.wso2.org/maven2//org/smslib/smslib/3.4.1/smslib-3.4.1.pom
[INFO] Unable to find resource 'org.smslib:smslib:pom:3.4.1' in repository wso2-m2 (http://dist.wso2.org/maven2/)
Downloading: http://repo1.maven.org/maven2/org/smslib/smslib/3.4.1/smslib-3.4.1.pom
[INFO] Unable to find resource 'org.smslib:smslib:pom:3.4.1' in repository central (http://repo1.maven.org/maven2)
Downloading: http://repository.apache.org/snapshots/org/apache/neethi/neethi/3.0.0-SNAPSHOT/neethi-3.0.0-SNAPSHOT.jar
Downloading: http://repository.apache.org/snapshots/org/apache/woden/woden-api/1.0-SNAPSHOT/woden-api-1.0-SNAPSHOT.jar
[INFO] Unable to find resource 'org.apache.neethi:neethi:jar:3.0.0-SNAPSHOT' in repository
apache.snapshots (http://repository.apache.org/snapshots)
Downloading: http://repository.apache.org/snapshots/org/apache/woden/woden-impl-dom/1.0-SNAPSHOT/woden-impl-dom-1.0-SNAPSHOT.jar
Downloading: http://ws.zones.apache.org/repository2/org/apache/neethi/neethi/3.0.0-SNAPSHOT/neethi-3.0.0-SNAPSHOT.jar
[INFO] Unable to find resource 'org.apache.neethi:neethi:jar:3.0.0-SNAPSHOT' in repository
apache-ws-snapshots2 (http://ws.zones.apache.org/repository2)
Downloading: http://dist.wso2.org/maven2/org/apache/neethi/neethi/3.0.0-SNAPSHOT/neethi-3.0.0-SNAPSHOT.jar
Downloading: http://repository.apache.org/snapshots/org/apache/woden/woden-impl-commons/1.0-SNAPSHOT/woden-impl-commons-1.0-SNAPSHOT.jar
[INFO] Unable to find resource 'org.apache.neethi:neethi:jar:3.0.0-SNAPSHOT' in repository
wso2-maven2-repository (http://dist.wso2.org/maven2)
[HUDSON] Archiving <http://hudson.zones.apache.org/hudson/job/axis2-transports-trunk/ws/transports/modules/sms/pom.xml>
to /export/home/hudson/hudson/jobs/axis2-transports-trunk/modules/org.apache.axis2$axis2-transport-sms/builds/2010-06-13_13-04-41/archive/org.apache.axis2/axis2-transport-sms/1.1.0-SNAPSHOT/pom.xml
[INFO] ------------------------------------------------------------------------
[ERROR] BUILD ERROR
[INFO] ------------------------------------------------------------------------
[INFO] Failed to resolve artifact.

Missing:
----------
1) org.apache.woden:woden-api:jar:1.0-SNAPSHOT

  Try downloading the file manually from the project website.

  Then, install it using the command: 
      mvn install:install-file -DgroupId=org.apache.woden -DartifactId=woden-api -Dversion=1.0-SNAPSHOT
-Dpackaging=jar -Dfile=/path/to/file

  Alternatively, if you host your own repository you can deploy the file there: 
      mvn deploy:deploy-file -DgroupId=org.apache.woden -DartifactId=woden-api -Dversion=1.0-SNAPSHOT
-Dpackaging=jar -Dfile=/path/to/file -Durl=[url] -DrepositoryId=[id]

  Path to dependency: 
  	1) org.apache.axis2:axis2-transport-sms:bundle:1.1.0-SNAPSHOT
  	2) org.apache.axis2:axis2-kernel:jar:SNAPSHOT
  	3) org.apache.woden:woden-api:jar:1.0-SNAPSHOT

2) org.apache.woden:woden-impl-dom:jar:1.0-SNAPSHOT

  Try downloading the file manually from the project website.

  Then, install it using the command: 
      mvn install:install-file -DgroupId=org.apache.woden -DartifactId=woden-impl-dom -Dversion=1.0-SNAPSHOT
-Dpackaging=jar -Dfile=/path/to/file

  Alternatively, if you host your own repository you can deploy the file there: 
      mvn deploy:deploy-file -DgroupId=org.apache.woden -DartifactId=woden-impl-dom -Dversion=1.0-SNAPSHOT
-Dpackaging=jar -Dfile=/path/to/file -Durl=[url] -DrepositoryId=[id]

  Path to dependency: 
  	1) org.apache.axis2:axis2-transport-sms:bundle:1.1.0-SNAPSHOT
  	2) org.apache.axis2:axis2-kernel:jar:SNAPSHOT
  	3) org.apache.woden:woden-impl-dom:jar:1.0-SNAPSHOT

3) org.apache.woden:woden-impl-commons:jar:1.0-SNAPSHOT

  Try downloading the file manually from the project website.

  Then, install it using the command: 
      mvn install:install-file -DgroupId=org.apache.woden -DartifactId=woden-impl-commons
-Dversion=1.0-SNAPSHOT -Dpackaging=jar -Dfile=/path/to/file

  Alternatively, if you host your own repository you can deploy the file there: 
      mvn deploy:deploy-file -DgroupId=org.apache.woden -DartifactId=woden-impl-commons -Dversion=1.0-SNAPSHOT
-Dpackaging=jar -Dfile=/path/to/file -Durl=[url] -DrepositoryId=[id]

  Path to dependency: 
  	1) org.apache.axis2:axis2-transport-sms:bundle:1.1.0-SNAPSHOT
  	2) org.apache.axis2:axis2-kernel:jar:SNAPSHOT
  	3) org.apache.woden:woden-impl-dom:jar:1.0-SNAPSHOT
  	4) org.apache.woden:woden-impl-commons:jar:1.0-SNAPSHOT

----------
3 required artifacts are missing.

for artifact: 
  org.apache.axis2:axis2-transport-sms:bundle:1.1.0-SNAPSHOT

from the specified remote repositories:
  central (http://repo1.maven.org/maven2),
  Nexus (http://repository.apache.org/snapshots),
  wso2-m2 (http://dist.wso2.org/maven2/)



[INFO] ------------------------------------------------------------------------
[INFO] For more information, run Maven with the -e switch
[INFO] ------------------------------------------------------------------------
[INFO] Total time: 8 minutes 7 seconds
[INFO] Finished at: Sun Jun 13 13:12:58 UTC 2010
[INFO] Final Memory: 59M/290M
[INFO] ------------------------------------------------------------------------
Waiting for Hudson to finish collecting data
Sending e-mails to: java-dev@axis.apache.org andreas.veithen@gmail.com
channel stopped
[locks-and-latches] Releasing all the locks
[locks-and-latches] All the locks released


---------------------------------------------------------------------
To unsubscribe, e-mail: java-dev-unsubscribe@axis.apache.org
For additional commands, e-mail: java-dev-help@axis.apache.org


Mime
View raw message