ws-dev mailing list archives

Site index · List index
Message view « Date » · « Thread »
Top « Date » · « Thread »
From Apache Jenkins Server <jenk...@builds.apache.org>
Subject Build failed in Jenkins: wss4j-2.1 #178
Date Thu, 25 Apr 2019 10:49:56 GMT
See <https://builds.apache.org/job/wss4j-2.1/178/display/redirect?page=changes>

Changes:

[coheigea] Fixing tests

[coheigea] WSS-647 - Updating revocation keys

[coheigea] WSS-647 - More tests fixed

[coheigea] WSS-647 - Fixing more tests

[coheigea] WSS-647 - Updating most of the certs

------------------------------------------
Started by an SCM change
[EnvInject] - Loading node environment variables.
Building remotely on H35 (ubuntu xenial) in workspace <https://builds.apache.org/job/wss4j-2.1/ws/>
Updating http://svn.apache.org/repos/asf/webservices/wss4j/branches/2_1_x-fixes at revision
'2019-04-25T10:47:20.667 +0000'
U         ws-security-dom/src/test/java/org/apache/wss4j/dom/message/SignatureCertTest.java
U         ws-security-dom/src/test/java/org/apache/wss4j/dom/saml/ext/AssertionSigningTest.java
D         ws-security-dom/src/test/resources/wss40.properties
D         ws-security-dom/src/test/resources/wss40CA.properties
D         ws-security-dom/src/test/resources/wss86.properties
D         ws-security-dom/src/test/resources/wss40badca.properties
D         ws-security-dom/src/test/resources/wss40badcatrust.properties
D         ws-security-dom/src/test/resources/wss40rev.properties
D         ws-security-dom/src/test/resources/wss40All.properties
D         ws-security-dom/src/test/resources/alice.properties
U         ws-security-stax/src/test/java/org/apache/wss4j/stax/test/SignatureCRLTest.java
U         ws-security-stax/src/test/java/org/apache/wss4j/stax/test/SignatureIssuerCertConstaintsTest.java
U         ws-security-stax/src/test/java/org/apache/wss4j/stax/test/SignatureCertConstaintsTest.java
U         ws-security-stax/src/test/java/org/apache/wss4j/stax/test/EncryptionCRLTest.java
D         ws-security-stax/src/test/resources/wss40CACRL.pem
D         ws-security-stax/src/test/resources/wss40.jks
D         ws-security-stax/src/test/resources/wss40CA.jks
D         ws-security-stax/src/test/resources/wss40rev.jks
U         ws-security-common/src/test/java/org/apache/wss4j/common/crypto/SKITest.java
D         ws-security-common/src/test/resources/wss40_server.properties
D         ws-security-common/src/test/resources/keys/client_keystore.jks
D         ws-security-common/src/test/resources/keys/rsa2048.jks
D         ws-security-common/src/test/resources/keys/server_keystore.jks
U         ws-security-common/src/test/resources/keys/wss40badca.jks
A         ws-security-common/src/test/resources/keys/rsa1024.crt
U         ws-security-common/src/test/resources/keys/wss40rev.jks
U         ws-security-common/src/test/resources/keys/wss40exp.crt
U         ws-security-common/src/test/resources/keys/ca.db.serial
U         ws-security-common/src/test/resources/keys/wss40_server.pem
A         ws-security-common/src/test/resources/keys/ca.db.certs/20.pem
A         ws-security-common/src/test/resources/keys/ca.db.certs/21.pem
A         ws-security-common/src/test/resources/keys/ca.db.certs/22.pem
A         ws-security-common/src/test/resources/keys/ca.db.certs/23.pem
A         ws-security-common/src/test/resources/keys/ca.db.certs/24.pem
A         ws-security-common/src/test/resources/keys/ca.db.certs/25.pem
A         ws-security-common/src/test/resources/keys/ca.db.certs/26.pem
A         ws-security-common/src/test/resources/keys/ca.db.certs/27.pem
A         ws-security-common/src/test/resources/keys/ca.db.certs/28.pem
U         ws-security-common/src/test/resources/keys/ca.config
U         ws-security-common/src/test/resources/keys/wss40_server.jks
U         ws-security-common/src/test/resources/keys/wss40CA.pem
A         ws-security-common/src/test/resources/keys/rsa1024.cer
U         ws-security-common/src/test/resources/keys/wss40exp.cer
U         ws-security-common/src/test/resources/keys/wss40CACRL.pem
A         ws-security-common/src/test/resources/keys/wss40.crt
U         ws-security-common/src/test/resources/keys/wss40CA.jks
A         ws-security-common/src/test/resources/keys/rsa1024.pem
U         ws-security-common/src/test/resources/keys/wss40exp.pem
A         ws-security-common/src/test/resources/keys/rsa1024.jks
U         ws-security-common/src/test/resources/keys/wss40badcatrust.jks
U         ws-security-common/src/test/resources/keys/wss40exp.jks
U         ws-security-common/src/test/resources/keys/wss40rev.crt
A         ws-security-common/src/test/resources/keys/wss40.cer
U         ws-security-common/src/test/resources/keys/ca.db.index.old
U         ws-security-common/src/test/resources/keys/wss40_server.crt
U         ws-security-common/src/test/resources/keys/wss40CADupl.jks
U         ws-security-common/src/test/resources/keys/wss40.pem
U         ws-security-common/src/test/resources/keys/ca.db.serial.old
U         ws-security-common/src/test/resources/keys/wss40rev.cer
U         ws-security-common/src/test/resources/keys/wss40.jks
U         ws-security-common/src/test/resources/keys/wss40CA.crt
A         ws-security-common/src/test/resources/keys/README.txt
U         ws-security-common/src/test/resources/keys/wss40CAKey.pem
U         ws-security-common/src/test/resources/keys/ca.db.index
U         ws-security-common/src/test/resources/keys/wss40rev.pem
U         ws-security-common/src/test/resources/keys/wss40_server.cer
At revision 1858114

[wss4j] $ /home/jenkins/tools/maven/apache-maven-3.2.5/bin/mvn -Dmaven.repo.local=<https://builds.apache.org/job/wss4j-2.1/ws/.repository>
clean install -Pnochecks -Dmaven.test.skip.exec=true
[INFO] Scanning for projects...
Downloading: https://repo.maven.apache.org/maven2/org/apache/apache/21/apache-21.pom
[ERROR] The build could not read 1 project -> [Help 1]
[ERROR]   
[ERROR]   The project org.apache.wss4j:wss4j:2.1.13-SNAPSHOT (<https://builds.apache.org/job/wss4j-2.1/ws/wss4j/pom.xml)>
has 1 error
[ERROR]     Non-resolvable parent POM: Could not transfer artifact org.apache:apache:pom:21
from/to central (https://repo.maven.apache.org/maven2): Received fatal alert: protocol_version
and 'parent.relativePath' points at wrong local POM @ line 103, column 13 -> [Help 2]
[ERROR] 
[ERROR] To see the full stack trace of the errors, re-run Maven with the -e switch.
[ERROR] Re-run Maven using the -X switch to enable full debug logging.
[ERROR] 
[ERROR] For more information about the errors and possible solutions, please read the following
articles:
[ERROR] [Help 1] http://cwiki.apache.org/confluence/display/MAVEN/ProjectBuildingException
[ERROR] [Help 2] http://cwiki.apache.org/confluence/display/MAVEN/UnresolvableModelException
Build step 'Invoke top-level Maven targets' marked build as failure

---------------------------------------------------------------------
To unsubscribe, e-mail: dev-unsubscribe@ws.apache.org
For additional commands, e-mail: dev-help@ws.apache.org


Mime
View raw message