ws-dev mailing list archives

Site index · List index
Message view « Date » · « Thread »
Top « Date » · « Thread »
From Apache Jenkins Server <>
Subject Build failed in Jenkins: wss4j-2.1 #174
Date Fri, 27 Jul 2018 14:47:10 GMT
See <>


[coheigea] Updating BouncyCastle

Started by an SCM change
[EnvInject] - Loading node environment variables.
Building remotely on H27 (ubuntu xenial) in workspace <>
Updating at revision
'2018-07-27T14:46:51.509 +0000'
U         parent/pom.xml
U         pom.xml
At revision 1836834

[wss4j] $ /home/jenkins/tools/maven/apache-maven-3.2.5/bin/mvn -Dmaven.repo.local=<>
clean install -Pnochecks -Dmaven.test.skip.exec=true
[INFO] Scanning for projects...
[ERROR] The build could not read 1 project -> [Help 1]
[ERROR]   The project org.apache.wss4j:wss4j:2.1.13-SNAPSHOT (<>
has 1 error
[ERROR]     Non-resolvable parent POM: Could not transfer artifact org.apache:apache:pom:20
from/to central ( Received fatal alert: protocol_version
and 'parent.relativePath' points at wrong local POM @ line 103, column 13 -> [Help 2]
[ERROR] To see the full stack trace of the errors, re-run Maven with the -e switch.
[ERROR] Re-run Maven using the -X switch to enable full debug logging.
[ERROR] For more information about the errors and possible solutions, please read the following
[ERROR] [Help 1]
[ERROR] [Help 2]
Build step 'Invoke top-level Maven targets' marked build as failure

To unsubscribe, e-mail:
For additional commands, e-mail:

View raw message