ws-dev mailing list archives

Site index · List index
Message view « Date » · « Thread »
Top « Date » · « Thread »
From Apache Jenkins Server <jenk...@builds.apache.org>
Subject Build failed in Jenkins: axiom-trunk » Jaxen Test Suite #2901
Date Fri, 09 Jun 2017 23:58:45 GMT
See <https://builds.apache.org/job/axiom-trunk/org.apache.ws.commons.axiom$jaxen-testsuite/2901/display/redirect>

------------------------------------------
[INFO]                                                                         
[INFO] ------------------------------------------------------------------------
[INFO] Building Jaxen Test Suite 1.3.0-SNAPSHOT
[INFO] ------------------------------------------------------------------------
[INFO] 
[INFO] --- maven-clean-plugin:3.0.0:clean (default-clean) @ jaxen-testsuite ---
[INFO] 
[INFO] --- maven-enforcer-plugin:1.4.1:enforce (default) @ jaxen-testsuite ---
[INFO] 
[INFO] --- tidy-maven-plugin:1.0-beta-1:check (default) @ jaxen-testsuite ---
[INFO] 
[INFO] --- gmavenplus-plugin:1.5:execute (initialize) @ jaxen-testsuite ---
[INFO] Using Groovy 2.4.10 to perform execute.
[INFO] 
[INFO] --- jacoco-maven-plugin:0.7.9:prepare-agent (prepare-agent-for-surefire) @ jaxen-testsuite
---
[INFO] jacoco.surefireArgLine set to -javaagent:/home/jenkins/jenkins-slave/workspace/axiom-trunk/.repository/org/jacoco/org.jacoco.agent/0.7.9/org.jacoco.agent-0.7.9-runtime.jar=destfile=<https://builds.apache.org/job/axiom-trunk/org.apache.ws.commons.axiom$jaxen-testsuite/ws/target/jacoco.exec,sessionid=mvn>:org.apache.ws.commons.axiom:jaxen-testsuite:1.3.0-SNAPSHOT:surefire
[INFO] 
[INFO] --- jacoco-maven-plugin:0.7.9:prepare-agent (prepare-agent-for-failsafe) @ jaxen-testsuite
---
[INFO] jacoco.failsafeArgLine set to -javaagent:/home/jenkins/jenkins-slave/workspace/axiom-trunk/.repository/org/jacoco/org.jacoco.agent/0.7.9/org.jacoco.agent-0.7.9-runtime.jar=destfile=<https://builds.apache.org/job/axiom-trunk/org.apache.ws.commons.axiom$jaxen-testsuite/ws/target/jacoco.exec,sessionid=mvn>:org.apache.ws.commons.axiom:jaxen-testsuite:1.3.0-SNAPSHOT:failsafe
[INFO] 
[INFO] --- maven-remote-resources-plugin:1.5:process (process-resource-bundles) @ jaxen-testsuite
---
[INFO] 
[INFO] --- maven-remote-resources-plugin:1.5:process (default) @ jaxen-testsuite ---
[INFO] 
[INFO] --- maven-resources-plugin:2.7:resources (default-resources) @ jaxen-testsuite ---
[INFO] Using 'UTF-8' encoding to copy filtered resources.
[INFO] Copying 30 resources
[INFO] Copying 3 resources
[INFO] Copying 3 resources
[INFO] 
[INFO] --- maven-compiler-plugin:2.3.2:compile (default-compile) @ jaxen-testsuite ---
[INFO] Compiling 4 source files to <https://builds.apache.org/job/axiom-trunk/org.apache.ws.commons.axiom$jaxen-testsuite/ws/target/classes>
[INFO] -------------------------------------------------------------
[ERROR] COMPILATION ERROR : 
[INFO] -------------------------------------------------------------
[ERROR] <https://builds.apache.org/job/axiom-trunk/org.apache.ws.commons.axiom$jaxen-testsuite/ws/src/main/java/org/jaxen/test/XPathTestBase.java>:[63,16]
error: error while writing XPathTestBase: could not create parent directories
[INFO] 1 error
[INFO] -------------------------------------------------------------

---------------------------------------------------------------------
To unsubscribe, e-mail: dev-unsubscribe@ws.apache.org
For additional commands, e-mail: dev-help@ws.apache.org


Mime
View raw message