ws-dev mailing list archives

Site index · List index
Message view « Date » · « Thread »
Top « Date » · « Thread »
From Apache Jenkins Server <jenk...@builds.apache.org>
Subject Build failed in Jenkins: axiom-trunk #2901
Date Fri, 09 Jun 2017 23:58:47 GMT
See <https://builds.apache.org/job/axiom-trunk/2901/display/redirect?page=changes>

Changes:

[veithen] Remove unnecessary exclusions.

------------------------------------------
[...truncated 561.44 KB...]
[INFO] 
[INFO] --- maven-install-plugin:2.5.2:install (default-install) @ axiom-truth ---
[INFO] Installing <https://builds.apache.org/job/axiom-trunk/ws/axiom/testing/axiom-truth/target/axiom-truth-1.3.0-SNAPSHOT.jar>
to <https://builds.apache.org/job/axiom-trunk/ws/.repository/org/apache/ws/commons/axiom/axiom-truth/1.3.0-SNAPSHOT/axiom-truth-1.3.0-SNAPSHOT.jar>
[INFO] Installing <https://builds.apache.org/job/axiom-trunk/ws/axiom/testing/axiom-truth/pom.xml>
to <https://builds.apache.org/job/axiom-trunk/ws/.repository/org/apache/ws/commons/axiom/axiom-truth/1.3.0-SNAPSHOT/axiom-truth-1.3.0-SNAPSHOT.pom>
[INFO] Installing <https://builds.apache.org/job/axiom-trunk/ws/axiom/testing/axiom-truth/target/axiom-truth-1.3.0-SNAPSHOT-sources.jar>
to <https://builds.apache.org/job/axiom-trunk/ws/.repository/org/apache/ws/commons/axiom/axiom-truth/1.3.0-SNAPSHOT/axiom-truth-1.3.0-SNAPSHOT-sources.jar>
[INFO] Installing <https://builds.apache.org/job/axiom-trunk/ws/axiom/testing/axiom-truth/target/axiom-truth-1.3.0-SNAPSHOT-javadoc.jar>
to <https://builds.apache.org/job/axiom-trunk/ws/.repository/org/apache/ws/commons/axiom/axiom-truth/1.3.0-SNAPSHOT/axiom-truth-1.3.0-SNAPSHOT-javadoc.jar>
[INFO] 
[INFO] --- maven-deploy-plugin:2.8.2:deploy (default-deploy) @ axiom-truth ---
[INFO] Downloading: https://repository.apache.org/content/repositories/snapshots/org/apache/ws/commons/axiom/axiom-truth/1.3.0-SNAPSHOT/maven-metadata.xml
[INFO] Downloaded: https://repository.apache.org/content/repositories/snapshots/org/apache/ws/commons/axiom/axiom-truth/1.3.0-SNAPSHOT/maven-metadata.xml
(2 KB at 2.3 KB/sec)
[INFO] Uploading: https://repository.apache.org/content/repositories/snapshots/org/apache/ws/commons/axiom/axiom-truth/1.3.0-SNAPSHOT/axiom-truth-1.3.0-20170609.235758-439.jar
[INFO] Uploaded: https://repository.apache.org/content/repositories/snapshots/org/apache/ws/commons/axiom/axiom-truth/1.3.0-SNAPSHOT/axiom-truth-1.3.0-20170609.235758-439.jar
(17 KB at 18.2 KB/sec)
[INFO] Uploading: https://repository.apache.org/content/repositories/snapshots/org/apache/ws/commons/axiom/axiom-truth/1.3.0-SNAPSHOT/axiom-truth-1.3.0-20170609.235758-439.pom
[INFO] Uploaded: https://repository.apache.org/content/repositories/snapshots/org/apache/ws/commons/axiom/axiom-truth/1.3.0-SNAPSHOT/axiom-truth-1.3.0-20170609.235758-439.pom
(2 KB at 2.4 KB/sec)
[INFO] Downloading: https://repository.apache.org/content/repositories/snapshots/org/apache/ws/commons/axiom/axiom-truth/maven-metadata.xml
[INFO] Downloaded: https://repository.apache.org/content/repositories/snapshots/org/apache/ws/commons/axiom/axiom-truth/maven-metadata.xml
(399 B at 0.7 KB/sec)
[INFO] Uploading: https://repository.apache.org/content/repositories/snapshots/org/apache/ws/commons/axiom/axiom-truth/1.3.0-SNAPSHOT/maven-metadata.xml
[INFO] Uploaded: https://repository.apache.org/content/repositories/snapshots/org/apache/ws/commons/axiom/axiom-truth/1.3.0-SNAPSHOT/maven-metadata.xml
(2 KB at 1.5 KB/sec)
[INFO] Uploading: https://repository.apache.org/content/repositories/snapshots/org/apache/ws/commons/axiom/axiom-truth/maven-metadata.xml
[INFO] Uploaded: https://repository.apache.org/content/repositories/snapshots/org/apache/ws/commons/axiom/axiom-truth/maven-metadata.xml
(399 B at 0.5 KB/sec)
[INFO] Uploading: https://repository.apache.org/content/repositories/snapshots/org/apache/ws/commons/axiom/axiom-truth/1.3.0-SNAPSHOT/axiom-truth-1.3.0-20170609.235758-439-sources.jar
[INFO] Uploaded: https://repository.apache.org/content/repositories/snapshots/org/apache/ws/commons/axiom/axiom-truth/1.3.0-SNAPSHOT/axiom-truth-1.3.0-20170609.235758-439-sources.jar
(17 KB at 18.1 KB/sec)
[INFO] Uploading: https://repository.apache.org/content/repositories/snapshots/org/apache/ws/commons/axiom/axiom-truth/1.3.0-SNAPSHOT/maven-metadata.xml
[INFO] Uploaded: https://repository.apache.org/content/repositories/snapshots/org/apache/ws/commons/axiom/axiom-truth/1.3.0-SNAPSHOT/maven-metadata.xml
(2 KB at 1.4 KB/sec)
[INFO] Uploading: https://repository.apache.org/content/repositories/snapshots/org/apache/ws/commons/axiom/axiom-truth/1.3.0-SNAPSHOT/axiom-truth-1.3.0-20170609.235758-439-javadoc.jar
[INFO] Uploaded: https://repository.apache.org/content/repositories/snapshots/org/apache/ws/commons/axiom/axiom-truth/1.3.0-SNAPSHOT/axiom-truth-1.3.0-20170609.235758-439-javadoc.jar
(51 KB at 51.7 KB/sec)
[INFO] Uploading: https://repository.apache.org/content/repositories/snapshots/org/apache/ws/commons/axiom/axiom-truth/1.3.0-SNAPSHOT/maven-metadata.xml
[INFO] Uploaded: https://repository.apache.org/content/repositories/snapshots/org/apache/ws/commons/axiom/axiom-truth/1.3.0-SNAPSHOT/maven-metadata.xml
(2 KB at 1.5 KB/sec)
[INFO]                                                                         
[INFO] ------------------------------------------------------------------------
[INFO] Building Jaxen Test Suite 1.3.0-SNAPSHOT
[INFO] ------------------------------------------------------------------------
[INFO] 
[INFO] --- maven-clean-plugin:3.0.0:clean (default-clean) @ jaxen-testsuite ---
[INFO] 
[INFO] --- maven-enforcer-plugin:1.4.1:enforce (default) @ jaxen-testsuite ---
[INFO] 
[INFO] --- tidy-maven-plugin:1.0-beta-1:check (default) @ jaxen-testsuite ---
[INFO] 
[INFO] --- gmavenplus-plugin:1.5:execute (initialize) @ jaxen-testsuite ---
[INFO] Using Groovy 2.4.10 to perform execute.
[INFO] 
[INFO] --- jacoco-maven-plugin:0.7.9:prepare-agent (prepare-agent-for-surefire) @ jaxen-testsuite
---
[INFO] jacoco.surefireArgLine set to -javaagent:<https://builds.apache.org/job/axiom-trunk/ws/.repository/org/jacoco/org.jacoco.agent/0.7.9/org.jacoco.agent-0.7.9-runtime.jar=destfile=/home/jenkins/jenkins-slave/workspace/axiom-trunk/axiom/testing/jaxen-testsuite/target/jacoco.exec,sessionid=mvn>:org.apache.ws.commons.axiom:jaxen-testsuite:1.3.0-SNAPSHOT:surefire
[INFO] 
[INFO] --- jacoco-maven-plugin:0.7.9:prepare-agent (prepare-agent-for-failsafe) @ jaxen-testsuite
---
[INFO] jacoco.failsafeArgLine set to -javaagent:<https://builds.apache.org/job/axiom-trunk/ws/.repository/org/jacoco/org.jacoco.agent/0.7.9/org.jacoco.agent-0.7.9-runtime.jar=destfile=/home/jenkins/jenkins-slave/workspace/axiom-trunk/axiom/testing/jaxen-testsuite/target/jacoco.exec,sessionid=mvn>:org.apache.ws.commons.axiom:jaxen-testsuite:1.3.0-SNAPSHOT:failsafe
[INFO] 
[INFO] --- maven-remote-resources-plugin:1.5:process (process-resource-bundles) @ jaxen-testsuite
---
[INFO] 
[INFO] --- maven-remote-resources-plugin:1.5:process (default) @ jaxen-testsuite ---
[INFO] 
[INFO] --- maven-resources-plugin:2.7:resources (default-resources) @ jaxen-testsuite ---
[INFO] Using 'UTF-8' encoding to copy filtered resources.
[INFO] Copying 30 resources
[INFO] Copying 3 resources
[INFO] Copying 3 resources
[INFO] 
[INFO] --- maven-compiler-plugin:2.3.2:compile (default-compile) @ jaxen-testsuite ---
[INFO] Compiling 4 source files to <https://builds.apache.org/job/axiom-trunk/ws/axiom/testing/jaxen-testsuite/target/classes>
[INFO] -------------------------------------------------------------
[ERROR] COMPILATION ERROR : 
[INFO] -------------------------------------------------------------
[ERROR] <https://builds.apache.org/job/axiom-trunk/ws/axiom/testing/jaxen-testsuite/src/main/java/org/jaxen/test/XPathTestBase.java>:[63,16]
error: error while writing XPathTestBase: could not create parent directories
[INFO] 1 error
[INFO] -------------------------------------------------------------
[INFO] ------------------------------------------------------------------------
[INFO] Reactor Summary:
[INFO] 
[INFO] Axiom .............................................. SUCCESS [ 13.047 s]
[INFO] Build utilities .................................... SUCCESS [  5.126 s]
[INFO] buildutils-maven-plugin ............................ SUCCESS [ 17.555 s]
[INFO] JAR Resource Bundle ................................ SUCCESS [  8.272 s]
[INFO] Resource Transformer for META-INF/axiom.xml files .. SUCCESS [ 12.761 s]
[INFO] components ......................................... SUCCESS [  5.321 s]
[INFO] base64-utils ....................................... SUCCESS [ 11.860 s]
[INFO] Testing ............................................ SUCCESS [  6.694 s]
[INFO] Multiton pattern implementation .................... SUCCESS [ 11.931 s]
[INFO] Axiom Test Utilities ............................... SUCCESS [ 23.288 s]
[INFO] XML Test Suite ..................................... SUCCESS [ 13.118 s]
[INFO] jaxp-testsuite ..................................... SUCCESS [ 16.265 s]
[INFO] Google Truth extension for XML ..................... SUCCESS [ 37.399 s]
[INFO] xml-utils .......................................... SUCCESS [ 27.473 s]
[INFO] SOAP Test Suite .................................... SUCCESS [ 15.853 s]
[INFO] Axiom API .......................................... SUCCESS [01:25 min]
[INFO] core-streams ....................................... SUCCESS [ 21.411 s]
[INFO] Aspects ............................................ SUCCESS [  5.425 s]
[INFO] Core Aspects ....................................... SUCCESS [ 15.975 s]
[INFO] Shared Aspects ..................................... SUCCESS [ 13.207 s]
[INFO] OM Aspects ......................................... SUCCESS [ 25.026 s]
[INFO] Google Truth extension for Axiom ................... SUCCESS [ 12.162 s]
[INFO] Jaxen Test Suite ................................... FAILURE [  1.592 s]
[INFO] Axiom Implementation Test Suite .................... SKIPPED
[INFO] Implementations .................................... SKIPPED
[INFO] LLOM ............................................... SKIPPED
[INFO] DOM Aspects ........................................ SKIPPED
[INFO] DOM Test Suite ..................................... SKIPPED
[INFO] DOOM ............................................... SKIPPED
[INFO] Axiom Compatibility Classes ........................ SKIPPED
[INFO] Axiom Uber-JAR ..................................... SKIPPED
[INFO] Samples ............................................ SKIPPED
[INFO] System Tests ....................................... SKIPPED
[INFO] compat-tests ....................................... SKIPPED
[INFO] Cross OM Tests ..................................... SKIPPED
[INFO] Eclipse Tests ...................................... SKIPPED
[INFO] Wildfly Tests ...................................... SKIPPED
[INFO] Axiom Test Suite (old) ............................. SKIPPED
[INFO] Axiom OSGi Tests ................................... SKIPPED
[INFO] Spring-WS Test Suite ............................... SKIPPED
[INFO] Spring WS Tests .................................... SKIPPED
[INFO] WSS4J Tests ........................................ SKIPPED
[INFO] Developer Guide .................................... SKIPPED
[INFO] User Guide ......................................... SKIPPED
[INFO] Javadoc ............................................ SKIPPED
[INFO] Distribution ....................................... SKIPPED
[INFO] Code Coverage Report ............................... SKIPPED
[INFO] SAAJ Test Suite .................................... SKIPPED
[INFO] ------------------------------------------------------------------------
[INFO] BUILD FAILURE
[INFO] ------------------------------------------------------------------------
[INFO] Total time: 07:15 min
[INFO] Finished at: 2017-06-09T23:58:17+00:00
[INFO] Final Memory: 192M/416M
[INFO] ------------------------------------------------------------------------
Waiting for Jenkins to finish collecting data
[ERROR] Failed to execute goal org.apache.maven.plugins:maven-compiler-plugin:2.3.2:compile
(default-compile) on project jaxen-testsuite: Compilation failure
[ERROR] <https://builds.apache.org/job/axiom-trunk/ws/axiom/testing/jaxen-testsuite/src/main/java/org/jaxen/test/XPathTestBase.java>:[63,16]
error: error while writing XPathTestBase: could not create parent directories
[ERROR] -> [Help 1]
[ERROR] 
[ERROR] To see the full stack trace of the errors, re-run Maven with the -e switch.
[ERROR] Re-run Maven using the -X switch to enable full debug logging.
[ERROR] 
[ERROR] For more information about the errors and possible solutions, please read the following
articles:
[ERROR] [Help 1] http://cwiki.apache.org/confluence/display/MAVEN/MojoFailureException
[ERROR] 
[ERROR] After correcting the problems, you can resume the build with the command
[ERROR]   mvn <goals> -rf :jaxen-testsuite
[JENKINS] Archiving <https://builds.apache.org/job/axiom-trunk/ws/axiom/aspects/core-aspects/pom.xml>
to org.apache.ws.commons.axiom/core-aspects/1.3.0-SNAPSHOT/core-aspects-1.3.0-SNAPSHOT.pom
[JENKINS] Archiving <https://builds.apache.org/job/axiom-trunk/ws/axiom/aspects/core-aspects/target/core-aspects-1.3.0-SNAPSHOT.jar>
to org.apache.ws.commons.axiom/core-aspects/1.3.0-20170609.235705-440/core-aspects-1.3.0-20170609.235705-440.jar
[JENKINS] Archiving <https://builds.apache.org/job/axiom-trunk/ws/axiom/aspects/core-aspects/target/core-aspects-1.3.0-SNAPSHOT-sources.jar>
to org.apache.ws.commons.axiom/core-aspects/1.3.0-20170609.235705-440/core-aspects-1.3.0-20170609.235705-440-sources.jar
[JENKINS] Archiving <https://builds.apache.org/job/axiom-trunk/ws/axiom/aspects/core-aspects/target/core-aspects-1.3.0-SNAPSHOT-javadoc.jar>
to org.apache.ws.commons.axiom/core-aspects/1.3.0-20170609.235705-440/core-aspects-1.3.0-20170609.235705-440-javadoc.jar
[JENKINS] Archiving <https://builds.apache.org/job/axiom-trunk/ws/axiom/components/xml-utils/pom.xml>
to org.apache.ws.commons.axiom/xml-utils/1.3.0-SNAPSHOT/xml-utils-1.3.0-SNAPSHOT.pom
[JENKINS] Archiving <https://builds.apache.org/job/axiom-trunk/ws/axiom/components/xml-utils/target/xml-utils-1.3.0-SNAPSHOT.jar>
to org.apache.ws.commons.axiom/xml-utils/1.3.0-20170609.235435-440/xml-utils-1.3.0-20170609.235435-440.jar
[JENKINS] Archiving <https://builds.apache.org/job/axiom-trunk/ws/axiom/components/xml-utils/target/xml-utils-1.3.0-SNAPSHOT-sources.jar>
to org.apache.ws.commons.axiom/xml-utils/1.3.0-20170609.235435-440/xml-utils-1.3.0-20170609.235435-440-sources.jar
[JENKINS] Archiving <https://builds.apache.org/job/axiom-trunk/ws/axiom/components/xml-utils/target/xml-utils-1.3.0-SNAPSHOT-javadoc.jar>
to org.apache.ws.commons.axiom/xml-utils/1.3.0-20170609.235435-440/xml-utils-1.3.0-20170609.235435-440-javadoc.jar
[JENKINS] Archiving <https://builds.apache.org/job/axiom-trunk/ws/axiom/components/xml-utils/target/jacoco.exec>
to org.apache.ws.commons.axiom/xml-utils/1.3.0-20170609.235435-440/xml-utils-1.3.0-20170609.235435-440-jacoco.exec
[JENKINS] Archiving <https://builds.apache.org/job/axiom-trunk/ws/axiom/systests/wss4j-tests/pom.xml>
to org.apache.ws.commons.axiom/wss4j-tests/1.3.0-SNAPSHOT/wss4j-tests-1.3.0-SNAPSHOT.pom
[JENKINS] Archiving <https://builds.apache.org/job/axiom-trunk/ws/axiom/code-coverage/pom.xml>
to org.apache.ws.commons.axiom/code-coverage/1.3.0-SNAPSHOT/code-coverage-1.3.0-SNAPSHOT.pom
[JENKINS] Archiving <https://builds.apache.org/job/axiom-trunk/ws/axiom/pom.xml> to
org.apache.ws.commons.axiom/axiom/1.3.0-SNAPSHOT/axiom-1.3.0-SNAPSHOT.pom
[JENKINS] Archiving <https://builds.apache.org/job/axiom-trunk/ws/axiom/target/axiom-1.3.0-SNAPSHOT-site.xml>
to org.apache.ws.commons.axiom/axiom/1.3.0-20170609.235112-447/axiom-1.3.0-20170609.235112-447-site.xml
[JENKINS] Archiving <https://builds.apache.org/job/axiom-trunk/ws/axiom/testing/soap-testsuite/pom.xml>
to org.apache.ws.commons.axiom/soap-testsuite/1.3.0-SNAPSHOT/soap-testsuite-1.3.0-SNAPSHOT.pom
[JENKINS] Archiving <https://builds.apache.org/job/axiom-trunk/ws/axiom/testing/soap-testsuite/target/soap-testsuite-1.3.0-SNAPSHOT.jar>
to org.apache.ws.commons.axiom/soap-testsuite/1.3.0-20170609.235452-440/soap-testsuite-1.3.0-20170609.235452-440.jar
[JENKINS] Archiving <https://builds.apache.org/job/axiom-trunk/ws/axiom/testing/soap-testsuite/target/soap-testsuite-1.3.0-SNAPSHOT-sources.jar>
to org.apache.ws.commons.axiom/soap-testsuite/1.3.0-20170609.235452-440/soap-testsuite-1.3.0-20170609.235452-440-sources.jar
[JENKINS] Archiving <https://builds.apache.org/job/axiom-trunk/ws/axiom/testing/soap-testsuite/target/soap-testsuite-1.3.0-SNAPSHOT-javadoc.jar>
to org.apache.ws.commons.axiom/soap-testsuite/1.3.0-20170609.235452-440/soap-testsuite-1.3.0-20170609.235452-440-javadoc.jar
[JENKINS] Archiving <https://builds.apache.org/job/axiom-trunk/ws/axiom/testing/soap-testsuite/target/jacoco.exec>
to org.apache.ws.commons.axiom/soap-testsuite/1.3.0-20170609.235452-440/soap-testsuite-1.3.0-20170609.235452-440-jacoco.exec
Compressed 408.40 KB of artifacts by 31.3% relative to #2900
[JENKINS] Archiving <https://builds.apache.org/job/axiom-trunk/ws/axiom/implementations/pom.xml>
to org.apache.ws.commons.axiom/implementations/1.3.0-SNAPSHOT/implementations-1.3.0-SNAPSHOT.pom
[JENKINS] Archiving <https://builds.apache.org/job/axiom-trunk/ws/axiom/systests/pom.xml>
to org.apache.ws.commons.axiom/systests/1.3.0-SNAPSHOT/systests-1.3.0-SNAPSHOT.pom
[JENKINS] Archiving <https://builds.apache.org/job/axiom-trunk/ws/axiom/userguide/pom.xml>
to org.apache.ws.commons.axiom/userguide/1.3.0-SNAPSHOT/userguide-1.3.0-SNAPSHOT.pom
[JENKINS] Archiving <https://builds.apache.org/job/axiom-trunk/ws/axiom/devguide/pom.xml>
to org.apache.ws.commons.axiom/devguide/1.3.0-SNAPSHOT/devguide-1.3.0-SNAPSHOT.pom
[JENKINS] Archiving <https://builds.apache.org/job/axiom-trunk/ws/axiom/distribution/pom.xml>
to org.apache.ws.commons.axiom/distribution/1.3.0-SNAPSHOT/distribution-1.3.0-SNAPSHOT.pom
[JENKINS] Archiving <https://builds.apache.org/job/axiom-trunk/ws/axiom/testing/axiom-truth/pom.xml>
to org.apache.ws.commons.axiom/axiom-truth/1.3.0-SNAPSHOT/axiom-truth-1.3.0-SNAPSHOT.pom
[JENKINS] Archiving <https://builds.apache.org/job/axiom-trunk/ws/axiom/testing/axiom-truth/target/axiom-truth-1.3.0-SNAPSHOT.jar>
to org.apache.ws.commons.axiom/axiom-truth/1.3.0-20170609.235758-439/axiom-truth-1.3.0-20170609.235758-439.jar
[JENKINS] Archiving <https://builds.apache.org/job/axiom-trunk/ws/axiom/testing/axiom-truth/target/axiom-truth-1.3.0-SNAPSHOT-sources.jar>
to org.apache.ws.commons.axiom/axiom-truth/1.3.0-20170609.235758-439/axiom-truth-1.3.0-20170609.235758-439-sources.jar
[JENKINS] Archiving <https://builds.apache.org/job/axiom-trunk/ws/axiom/testing/axiom-truth/target/axiom-truth-1.3.0-SNAPSHOT-javadoc.jar>
to org.apache.ws.commons.axiom/axiom-truth/1.3.0-20170609.235758-439/axiom-truth-1.3.0-20170609.235758-439-javadoc.jar
[JENKINS] Archiving <https://builds.apache.org/job/axiom-trunk/ws/axiom/buildutils/jar-resource-bundle/pom.xml>
to org.apache.ws.commons.axiom/jar-resource-bundle/1.3.0-SNAPSHOT/jar-resource-bundle-1.3.0-SNAPSHOT.pom
[JENKINS] Archiving <https://builds.apache.org/job/axiom-trunk/ws/axiom/buildutils/jar-resource-bundle/target/jar-resource-bundle-1.3.0-SNAPSHOT.jar>
to org.apache.ws.commons.axiom/jar-resource-bundle/1.3.0-20170609.235145-446/jar-resource-bundle-1.3.0-20170609.235145-446.jar
[JENKINS] Archiving <https://builds.apache.org/job/axiom-trunk/ws/axiom/buildutils/jar-resource-bundle/target/jar-resource-bundle-1.3.0-SNAPSHOT-sources.jar>
to org.apache.ws.commons.axiom/jar-resource-bundle/1.3.0-20170609.235145-446/jar-resource-bundle-1.3.0-20170609.235145-446-sources.jar
[JENKINS] Archiving <https://builds.apache.org/job/axiom-trunk/ws/axiom/buildutils/buildutils-maven-plugin/pom.xml>
to org.apache.ws.commons.axiom/buildutils-maven-plugin/1.3.0-SNAPSHOT/buildutils-maven-plugin-1.3.0-SNAPSHOT.pom
[JENKINS] Archiving <https://builds.apache.org/job/axiom-trunk/ws/axiom/buildutils/buildutils-maven-plugin/target/buildutils-maven-plugin-1.3.0-SNAPSHOT.jar>
to org.apache.ws.commons.axiom/buildutils-maven-plugin/1.3.0-20170609.235132-12/buildutils-maven-plugin-1.3.0-20170609.235132-12.jar
[JENKINS] Archiving <https://builds.apache.org/job/axiom-trunk/ws/axiom/buildutils/buildutils-maven-plugin/target/buildutils-maven-plugin-1.3.0-SNAPSHOT-sources.jar>
to org.apache.ws.commons.axiom/buildutils-maven-plugin/1.3.0-20170609.235132-12/buildutils-maven-plugin-1.3.0-20170609.235132-12-sources.jar
[JENKINS] Archiving <https://builds.apache.org/job/axiom-trunk/ws/axiom/buildutils/buildutils-maven-plugin/target/buildutils-maven-plugin-1.3.0-SNAPSHOT-javadoc.jar>
to org.apache.ws.commons.axiom/buildutils-maven-plugin/1.3.0-20170609.235132-12/buildutils-maven-plugin-1.3.0-20170609.235132-12-javadoc.jar
[JENKINS] Archiving <https://builds.apache.org/job/axiom-trunk/ws/axiom/testing/pom.xml>
to org.apache.ws.commons.axiom/testing/1.3.0-SNAPSHOT/testing-1.3.0-SNAPSHOT.pom
[JENKINS] Archiving <https://builds.apache.org/job/axiom-trunk/ws/axiom/testing/target/testing-1.3.0-SNAPSHOT-site.xml>
to org.apache.ws.commons.axiom/testing/1.3.0-20170609.235225-443/testing-1.3.0-20170609.235225-443-site.xml
[JENKINS] Archiving <https://builds.apache.org/job/axiom-trunk/ws/axiom/systests/osgi-tests/pom.xml>
to org.apache.ws.commons.axiom/osgi-tests/1.3.0-SNAPSHOT/osgi-tests-1.3.0-SNAPSHOT.pom
[JENKINS] Archiving <https://builds.apache.org/job/axiom-trunk/ws/axiom/testing/saaj-testsuite/pom.xml>
to org.apache.ws.commons.axiom/saaj-testsuite/1.3.0-SNAPSHOT/saaj-testsuite-1.3.0-SNAPSHOT.pom
[JENKINS] Archiving <https://builds.apache.org/job/axiom-trunk/ws/axiom/systests/spring-ws-tests/pom.xml>
to org.apache.ws.commons.axiom/spring-ws-tests/1.3.0-SNAPSHOT/spring-ws-tests-1.3.0-SNAPSHOT.pom
[JENKINS] Archiving <https://builds.apache.org/job/axiom-trunk/ws/axiom/systests/cross-om-tests/pom.xml>
to org.apache.ws.commons.axiom/cross-om-tests/1.3.0-SNAPSHOT/cross-om-tests-1.3.0-SNAPSHOT.pom
[JENKINS] Archiving <https://builds.apache.org/job/axiom-trunk/ws/axiom/testing/spring-ws-testsuite/pom.xml>
to org.apache.ws.commons.axiom/spring-ws-testsuite/1.3.0-SNAPSHOT/spring-ws-testsuite-1.3.0-SNAPSHOT.pom
[JENKINS] Archiving <https://builds.apache.org/job/axiom-trunk/ws/axiom/aspects/dom-aspects/pom.xml>
to org.apache.ws.commons.axiom/dom-aspects/1.3.0-SNAPSHOT/dom-aspects-1.3.0-SNAPSHOT.pom
[JENKINS] Archiving <https://builds.apache.org/job/axiom-trunk/ws/axiom/aspects/om-aspects/pom.xml>
to org.apache.ws.commons.axiom/om-aspects/1.3.0-SNAPSHOT/om-aspects-1.3.0-SNAPSHOT.pom
[JENKINS] Archiving <https://builds.apache.org/job/axiom-trunk/ws/axiom/aspects/om-aspects/target/om-aspects-1.3.0-SNAPSHOT.jar>
to org.apache.ws.commons.axiom/om-aspects/1.3.0-20170609.235743-439/om-aspects-1.3.0-20170609.235743-439.jar
[JENKINS] Archiving <https://builds.apache.org/job/axiom-trunk/ws/axiom/aspects/om-aspects/target/om-aspects-1.3.0-SNAPSHOT-sources.jar>
to org.apache.ws.commons.axiom/om-aspects/1.3.0-20170609.235743-439/om-aspects-1.3.0-20170609.235743-439-sources.jar
[JENKINS] Archiving <https://builds.apache.org/job/axiom-trunk/ws/axiom/aspects/om-aspects/target/om-aspects-1.3.0-SNAPSHOT-javadoc.jar>
to org.apache.ws.commons.axiom/om-aspects/1.3.0-20170609.235743-439/om-aspects-1.3.0-20170609.235743-439-javadoc.jar
[JENKINS] Archiving <https://builds.apache.org/job/axiom-trunk/ws/axiom/aspects/om-aspects/target/jacoco.exec>
to org.apache.ws.commons.axiom/om-aspects/1.3.0-20170609.235743-439/om-aspects-1.3.0-20170609.235743-439-jacoco.exec
Compressed 1.49 MB of artifacts by 20.9% relative to #2900
[JENKINS] Archiving <https://builds.apache.org/job/axiom-trunk/ws/axiom/implementations/axiom-dom/pom.xml>
to org.apache.ws.commons.axiom/axiom-dom/1.3.0-SNAPSHOT/axiom-dom-1.3.0-SNAPSHOT.pom
[JENKINS] Archiving <https://builds.apache.org/job/axiom-trunk/ws/axiom/components/base64-utils/pom.xml>
to org.apache.ws.commons.axiom/base64-utils/1.3.0-SNAPSHOT/base64-utils-1.3.0-SNAPSHOT.pom
[JENKINS] Archiving <https://builds.apache.org/job/axiom-trunk/ws/axiom/components/base64-utils/target/base64-utils-1.3.0-SNAPSHOT.jar>
to org.apache.ws.commons.axiom/base64-utils/1.3.0-20170609.235215-45/base64-utils-1.3.0-20170609.235215-45.jar
[JENKINS] Archiving <https://builds.apache.org/job/axiom-trunk/ws/axiom/components/base64-utils/target/base64-utils-1.3.0-SNAPSHOT-sources.jar>
to org.apache.ws.commons.axiom/base64-utils/1.3.0-20170609.235215-45/base64-utils-1.3.0-20170609.235215-45-sources.jar
[JENKINS] Archiving <https://builds.apache.org/job/axiom-trunk/ws/axiom/components/base64-utils/target/base64-utils-1.3.0-SNAPSHOT-javadoc.jar>
to org.apache.ws.commons.axiom/base64-utils/1.3.0-20170609.235215-45/base64-utils-1.3.0-20170609.235215-45-javadoc.jar
[JENKINS] Archiving <https://builds.apache.org/job/axiom-trunk/ws/axiom/testing/jaxp-testsuite/pom.xml>
to org.apache.ws.commons.axiom/jaxp-testsuite/1.3.0-SNAPSHOT/jaxp-testsuite-1.3.0-SNAPSHOT.pom
[JENKINS] Archiving <https://builds.apache.org/job/axiom-trunk/ws/axiom/testing/jaxp-testsuite/target/jaxp-testsuite-1.3.0-SNAPSHOT.jar>
to org.apache.ws.commons.axiom/jaxp-testsuite/1.3.0-20170609.235329-440/jaxp-testsuite-1.3.0-20170609.235329-440.jar
[JENKINS] Archiving <https://builds.apache.org/job/axiom-trunk/ws/axiom/testing/jaxp-testsuite/target/jaxp-testsuite-1.3.0-SNAPSHOT-sources.jar>
to org.apache.ws.commons.axiom/jaxp-testsuite/1.3.0-20170609.235329-440/jaxp-testsuite-1.3.0-20170609.235329-440-sources.jar
[JENKINS] Archiving <https://builds.apache.org/job/axiom-trunk/ws/axiom/testing/jaxp-testsuite/target/jaxp-testsuite-1.3.0-SNAPSHOT-javadoc.jar>
to org.apache.ws.commons.axiom/jaxp-testsuite/1.3.0-20170609.235329-440/jaxp-testsuite-1.3.0-20170609.235329-440-javadoc.jar
[JENKINS] Archiving <https://builds.apache.org/job/axiom-trunk/ws/axiom/testing/jaxp-testsuite/target/jacoco.exec>
to org.apache.ws.commons.axiom/jaxp-testsuite/1.3.0-20170609.235329-440/jaxp-testsuite-1.3.0-20170609.235329-440-jacoco.exec
[JENKINS] Archiving <https://builds.apache.org/job/axiom-trunk/ws/axiom/testing/jaxen-testsuite/pom.xml>
to org.apache.ws.commons.axiom/jaxen-testsuite/1.3.0-SNAPSHOT/jaxen-testsuite-1.3.0-SNAPSHOT.pom
[JENKINS] Archiving <https://builds.apache.org/job/axiom-trunk/ws/axiom/systests/eclipse-tests/pom.xml>
to org.apache.ws.commons.axiom/eclipse-tests/1.3.0-SNAPSHOT/eclipse-tests-1.3.0-SNAPSHOT.pom
[JENKINS] Archiving <https://builds.apache.org/job/axiom-trunk/ws/axiom/aspects/shared-aspects/pom.xml>
to org.apache.ws.commons.axiom/shared-aspects/1.3.0-SNAPSHOT/shared-aspects-1.3.0-SNAPSHOT.pom
[JENKINS] Archiving <https://builds.apache.org/job/axiom-trunk/ws/axiom/aspects/shared-aspects/target/shared-aspects-1.3.0-SNAPSHOT.jar>
to org.apache.ws.commons.axiom/shared-aspects/1.3.0-20170609.235720-440/shared-aspects-1.3.0-20170609.235720-440.jar
[JENKINS] Archiving <https://builds.apache.org/job/axiom-trunk/ws/axiom/aspects/shared-aspects/target/shared-aspects-1.3.0-SNAPSHOT-sources.jar>
to org.apache.ws.commons.axiom/shared-aspects/1.3.0-20170609.235720-440/shared-aspects-1.3.0-20170609.235720-440-sources.jar
[JENKINS] Archiving <https://builds.apache.org/job/axiom-trunk/ws/axiom/aspects/shared-aspects/target/shared-aspects-1.3.0-SNAPSHOT-javadoc.jar>
to org.apache.ws.commons.axiom/shared-aspects/1.3.0-20170609.235720-440/shared-aspects-1.3.0-20170609.235720-440-javadoc.jar
[JENKINS] Archiving <https://builds.apache.org/job/axiom-trunk/ws/axiom/axiom-api/pom.xml>
to org.apache.ws.commons.axiom/axiom-api/1.3.0-SNAPSHOT/axiom-api-1.3.0-SNAPSHOT.pom
[JENKINS] Archiving <https://builds.apache.org/job/axiom-trunk/ws/axiom/axiom-api/target/axiom-api-1.3.0-SNAPSHOT.jar>
to org.apache.ws.commons.axiom/axiom-api/1.3.0-20170609.235616-440/axiom-api-1.3.0-20170609.235616-440.jar
[JENKINS] Archiving <https://builds.apache.org/job/axiom-trunk/ws/axiom/axiom-api/target/axiom-api-1.3.0-SNAPSHOT-sources.jar>
to org.apache.ws.commons.axiom/axiom-api/1.3.0-20170609.235616-440/axiom-api-1.3.0-20170609.235616-440-sources.jar
[JENKINS] Archiving <https://builds.apache.org/job/axiom-trunk/ws/axiom/axiom-api/target/axiom-api-1.3.0-SNAPSHOT-javadoc.jar>
to org.apache.ws.commons.axiom/axiom-api/1.3.0-20170609.235616-440/axiom-api-1.3.0-20170609.235616-440-javadoc.jar
[JENKINS] Archiving <https://builds.apache.org/job/axiom-trunk/ws/axiom/axiom-api/target/jacoco.exec>
to org.apache.ws.commons.axiom/axiom-api/1.3.0-20170609.235616-440/axiom-api-1.3.0-20170609.235616-440-jacoco.exec
[JENKINS] Archiving <https://builds.apache.org/job/axiom-trunk/ws/axiom/buildutils/shade-axiom-xml/pom.xml>
to org.apache.ws.commons.axiom/shade-axiom-xml/1.3.0-SNAPSHOT/shade-axiom-xml-1.3.0-SNAPSHOT.pom
[JENKINS] Archiving <https://builds.apache.org/job/axiom-trunk/ws/axiom/buildutils/shade-axiom-xml/target/shade-axiom-xml-1.3.0-SNAPSHOT.jar>
to org.apache.ws.commons.axiom/shade-axiom-xml/1.3.0-20170609.235156-445/shade-axiom-xml-1.3.0-20170609.235156-445.jar
[JENKINS] Archiving <https://builds.apache.org/job/axiom-trunk/ws/axiom/buildutils/shade-axiom-xml/target/shade-axiom-xml-1.3.0-SNAPSHOT-sources.jar>
to org.apache.ws.commons.axiom/shade-axiom-xml/1.3.0-20170609.235156-445/shade-axiom-xml-1.3.0-20170609.235156-445-sources.jar
[JENKINS] Archiving <https://builds.apache.org/job/axiom-trunk/ws/axiom/buildutils/shade-axiom-xml/target/shade-axiom-xml-1.3.0-SNAPSHOT-javadoc.jar>
to org.apache.ws.commons.axiom/shade-axiom-xml/1.3.0-20170609.235156-445/shade-axiom-xml-1.3.0-20170609.235156-445-javadoc.jar
[JENKINS] Archiving <https://builds.apache.org/job/axiom-trunk/ws/axiom/testing/dom-testsuite/pom.xml>
to org.apache.ws.commons.axiom/dom-testsuite/1.3.0-SNAPSHOT/dom-testsuite-1.3.0-SNAPSHOT.pom
[JENKINS] Archiving <https://builds.apache.org/job/axiom-trunk/ws/axiom/implementations/axiom-impl/pom.xml>
to org.apache.ws.commons.axiom/axiom-impl/1.3.0-SNAPSHOT/axiom-impl-1.3.0-SNAPSHOT.pom
[JENKINS] Archiving <https://builds.apache.org/job/axiom-trunk/ws/axiom/systests/wildfly-tests/pom.xml>
to org.apache.ws.commons.axiom/wildfly-tests/1.3.0-SNAPSHOT/wildfly-tests-1.3.0-SNAPSHOT.pom
[JENKINS] Archiving <https://builds.apache.org/job/axiom-trunk/ws/axiom/components/core-streams/pom.xml>
to org.apache.ws.commons.axiom/core-streams/1.3.0-SNAPSHOT/core-streams-1.3.0-SNAPSHOT.pom
[JENKINS] Archiving <https://builds.apache.org/job/axiom-trunk/ws/axiom/components/core-streams/target/core-streams-1.3.0-SNAPSHOT.jar>
to org.apache.ws.commons.axiom/core-streams/1.3.0-20170609.235640-51/core-streams-1.3.0-20170609.235640-51.jar
[JENKINS] Archiving <https://builds.apache.org/job/axiom-trunk/ws/axiom/components/core-streams/target/core-streams-1.3.0-SNAPSHOT-sources.jar>
to org.apache.ws.commons.axiom/core-streams/1.3.0-20170609.235640-51/core-streams-1.3.0-20170609.235640-51-sources.jar
[JENKINS] Archiving <https://builds.apache.org/job/axiom-trunk/ws/axiom/components/core-streams/target/core-streams-1.3.0-SNAPSHOT-javadoc.jar>
to org.apache.ws.commons.axiom/core-streams/1.3.0-20170609.235640-51/core-streams-1.3.0-20170609.235640-51-javadoc.jar
[JENKINS] Archiving <https://builds.apache.org/job/axiom-trunk/ws/axiom/components/core-streams/target/jacoco.exec>
to org.apache.ws.commons.axiom/core-streams/1.3.0-20170609.235640-51/core-streams-1.3.0-20170609.235640-51-jacoco.exec
[JENKINS] Archiving <https://builds.apache.org/job/axiom-trunk/ws/axiom/testing/testutils/pom.xml>
to org.apache.ws.commons.axiom/testutils/1.3.0-SNAPSHOT/testutils-1.3.0-SNAPSHOT.pom
[JENKINS] Archiving <https://builds.apache.org/job/axiom-trunk/ws/axiom/testing/testutils/target/testutils-1.3.0-SNAPSHOT.jar>
to org.apache.ws.commons.axiom/testutils/1.3.0-20170609.235257-441/testutils-1.3.0-20170609.235257-441.jar
[JENKINS] Archiving <https://builds.apache.org/job/axiom-trunk/ws/axiom/testing/testutils/target/testutils-1.3.0-SNAPSHOT-sources.jar>
to org.apache.ws.commons.axiom/testutils/1.3.0-20170609.235257-441/testutils-1.3.0-20170609.235257-441-sources.jar
[JENKINS] Archiving <https://builds.apache.org/job/axiom-trunk/ws/axiom/testing/testutils/target/testutils-1.3.0-SNAPSHOT-javadoc.jar>
to org.apache.ws.commons.axiom/testutils/1.3.0-20170609.235257-441/testutils-1.3.0-20170609.235257-441-javadoc.jar
[JENKINS] Archiving <https://builds.apache.org/job/axiom-trunk/ws/axiom/testing/testutils/target/jacoco.exec>
to org.apache.ws.commons.axiom/testutils/1.3.0-20170609.235257-441/testutils-1.3.0-20170609.235257-441-jacoco.exec
[JENKINS] Archiving <https://builds.apache.org/job/axiom-trunk/ws/axiom/testing/xml-truth/pom.xml>
to org.apache.ws.commons.axiom/xml-truth/1.3.0-SNAPSHOT/xml-truth-1.3.0-SNAPSHOT.pom
[JENKINS] Archiving <https://builds.apache.org/job/axiom-trunk/ws/axiom/testing/xml-truth/target/xml-truth-1.3.0-SNAPSHOT.jar>
to org.apache.ws.commons.axiom/xml-truth/1.3.0-20170609.235407-440/xml-truth-1.3.0-20170609.235407-440.jar
[JENKINS] Archiving <https://builds.apache.org/job/axiom-trunk/ws/axiom/testing/xml-truth/target/xml-truth-1.3.0-SNAPSHOT-sources.jar>
to org.apache.ws.commons.axiom/xml-truth/1.3.0-20170609.235407-440/xml-truth-1.3.0-20170609.235407-440-sources.jar
[JENKINS] Archiving <https://builds.apache.org/job/axiom-trunk/ws/axiom/testing/xml-truth/target/xml-truth-1.3.0-SNAPSHOT-javadoc.jar>
to org.apache.ws.commons.axiom/xml-truth/1.3.0-20170609.235407-440/xml-truth-1.3.0-20170609.235407-440-javadoc.jar
[JENKINS] Archiving <https://builds.apache.org/job/axiom-trunk/ws/axiom/testing/xml-truth/target/jacoco.exec>
to org.apache.ws.commons.axiom/xml-truth/1.3.0-20170609.235407-440/xml-truth-1.3.0-20170609.235407-440-jacoco.exec
[JENKINS] Archiving <https://builds.apache.org/job/axiom-trunk/ws/axiom/testing/axiom-testsuite/pom.xml>
to org.apache.ws.commons.axiom/axiom-testsuite/1.3.0-SNAPSHOT/axiom-testsuite-1.3.0-SNAPSHOT.pom
[JENKINS] Archiving <https://builds.apache.org/job/axiom-trunk/ws/axiom/testing/multiton/pom.xml>
to org.apache.ws.commons.axiom/multiton/1.3.0-SNAPSHOT/multiton-1.3.0-SNAPSHOT.pom
[JENKINS] Archiving <https://builds.apache.org/job/axiom-trunk/ws/axiom/testing/multiton/target/multiton-1.3.0-SNAPSHOT.jar>
to org.apache.ws.commons.axiom/multiton/1.3.0-20170609.235234-441/multiton-1.3.0-20170609.235234-441.jar
[JENKINS] Archiving <https://builds.apache.org/job/axiom-trunk/ws/axiom/testing/multiton/target/multiton-1.3.0-SNAPSHOT-sources.jar>
to org.apache.ws.commons.axiom/multiton/1.3.0-20170609.235234-441/multiton-1.3.0-20170609.235234-441-sources.jar
[JENKINS] Archiving <https://builds.apache.org/job/axiom-trunk/ws/axiom/testing/multiton/target/multiton-1.3.0-SNAPSHOT-javadoc.jar>
to org.apache.ws.commons.axiom/multiton/1.3.0-20170609.235234-441/multiton-1.3.0-20170609.235234-441-javadoc.jar
[JENKINS] Archiving <https://builds.apache.org/job/axiom-trunk/ws/axiom/apidocs/pom.xml>
to org.apache.ws.commons.axiom/apidocs/1.3.0-SNAPSHOT/apidocs-1.3.0-SNAPSHOT.pom
[JENKINS] Archiving <https://builds.apache.org/job/axiom-trunk/ws/axiom/axiom-compat/pom.xml>
to org.apache.ws.commons.axiom/axiom-compat/1.3.0-SNAPSHOT/axiom-compat-1.3.0-SNAPSHOT.pom
[JENKINS] Archiving <https://builds.apache.org/job/axiom-trunk/ws/axiom/testing/xml-testsuite/pom.xml>
to org.apache.ws.commons.axiom/xml-testsuite/1.3.0-SNAPSHOT/xml-testsuite-1.3.0-SNAPSHOT.pom
[JENKINS] Archiving <https://builds.apache.org/job/axiom-trunk/ws/axiom/testing/xml-testsuite/target/xml-testsuite-1.3.0-SNAPSHOT.jar>
to org.apache.ws.commons.axiom/xml-testsuite/1.3.0-20170609.235313-441/xml-testsuite-1.3.0-20170609.235313-441.jar
[JENKINS] Archiving <https://builds.apache.org/job/axiom-trunk/ws/axiom/testing/xml-testsuite/target/xml-testsuite-1.3.0-SNAPSHOT-sources.jar>
to org.apache.ws.commons.axiom/xml-testsuite/1.3.0-20170609.235313-441/xml-testsuite-1.3.0-20170609.235313-441-sources.jar
[JENKINS] Archiving <https://builds.apache.org/job/axiom-trunk/ws/axiom/testing/xml-testsuite/target/xml-testsuite-1.3.0-SNAPSHOT-javadoc.jar>
to org.apache.ws.commons.axiom/xml-testsuite/1.3.0-20170609.235313-441/xml-testsuite-1.3.0-20170609.235313-441-javadoc.jar
[JENKINS] Archiving <https://builds.apache.org/job/axiom-trunk/ws/axiom/systests/old-tests/pom.xml>
to org.apache.ws.commons.axiom/old-tests/1.3.0-SNAPSHOT/old-tests-1.3.0-SNAPSHOT.pom
[JENKINS] Archiving <https://builds.apache.org/job/axiom-trunk/ws/axiom/systests/compat-tests/pom.xml>
to org.apache.ws.commons.axiom/compat-tests/1.3.0-SNAPSHOT/compat-tests-1.3.0-SNAPSHOT.pom
[JENKINS] Archiving <https://builds.apache.org/job/axiom-trunk/ws/axiom/components/pom.xml>
to org.apache.ws.commons.axiom/components/1.3.0-SNAPSHOT/components-1.3.0-SNAPSHOT.pom
[JENKINS] Archiving <https://builds.apache.org/job/axiom-trunk/ws/axiom/samples/pom.xml>
to org.apache.ws.commons.axiom/samples/1.3.0-SNAPSHOT/samples-1.3.0-SNAPSHOT.pom
[JENKINS] Archiving <https://builds.apache.org/job/axiom-trunk/ws/axiom/buildutils/pom.xml>
to org.apache.ws.commons.axiom/buildutils/1.3.0-SNAPSHOT/buildutils-1.3.0-SNAPSHOT.pom
[JENKINS] Archiving <https://builds.apache.org/job/axiom-trunk/ws/axiom/axiom-all/pom.xml>
to org.apache.ws.commons.axiom/axiom-all/1.3.0-SNAPSHOT/axiom-all-1.3.0-SNAPSHOT.pom
[JENKINS] Archiving <https://builds.apache.org/job/axiom-trunk/ws/axiom/aspects/pom.xml>
to org.apache.ws.commons.axiom/aspects/1.3.0-SNAPSHOT/aspects-1.3.0-SNAPSHOT.pom
Sending e-mails to: dev@ws.apache.org
channel stopped

---------------------------------------------------------------------
To unsubscribe, e-mail: dev-unsubscribe@ws.apache.org
For additional commands, e-mail: dev-help@ws.apache.org


Mime
View raw message