ws-dev mailing list archives

Site index · List index
Message view « Date » · « Thread »
Top « Date » · « Thread »
From Apache Jenkins Server <jenk...@builds.apache.org>
Subject Build failed in Jenkins: axiom-1.2.x #41
Date Sun, 16 Oct 2016 17:46:44 GMT
See <https://builds.apache.org/job/axiom-1.2.x/41/changes>

Changes:

[veithen] [maven-release-plugin] prepare for next development iteration

[veithen] [maven-release-plugin] prepare release 1.2.20

[veithen] Write release note for Axiom 1.2.20.

------------------------------------------
[...truncated 19190 lines...]
[INFO] OM Aspects ......................................... SUCCESS [ 34.352 s]
[INFO] Google Truth extension for Axiom ................... SUCCESS [ 13.132 s]
[INFO] Jaxen Test Suite ................................... SUCCESS [ 13.921 s]
[INFO] Axiom Implementation Test Suite .................... SUCCESS [ 49.418 s]
[INFO] Implementations .................................... SUCCESS [  6.714 s]
[INFO] LLOM ............................................... SUCCESS [02:53 min]
[INFO] DOM Aspects ........................................ SUCCESS [ 17.885 s]
[INFO] DOM Test Suite ..................................... SUCCESS [01:23 min]
[INFO] DOOM ............................................... SUCCESS [03:24 min]
[INFO] Axiom Compatibility Classes ........................ SUCCESS [ 22.660 s]
[INFO] Axiom JAXB Integration ............................. SUCCESS [ 21.223 s]
[INFO] Axiom C14N ......................................... SUCCESS [ 21.923 s]
[INFO] Axiom Uber-JAR ..................................... SUCCESS [  5.080 s]
[INFO] Samples ............................................ SUCCESS [ 14.281 s]
[INFO] System Tests ....................................... SUCCESS [  1.492 s]
[INFO] Cross OM Tests ..................................... SUCCESS [  4.904 s]
[INFO] Eclipse Tests ...................................... SUCCESS [ 57.444 s]
[INFO] JBoss Tests ........................................ SUCCESS [01:02 min]
[INFO] Axiom Test Suite (old) ............................. SUCCESS [ 12.070 s]
[INFO] Axiom OSGi Tests ................................... SUCCESS [ 22.531 s]
[INFO] Spring-WS Test Suite ............................... SUCCESS [ 38.462 s]
[INFO] Spring WS Tests .................................... SUCCESS [ 21.522 s]
[INFO] WSS4J Tests ........................................ SUCCESS [ 10.655 s]
[INFO] Developer Guide .................................... SUCCESS [ 14.569 s]
[INFO] User Guide ......................................... SUCCESS [  5.383 s]
[INFO] Javadoc ............................................ SUCCESS [ 16.895 s]
[INFO] FOM Aspects ........................................ SUCCESS [ 16.988 s]
[INFO] FOM Test Suite ..................................... SUCCESS [ 21.493 s]
[INFO] Abdera Model (FOM) Implementation .................. SUCCESS [01:03 min]
[INFO] Distribution ....................................... FAILURE [  1.305 s]
[INFO] Code Coverage Report ............................... SKIPPED
[INFO] SAAJ Test Suite .................................... SKIPPED
[INFO] ------------------------------------------------------------------------
[INFO] BUILD FAILURE
[INFO] ------------------------------------------------------------------------
[INFO] Total time: 25:40 min
[INFO] Finished at: 2016-10-16T17:44:37+00:00
[INFO] Final Memory: 137M/238M
[INFO] ------------------------------------------------------------------------
Waiting for Jenkins to finish collecting data
[ERROR] Failed to execute goal org.codehaus.gmavenplus:gmavenplus-plugin:1.5:execute (generate-release-note)
on project distribution: Error occurred while calling a method on a Groovy class from classpath.
InvocationTargetException: <https://builds.apache.org/job/axiom-1.2.x/ws/axiom/distribution/../src/site/markdown/release-notes/1.2.21.md>
(No such file or directory) -> [Help 1]
[ERROR] 
[ERROR] To see the full stack trace of the errors, re-run Maven with the -e switch.
[ERROR] Re-run Maven using the -X switch to enable full debug logging.
[ERROR] 
[ERROR] For more information about the errors and possible solutions, please read the following
articles:
[ERROR] [Help 1] http://cwiki.apache.org/confluence/display/MAVEN/MojoExecutionException
[ERROR] 
[ERROR] After correcting the problems, you can resume the build with the command
[ERROR]   mvn <goals> -rf :distribution
[JENKINS] Archiving <https://builds.apache.org/job/axiom-1.2.x/ws/axiom/aspects/core-aspects/pom.xml>
to org.apache.ws.commons.axiom/core-aspects/1.2.21-SNAPSHOT/core-aspects-1.2.21-SNAPSHOT.pom
[JENKINS] Archiving <https://builds.apache.org/job/axiom-1.2.x/ws/axiom/aspects/core-aspects/target/core-aspects-1.2.21-SNAPSHOT.jar>
to org.apache.ws.commons.axiom/core-aspects/1.2.21-20161016.172545-1/core-aspects-1.2.21-20161016.172545-1.jar
[JENKINS] Archiving <https://builds.apache.org/job/axiom-1.2.x/ws/axiom/aspects/core-aspects/target/core-aspects-1.2.21-SNAPSHOT-sources.jar>
to org.apache.ws.commons.axiom/core-aspects/1.2.21-20161016.172545-1/core-aspects-1.2.21-20161016.172545-1-sources.jar
[JENKINS] Archiving <https://builds.apache.org/job/axiom-1.2.x/ws/axiom/aspects/core-aspects/target/core-aspects-1.2.21-SNAPSHOT-javadoc.jar>
to org.apache.ws.commons.axiom/core-aspects/1.2.21-20161016.172545-1/core-aspects-1.2.21-20161016.172545-1-javadoc.jar
[JENKINS] Archiving <https://builds.apache.org/job/axiom-1.2.x/ws/axiom/components/xml-utils/pom.xml>
to org.apache.ws.commons.axiom/xml-utils/1.2.21-SNAPSHOT/xml-utils-1.2.21-SNAPSHOT.pom
[JENKINS] Archiving <https://builds.apache.org/job/axiom-1.2.x/ws/axiom/components/xml-utils/target/xml-utils-1.2.21-SNAPSHOT.jar>
to org.apache.ws.commons.axiom/xml-utils/1.2.21-20161016.172311-1/xml-utils-1.2.21-20161016.172311-1.jar
[JENKINS] Archiving <https://builds.apache.org/job/axiom-1.2.x/ws/axiom/components/xml-utils/target/xml-utils-1.2.21-SNAPSHOT-sources.jar>
to org.apache.ws.commons.axiom/xml-utils/1.2.21-20161016.172311-1/xml-utils-1.2.21-20161016.172311-1-sources.jar
[JENKINS] Archiving <https://builds.apache.org/job/axiom-1.2.x/ws/axiom/components/xml-utils/target/xml-utils-1.2.21-SNAPSHOT-javadoc.jar>
to org.apache.ws.commons.axiom/xml-utils/1.2.21-20161016.172311-1/xml-utils-1.2.21-20161016.172311-1-javadoc.jar
[JENKINS] Archiving <https://builds.apache.org/job/axiom-1.2.x/ws/axiom/components/xml-utils/target/jacoco.exec>
to org.apache.ws.commons.axiom/xml-utils/1.2.21-20161016.172311-1/xml-utils-1.2.21-20161016.172311-1-jacoco.exec
[JENKINS] Archiving <https://builds.apache.org/job/axiom-1.2.x/ws/axiom/axiom-c14n/pom.xml>
to org.apache.ws.commons.axiom/axiom-c14n/1.2.21-SNAPSHOT/axiom-c14n-1.2.21-SNAPSHOT.pom
[JENKINS] Archiving <https://builds.apache.org/job/axiom-1.2.x/ws/axiom/axiom-c14n/target/axiom-c14n-1.2.21-SNAPSHOT.jar>
to org.apache.ws.commons.axiom/axiom-c14n/1.2.21-20161016.173713-1/axiom-c14n-1.2.21-20161016.173713-1.jar
[JENKINS] Archiving <https://builds.apache.org/job/axiom-1.2.x/ws/axiom/axiom-c14n/target/axiom-c14n-1.2.21-SNAPSHOT-sources.jar>
to org.apache.ws.commons.axiom/axiom-c14n/1.2.21-20161016.173713-1/axiom-c14n-1.2.21-20161016.173713-1-sources.jar
[JENKINS] Archiving <https://builds.apache.org/job/axiom-1.2.x/ws/axiom/axiom-c14n/target/axiom-c14n-1.2.21-SNAPSHOT-javadoc.jar>
to org.apache.ws.commons.axiom/axiom-c14n/1.2.21-20161016.173713-1/axiom-c14n-1.2.21-20161016.173713-1-javadoc.jar
[JENKINS] Archiving <https://builds.apache.org/job/axiom-1.2.x/ws/axiom/axiom-c14n/target/jacoco.exec>
to org.apache.ws.commons.axiom/axiom-c14n/1.2.21-20161016.173713-1/axiom-c14n-1.2.21-20161016.173713-1-jacoco.exec
[JENKINS] Archiving <https://builds.apache.org/job/axiom-1.2.x/ws/axiom/systests/wss4j-tests/pom.xml>
to org.apache.ws.commons.axiom/wss4j-tests/1.2.21-SNAPSHOT/wss4j-tests-1.2.21-SNAPSHOT.pom
[JENKINS] Archiving <https://builds.apache.org/job/axiom-1.2.x/ws/axiom/systests/wss4j-tests/target/wss4j-tests-1.2.21-SNAPSHOT.jar>
to org.apache.ws.commons.axiom/wss4j-tests/1.2.21-SNAPSHOT/wss4j-tests-1.2.21-SNAPSHOT.jar
[JENKINS] Archiving <https://builds.apache.org/job/axiom-1.2.x/ws/axiom/systests/wss4j-tests/target/wss4j-tests-1.2.21-SNAPSHOT-sources.jar>
to org.apache.ws.commons.axiom/wss4j-tests/1.2.21-SNAPSHOT/wss4j-tests-1.2.21-SNAPSHOT-sources.jar
[JENKINS] Archiving <https://builds.apache.org/job/axiom-1.2.x/ws/axiom/systests/wss4j-tests/target/jacoco.exec>
to org.apache.ws.commons.axiom/wss4j-tests/1.2.21-SNAPSHOT/wss4j-tests-1.2.21-SNAPSHOT-jacoco.exec
[JENKINS] Archiving <https://builds.apache.org/job/axiom-1.2.x/ws/axiom/pom.xml> to
org.apache.ws.commons.axiom/axiom/1.2.21-SNAPSHOT/axiom-1.2.21-SNAPSHOT.pom
[JENKINS] Archiving <https://builds.apache.org/job/axiom-1.2.x/ws/axiom/target/axiom-1.2.21-SNAPSHOT-site.xml>
to org.apache.ws.commons.axiom/axiom/1.2.21-20161016.171940-1/axiom-1.2.21-20161016.171940-1-site.xml
Compressed 65.22 KB of artifacts by 49.1% relative to #40
[JENKINS] Archiving <https://builds.apache.org/job/axiom-1.2.x/ws/axiom/testing/soap-testsuite/pom.xml>
to org.apache.ws.commons.axiom/soap-testsuite/1.2.21-SNAPSHOT/soap-testsuite-1.2.21-SNAPSHOT.pom
[JENKINS] Archiving <https://builds.apache.org/job/axiom-1.2.x/ws/axiom/testing/soap-testsuite/target/soap-testsuite-1.2.21-SNAPSHOT.jar>
to org.apache.ws.commons.axiom/soap-testsuite/1.2.21-20161016.172330-1/soap-testsuite-1.2.21-20161016.172330-1.jar
[JENKINS] Archiving <https://builds.apache.org/job/axiom-1.2.x/ws/axiom/testing/soap-testsuite/target/soap-testsuite-1.2.21-SNAPSHOT-sources.jar>
to org.apache.ws.commons.axiom/soap-testsuite/1.2.21-20161016.172330-1/soap-testsuite-1.2.21-20161016.172330-1-sources.jar
[JENKINS] Archiving <https://builds.apache.org/job/axiom-1.2.x/ws/axiom/testing/soap-testsuite/target/soap-testsuite-1.2.21-SNAPSHOT-javadoc.jar>
to org.apache.ws.commons.axiom/soap-testsuite/1.2.21-20161016.172330-1/soap-testsuite-1.2.21-20161016.172330-1-javadoc.jar
[JENKINS] Archiving <https://builds.apache.org/job/axiom-1.2.x/ws/axiom/testing/soap-testsuite/target/jacoco.exec>
to org.apache.ws.commons.axiom/soap-testsuite/1.2.21-20161016.172330-1/soap-testsuite-1.2.21-20161016.172330-1-jacoco.exec
Compressed 400.79 KB of artifacts by 47.9% relative to #40
[JENKINS] Archiving <https://builds.apache.org/job/axiom-1.2.x/ws/axiom/userguide/pom.xml>
to org.apache.ws.commons.axiom/userguide/1.2.21-SNAPSHOT/userguide-1.2.21-SNAPSHOT.pom
[JENKINS] Archiving <https://builds.apache.org/job/axiom-1.2.x/ws/axiom/userguide/target/docbkx/pdf/userguide.pdf>
to org.apache.ws.commons.axiom/userguide/1.2.21-SNAPSHOT/userguide-1.2.21-SNAPSHOT.pdf
Compressed 348.69 KB of artifacts by 64.2% relative to #40
[JENKINS] Archiving <https://builds.apache.org/job/axiom-1.2.x/ws/axiom/devguide/pom.xml>
to org.apache.ws.commons.axiom/devguide/1.2.21-SNAPSHOT/devguide-1.2.21-SNAPSHOT.pom
[JENKINS] Archiving <https://builds.apache.org/job/axiom-1.2.x/ws/axiom/devguide/target/docbkx/pdf/devguide.pdf>
to org.apache.ws.commons.axiom/devguide/1.2.21-SNAPSHOT/devguide-1.2.21-SNAPSHOT.pdf
Compressed 353.29 KB of artifacts by 81.5% relative to #40
[JENKINS] Archiving <https://builds.apache.org/job/axiom-1.2.x/ws/axiom/buildutils/jar-resource-bundle/pom.xml>
to org.apache.ws.commons.axiom/jar-resource-bundle/1.2.21-SNAPSHOT/jar-resource-bundle-1.2.21-SNAPSHOT.pom
[JENKINS] Archiving <https://builds.apache.org/job/axiom-1.2.x/ws/axiom/buildutils/jar-resource-bundle/target/jar-resource-bundle-1.2.21-SNAPSHOT.jar>
to org.apache.ws.commons.axiom/jar-resource-bundle/1.2.21-20161016.171959-1/jar-resource-bundle-1.2.21-20161016.171959-1.jar
[JENKINS] Archiving <https://builds.apache.org/job/axiom-1.2.x/ws/axiom/buildutils/jar-resource-bundle/target/jar-resource-bundle-1.2.21-SNAPSHOT-sources.jar>
to org.apache.ws.commons.axiom/jar-resource-bundle/1.2.21-20161016.171959-1/jar-resource-bundle-1.2.21-20161016.171959-1-sources.jar
[JENKINS] Archiving <https://builds.apache.org/job/axiom-1.2.x/ws/axiom/testing/pom.xml>
to org.apache.ws.commons.axiom/testing/1.2.21-SNAPSHOT/testing-1.2.21-SNAPSHOT.pom
[JENKINS] Archiving <https://builds.apache.org/job/axiom-1.2.x/ws/axiom/testing/target/testing-1.2.21-SNAPSHOT-site.xml>
to org.apache.ws.commons.axiom/testing/1.2.21-20161016.172109-1/testing-1.2.21-20161016.172109-1-site.xml
[JENKINS] Archiving <https://builds.apache.org/job/axiom-1.2.x/ws/axiom/buildutils/javadoc-postprocessor-plugin/pom.xml>
to org.apache.ws.commons.axiom/javadoc-postprocessor-plugin/1.2.21-SNAPSHOT/javadoc-postprocessor-plugin-1.2.21-SNAPSHOT.pom
[JENKINS] Archiving <https://builds.apache.org/job/axiom-1.2.x/ws/axiom/buildutils/javadoc-postprocessor-plugin/target/javadoc-postprocessor-plugin-1.2.21-SNAPSHOT.jar>
to org.apache.ws.commons.axiom/javadoc-postprocessor-plugin/1.2.21-20161016.172043-1/javadoc-postprocessor-plugin-1.2.21-20161016.172043-1.jar
[JENKINS] Archiving <https://builds.apache.org/job/axiom-1.2.x/ws/axiom/buildutils/javadoc-postprocessor-plugin/target/javadoc-postprocessor-plugin-1.2.21-SNAPSHOT-sources.jar>
to org.apache.ws.commons.axiom/javadoc-postprocessor-plugin/1.2.21-20161016.172043-1/javadoc-postprocessor-plugin-1.2.21-20161016.172043-1-sources.jar
[JENKINS] Archiving <https://builds.apache.org/job/axiom-1.2.x/ws/axiom/buildutils/javadoc-postprocessor-plugin/target/javadoc-postprocessor-plugin-1.2.21-SNAPSHOT-javadoc.jar>
to org.apache.ws.commons.axiom/javadoc-postprocessor-plugin/1.2.21-20161016.172043-1/javadoc-postprocessor-plugin-1.2.21-20161016.172043-1-javadoc.jar
[JENKINS] Archiving <https://builds.apache.org/job/axiom-1.2.x/ws/axiom/systests/osgi-tests/pom.xml>
to org.apache.ws.commons.axiom/osgi-tests/1.2.21-SNAPSHOT/osgi-tests-1.2.21-SNAPSHOT.pom
[JENKINS] Archiving <https://builds.apache.org/job/axiom-1.2.x/ws/axiom/systests/osgi-tests/target/osgi-tests-1.2.21-SNAPSHOT.jar>
to org.apache.ws.commons.axiom/osgi-tests/1.2.21-SNAPSHOT/osgi-tests-1.2.21-SNAPSHOT.jar
[JENKINS] Archiving <https://builds.apache.org/job/axiom-1.2.x/ws/axiom/systests/osgi-tests/target/osgi-tests-1.2.21-SNAPSHOT-sources.jar>
to org.apache.ws.commons.axiom/osgi-tests/1.2.21-SNAPSHOT/osgi-tests-1.2.21-SNAPSHOT-sources.jar
[JENKINS] Archiving <https://builds.apache.org/job/axiom-1.2.x/ws/axiom/systests/osgi-tests/target/jacoco.exec>
to org.apache.ws.commons.axiom/osgi-tests/1.2.21-SNAPSHOT/osgi-tests-1.2.21-SNAPSHOT-jacoco.exec
[JENKINS] Archiving <https://builds.apache.org/job/axiom-1.2.x/ws/axiom/testing/saaj-testsuite/pom.xml>
to org.apache.ws.commons.axiom/saaj-testsuite/1.2.21-SNAPSHOT/saaj-testsuite-1.2.21-SNAPSHOT.pom
[JENKINS] Archiving <https://builds.apache.org/job/axiom-1.2.x/ws/axiom/systests/cross-om-tests/pom.xml>
to org.apache.ws.commons.axiom/cross-om-tests/1.2.21-SNAPSHOT/cross-om-tests-1.2.21-SNAPSHOT.pom
[JENKINS] Archiving <https://builds.apache.org/job/axiom-1.2.x/ws/axiom/systests/cross-om-tests/target/cross-om-tests-1.2.21-SNAPSHOT.jar>
to org.apache.ws.commons.axiom/cross-om-tests/1.2.21-SNAPSHOT/cross-om-tests-1.2.21-SNAPSHOT.jar
[JENKINS] Archiving <https://builds.apache.org/job/axiom-1.2.x/ws/axiom/systests/cross-om-tests/target/cross-om-tests-1.2.21-SNAPSHOT-sources.jar>
to org.apache.ws.commons.axiom/cross-om-tests/1.2.21-SNAPSHOT/cross-om-tests-1.2.21-SNAPSHOT-sources.jar
[JENKINS] Archiving <https://builds.apache.org/job/axiom-1.2.x/ws/axiom/systests/cross-om-tests/target/jacoco.exec>
to org.apache.ws.commons.axiom/cross-om-tests/1.2.21-SNAPSHOT/cross-om-tests-1.2.21-SNAPSHOT-jacoco.exec
[JENKINS] Archiving <https://builds.apache.org/job/axiom-1.2.x/ws/axiom/testing/spring-ws-testsuite/pom.xml>
to org.apache.ws.commons.axiom/spring-ws-testsuite/1.2.21-SNAPSHOT/spring-ws-testsuite-1.2.21-SNAPSHOT.pom
[JENKINS] Archiving <https://builds.apache.org/job/axiom-1.2.x/ws/axiom/testing/spring-ws-testsuite/target/spring-ws-testsuite-1.2.21-SNAPSHOT.jar>
to org.apache.ws.commons.axiom/spring-ws-testsuite/1.2.21-20161016.174103-1/spring-ws-testsuite-1.2.21-20161016.174103-1.jar
[JENKINS] Archiving <https://builds.apache.org/job/axiom-1.2.x/ws/axiom/testing/spring-ws-testsuite/target/spring-ws-testsuite-1.2.21-SNAPSHOT-sources.jar>
to org.apache.ws.commons.axiom/spring-ws-testsuite/1.2.21-20161016.174103-1/spring-ws-testsuite-1.2.21-20161016.174103-1-sources.jar
[JENKINS] Archiving <https://builds.apache.org/job/axiom-1.2.x/ws/axiom/testing/spring-ws-testsuite/target/spring-ws-testsuite-1.2.21-SNAPSHOT-javadoc.jar>
to org.apache.ws.commons.axiom/spring-ws-testsuite/1.2.21-20161016.174103-1/spring-ws-testsuite-1.2.21-20161016.174103-1-javadoc.jar
[JENKINS] Archiving <https://builds.apache.org/job/axiom-1.2.x/ws/axiom/testing/spring-ws-testsuite/target/jacoco.exec>
to org.apache.ws.commons.axiom/spring-ws-testsuite/1.2.21-20161016.174103-1/spring-ws-testsuite-1.2.21-20161016.174103-1-jacoco.exec
[JENKINS] Archiving <https://builds.apache.org/job/axiom-1.2.x/ws/axiom/aspects/dom-aspects/pom.xml>
to org.apache.ws.commons.axiom/dom-aspects/1.2.21-SNAPSHOT/dom-aspects-1.2.21-SNAPSHOT.pom
[JENKINS] Archiving <https://builds.apache.org/job/axiom-1.2.x/ws/axiom/aspects/dom-aspects/target/dom-aspects-1.2.21-SNAPSHOT.jar>
to org.apache.ws.commons.axiom/dom-aspects/1.2.21-20161016.173112-1/dom-aspects-1.2.21-20161016.173112-1.jar
[JENKINS] Archiving <https://builds.apache.org/job/axiom-1.2.x/ws/axiom/aspects/dom-aspects/target/dom-aspects-1.2.21-SNAPSHOT-sources.jar>
to org.apache.ws.commons.axiom/dom-aspects/1.2.21-20161016.173112-1/dom-aspects-1.2.21-20161016.173112-1-sources.jar
[JENKINS] Archiving <https://builds.apache.org/job/axiom-1.2.x/ws/axiom/aspects/dom-aspects/target/dom-aspects-1.2.21-SNAPSHOT-javadoc.jar>
to org.apache.ws.commons.axiom/dom-aspects/1.2.21-20161016.173112-1/dom-aspects-1.2.21-20161016.173112-1-javadoc.jar
[JENKINS] Archiving <https://builds.apache.org/job/axiom-1.2.x/ws/axiom/aspects/dom-aspects/target/jacoco.exec>
to org.apache.ws.commons.axiom/dom-aspects/1.2.21-20161016.173112-1/dom-aspects-1.2.21-20161016.173112-1-jacoco.exec
[JENKINS] Archiving <https://builds.apache.org/job/axiom-1.2.x/ws/axiom/implementations/axiom-dom/pom.xml>
to org.apache.ws.commons.axiom/axiom-dom/1.2.21-SNAPSHOT/axiom-dom-1.2.21-SNAPSHOT.pom
[JENKINS] Archiving <https://builds.apache.org/job/axiom-1.2.x/ws/axiom/implementations/axiom-dom/target/axiom-dom-1.2.21-SNAPSHOT.jar>
to org.apache.ws.commons.axiom/axiom-dom/1.2.21-20161016.173601-1/axiom-dom-1.2.21-20161016.173601-1.jar
[JENKINS] Archiving <https://builds.apache.org/job/axiom-1.2.x/ws/axiom/implementations/axiom-dom/target/axiom-dom-1.2.21-SNAPSHOT-sources.jar>
to org.apache.ws.commons.axiom/axiom-dom/1.2.21-20161016.173601-1/axiom-dom-1.2.21-20161016.173601-1-sources.jar
[JENKINS] Archiving <https://builds.apache.org/job/axiom-1.2.x/ws/axiom/implementations/axiom-dom/target/axiom-dom-1.2.21-SNAPSHOT-javadoc.jar>
to org.apache.ws.commons.axiom/axiom-dom/1.2.21-20161016.173601-1/axiom-dom-1.2.21-20161016.173601-1-javadoc.jar
[JENKINS] Archiving <https://builds.apache.org/job/axiom-1.2.x/ws/axiom/implementations/axiom-dom/target/jacoco.exec>
to org.apache.ws.commons.axiom/axiom-dom/1.2.21-20161016.173601-1/axiom-dom-1.2.21-20161016.173601-1-jacoco.exec
[JENKINS] Archiving <https://builds.apache.org/job/axiom-1.2.x/ws/axiom/testing/jaxp-testsuite/pom.xml>
to org.apache.ws.commons.axiom/jaxp-testsuite/1.2.21-SNAPSHOT/jaxp-testsuite-1.2.21-SNAPSHOT.pom
[JENKINS] Archiving <https://builds.apache.org/job/axiom-1.2.x/ws/axiom/testing/jaxp-testsuite/target/jaxp-testsuite-1.2.21-SNAPSHOT.jar>
to org.apache.ws.commons.axiom/jaxp-testsuite/1.2.21-20161016.172225-1/jaxp-testsuite-1.2.21-20161016.172225-1.jar
[JENKINS] Archiving <https://builds.apache.org/job/axiom-1.2.x/ws/axiom/testing/jaxp-testsuite/target/jaxp-testsuite-1.2.21-SNAPSHOT-sources.jar>
to org.apache.ws.commons.axiom/jaxp-testsuite/1.2.21-20161016.172225-1/jaxp-testsuite-1.2.21-20161016.172225-1-sources.jar
[JENKINS] Archiving <https://builds.apache.org/job/axiom-1.2.x/ws/axiom/testing/jaxp-testsuite/target/jaxp-testsuite-1.2.21-SNAPSHOT-javadoc.jar>
to org.apache.ws.commons.axiom/jaxp-testsuite/1.2.21-20161016.172225-1/jaxp-testsuite-1.2.21-20161016.172225-1-javadoc.jar
[JENKINS] Archiving <https://builds.apache.org/job/axiom-1.2.x/ws/axiom/aspects/fom-aspects/pom.xml>
to org.apache.ws.commons.axiom/fom-aspects/1.2.21-SNAPSHOT/fom-aspects-1.2.21-SNAPSHOT.pom
[JENKINS] Archiving <https://builds.apache.org/job/axiom-1.2.x/ws/axiom/aspects/fom-aspects/target/fom-aspects-1.2.21-SNAPSHOT.jar>
to org.apache.ws.commons.axiom/fom-aspects/1.2.21-20161016.174238-1/fom-aspects-1.2.21-20161016.174238-1.jar
[JENKINS] Archiving <https://builds.apache.org/job/axiom-1.2.x/ws/axiom/aspects/fom-aspects/target/fom-aspects-1.2.21-SNAPSHOT-sources.jar>
to org.apache.ws.commons.axiom/fom-aspects/1.2.21-20161016.174238-1/fom-aspects-1.2.21-20161016.174238-1-sources.jar
[JENKINS] Archiving <https://builds.apache.org/job/axiom-1.2.x/ws/axiom/aspects/fom-aspects/target/fom-aspects-1.2.21-SNAPSHOT-javadoc.jar>
to org.apache.ws.commons.axiom/fom-aspects/1.2.21-20161016.174238-1/fom-aspects-1.2.21-20161016.174238-1-javadoc.jar
[JENKINS] Archiving <https://builds.apache.org/job/axiom-1.2.x/ws/axiom/axiom-api/pom.xml>
to org.apache.ws.commons.axiom/axiom-api/1.2.21-SNAPSHOT/axiom-api-1.2.21-SNAPSHOT.pom
[JENKINS] Archiving <https://builds.apache.org/job/axiom-1.2.x/ws/axiom/axiom-api/target/axiom-api-1.2.21-SNAPSHOT.jar>
to org.apache.ws.commons.axiom/axiom-api/1.2.21-20161016.172514-1/axiom-api-1.2.21-20161016.172514-1.jar
[JENKINS] Archiving <https://builds.apache.org/job/axiom-1.2.x/ws/axiom/axiom-api/target/axiom-api-1.2.21-SNAPSHOT-sources.jar>
to org.apache.ws.commons.axiom/axiom-api/1.2.21-20161016.172514-1/axiom-api-1.2.21-20161016.172514-1-sources.jar
[JENKINS] Archiving <https://builds.apache.org/job/axiom-1.2.x/ws/axiom/axiom-api/target/axiom-api-1.2.21-SNAPSHOT-javadoc.jar>
to org.apache.ws.commons.axiom/axiom-api/1.2.21-20161016.172514-1/axiom-api-1.2.21-20161016.172514-1-javadoc.jar
[JENKINS] Archiving <https://builds.apache.org/job/axiom-1.2.x/ws/axiom/axiom-api/target/axiom-api-1.2.21-SNAPSHOT-tests.jar>
to org.apache.ws.commons.axiom/axiom-api/1.2.21-20161016.172514-1/axiom-api-1.2.21-20161016.172514-1-tests.jar
[JENKINS] Archiving <https://builds.apache.org/job/axiom-1.2.x/ws/axiom/axiom-api/target/jacoco.exec>
to org.apache.ws.commons.axiom/axiom-api/1.2.21-20161016.172514-1/axiom-api-1.2.21-20161016.172514-1-jacoco.exec
Compressed 2.85 MB of artifacts by 19.7% relative to #40
[JENKINS] Archiving <https://builds.apache.org/job/axiom-1.2.x/ws/axiom/testing/fom-testsuite/pom.xml>
to org.apache.ws.commons.axiom/fom-testsuite/1.2.21-SNAPSHOT/fom-testsuite-1.2.21-SNAPSHOT.pom
[JENKINS] Archiving <https://builds.apache.org/job/axiom-1.2.x/ws/axiom/testing/fom-testsuite/target/fom-testsuite-1.2.21-SNAPSHOT.jar>
to org.apache.ws.commons.axiom/fom-testsuite/1.2.21-20161016.174302-1/fom-testsuite-1.2.21-20161016.174302-1.jar
[JENKINS] Archiving <https://builds.apache.org/job/axiom-1.2.x/ws/axiom/testing/fom-testsuite/target/fom-testsuite-1.2.21-SNAPSHOT-sources.jar>
to org.apache.ws.commons.axiom/fom-testsuite/1.2.21-20161016.174302-1/fom-testsuite-1.2.21-20161016.174302-1-sources.jar
[JENKINS] Archiving <https://builds.apache.org/job/axiom-1.2.x/ws/axiom/testing/fom-testsuite/target/fom-testsuite-1.2.21-SNAPSHOT-javadoc.jar>
to org.apache.ws.commons.axiom/fom-testsuite/1.2.21-20161016.174302-1/fom-testsuite-1.2.21-20161016.174302-1-javadoc.jar
[JENKINS] Archiving <https://builds.apache.org/job/axiom-1.2.x/ws/axiom/testing/fom-testsuite/target/jacoco.exec>
to org.apache.ws.commons.axiom/fom-testsuite/1.2.21-20161016.174302-1/fom-testsuite-1.2.21-20161016.174302-1-jacoco.exec
[JENKINS] Archiving <https://builds.apache.org/job/axiom-1.2.x/ws/axiom/testing/dom-testsuite/pom.xml>
to org.apache.ws.commons.axiom/dom-testsuite/1.2.21-SNAPSHOT/dom-testsuite-1.2.21-SNAPSHOT.pom
[JENKINS] Archiving <https://builds.apache.org/job/axiom-1.2.x/ws/axiom/testing/dom-testsuite/target/dom-testsuite-1.2.21-SNAPSHOT.jar>
to org.apache.ws.commons.axiom/dom-testsuite/1.2.21-20161016.173234-1/dom-testsuite-1.2.21-20161016.173234-1.jar
[JENKINS] Archiving <https://builds.apache.org/job/axiom-1.2.x/ws/axiom/testing/dom-testsuite/target/dom-testsuite-1.2.21-SNAPSHOT-sources.jar>
to org.apache.ws.commons.axiom/dom-testsuite/1.2.21-20161016.173234-1/dom-testsuite-1.2.21-20161016.173234-1-sources.jar
[JENKINS] Archiving <https://builds.apache.org/job/axiom-1.2.x/ws/axiom/testing/dom-testsuite/target/dom-testsuite-1.2.21-SNAPSHOT-javadoc.jar>
to org.apache.ws.commons.axiom/dom-testsuite/1.2.21-20161016.173234-1/dom-testsuite-1.2.21-20161016.173234-1-javadoc.jar
[JENKINS] Archiving <https://builds.apache.org/job/axiom-1.2.x/ws/axiom/testing/dom-testsuite/target/jacoco.exec>
to org.apache.ws.commons.axiom/dom-testsuite/1.2.21-20161016.173234-1/dom-testsuite-1.2.21-20161016.173234-1-jacoco.exec
Compressed 14.35 MB of artifacts by 18.9% relative to #40
[JENKINS] Archiving <https://builds.apache.org/job/axiom-1.2.x/ws/axiom/implementations/axiom-impl/pom.xml>
to org.apache.ws.commons.axiom/axiom-impl/1.2.21-SNAPSHOT/axiom-impl-1.2.21-SNAPSHOT.pom
[JENKINS] Archiving <https://builds.apache.org/job/axiom-1.2.x/ws/axiom/implementations/axiom-impl/target/axiom-impl-1.2.21-SNAPSHOT.jar>
to org.apache.ws.commons.axiom/axiom-impl/1.2.21-20161016.173050-1/axiom-impl-1.2.21-20161016.173050-1.jar
[JENKINS] Archiving <https://builds.apache.org/job/axiom-1.2.x/ws/axiom/implementations/axiom-impl/target/axiom-impl-1.2.21-SNAPSHOT-sources.jar>
to org.apache.ws.commons.axiom/axiom-impl/1.2.21-20161016.173050-1/axiom-impl-1.2.21-20161016.173050-1-sources.jar
[JENKINS] Archiving <https://builds.apache.org/job/axiom-1.2.x/ws/axiom/implementations/axiom-impl/target/axiom-impl-1.2.21-SNAPSHOT-javadoc.jar>
to org.apache.ws.commons.axiom/axiom-impl/1.2.21-20161016.173050-1/axiom-impl-1.2.21-20161016.173050-1-javadoc.jar
[JENKINS] Archiving <https://builds.apache.org/job/axiom-1.2.x/ws/axiom/implementations/axiom-impl/target/jacoco.exec>
to org.apache.ws.commons.axiom/axiom-impl/1.2.21-20161016.173050-1/axiom-impl-1.2.21-20161016.173050-1-jacoco.exec
[JENKINS] Archiving <https://builds.apache.org/job/axiom-1.2.x/ws/axiom/implementations/fom-impl/pom.xml>
to org.apache.ws.commons.axiom/fom-impl/1.2.21-SNAPSHOT/fom-impl-1.2.21-SNAPSHOT.pom
[JENKINS] Archiving <https://builds.apache.org/job/axiom-1.2.x/ws/axiom/implementations/fom-impl/target/fom-impl-1.2.21-SNAPSHOT.jar>
to org.apache.ws.commons.axiom/fom-impl/1.2.21-20161016.174403-1/fom-impl-1.2.21-20161016.174403-1.jar
[JENKINS] Archiving <https://builds.apache.org/job/axiom-1.2.x/ws/axiom/implementations/fom-impl/target/fom-impl-1.2.21-SNAPSHOT-sources.jar>
to org.apache.ws.commons.axiom/fom-impl/1.2.21-20161016.174403-1/fom-impl-1.2.21-20161016.174403-1-sources.jar
[JENKINS] Archiving <https://builds.apache.org/job/axiom-1.2.x/ws/axiom/implementations/fom-impl/target/fom-impl-1.2.21-SNAPSHOT-javadoc.jar>
to org.apache.ws.commons.axiom/fom-impl/1.2.21-20161016.174403-1/fom-impl-1.2.21-20161016.174403-1-javadoc.jar
[JENKINS] Archiving <https://builds.apache.org/job/axiom-1.2.x/ws/axiom/implementations/fom-impl/target/jacoco.exec>
to org.apache.ws.commons.axiom/fom-impl/1.2.21-20161016.174403-1/fom-impl-1.2.21-20161016.174403-1-jacoco.exec
[JENKINS] Archiving <https://builds.apache.org/job/axiom-1.2.x/ws/axiom/testing/testutils/pom.xml>
to org.apache.ws.commons.axiom/testutils/1.2.21-SNAPSHOT/testutils-1.2.21-SNAPSHOT.pom
[JENKINS] Archiving <https://builds.apache.org/job/axiom-1.2.x/ws/axiom/testing/testutils/target/testutils-1.2.21-SNAPSHOT.jar>
to org.apache.ws.commons.axiom/testutils/1.2.21-20161016.172152-1/testutils-1.2.21-20161016.172152-1.jar
[JENKINS] Archiving <https://builds.apache.org/job/axiom-1.2.x/ws/axiom/testing/testutils/target/testutils-1.2.21-SNAPSHOT-sources.jar>
to org.apache.ws.commons.axiom/testutils/1.2.21-20161016.172152-1/testutils-1.2.21-20161016.172152-1-sources.jar
[JENKINS] Archiving <https://builds.apache.org/job/axiom-1.2.x/ws/axiom/testing/testutils/target/testutils-1.2.21-SNAPSHOT-javadoc.jar>
to org.apache.ws.commons.axiom/testutils/1.2.21-20161016.172152-1/testutils-1.2.21-20161016.172152-1-javadoc.jar
[JENKINS] Archiving <https://builds.apache.org/job/axiom-1.2.x/ws/axiom/testing/testutils/target/jacoco.exec>
to org.apache.ws.commons.axiom/testutils/1.2.21-20161016.172152-1/testutils-1.2.21-20161016.172152-1-jacoco.exec
[JENKINS] Archiving <https://builds.apache.org/job/axiom-1.2.x/ws/axiom/testing/xml-truth/pom.xml>
to org.apache.ws.commons.axiom/xml-truth/1.2.21-SNAPSHOT/xml-truth-1.2.21-SNAPSHOT.pom
[JENKINS] Archiving <https://builds.apache.org/job/axiom-1.2.x/ws/axiom/testing/xml-truth/target/xml-truth-1.2.21-SNAPSHOT.jar>
to org.apache.ws.commons.axiom/xml-truth/1.2.21-20161016.172245-1/xml-truth-1.2.21-20161016.172245-1.jar
[JENKINS] Archiving <https://builds.apache.org/job/axiom-1.2.x/ws/axiom/testing/xml-truth/target/xml-truth-1.2.21-SNAPSHOT-sources.jar>
to org.apache.ws.commons.axiom/xml-truth/1.2.21-20161016.172245-1/xml-truth-1.2.21-20161016.172245-1-sources.jar
[JENKINS] Archiving <https://builds.apache.org/job/axiom-1.2.x/ws/axiom/testing/xml-truth/target/xml-truth-1.2.21-SNAPSHOT-javadoc.jar>
to org.apache.ws.commons.axiom/xml-truth/1.2.21-20161016.172245-1/xml-truth-1.2.21-20161016.172245-1-javadoc.jar
[JENKINS] Archiving <https://builds.apache.org/job/axiom-1.2.x/ws/axiom/testing/xml-truth/target/jacoco.exec>
to org.apache.ws.commons.axiom/xml-truth/1.2.21-20161016.172245-1/xml-truth-1.2.21-20161016.172245-1-jacoco.exec
[JENKINS] Archiving <https://builds.apache.org/job/axiom-1.2.x/ws/axiom/apidocs/pom.xml>
to org.apache.ws.commons.axiom/apidocs/1.2.21-SNAPSHOT/apidocs-1.2.21-SNAPSHOT.pom
[JENKINS] Archiving <https://builds.apache.org/job/axiom-1.2.x/ws/axiom/apidocs/target/apidocs-1.2.21-SNAPSHOT-javadoc.zip>
to org.apache.ws.commons.axiom/apidocs/1.2.21-SNAPSHOT/apidocs-1.2.21-SNAPSHOT-javadoc.zip
[JENKINS] Archiving <https://builds.apache.org/job/axiom-1.2.x/ws/axiom/testing/xml-testsuite/pom.xml>
to org.apache.ws.commons.axiom/xml-testsuite/1.2.21-SNAPSHOT/xml-testsuite-1.2.21-SNAPSHOT.pom
[JENKINS] Archiving <https://builds.apache.org/job/axiom-1.2.x/ws/axiom/testing/xml-testsuite/target/xml-testsuite-1.2.21-SNAPSHOT.jar>
to org.apache.ws.commons.axiom/xml-testsuite/1.2.21-20161016.172210-1/xml-testsuite-1.2.21-20161016.172210-1.jar
[JENKINS] Archiving <https://builds.apache.org/job/axiom-1.2.x/ws/axiom/testing/xml-testsuite/target/xml-testsuite-1.2.21-SNAPSHOT-sources.jar>
to org.apache.ws.commons.axiom/xml-testsuite/1.2.21-20161016.172210-1/xml-testsuite-1.2.21-20161016.172210-1-sources.jar
[JENKINS] Archiving <https://builds.apache.org/job/axiom-1.2.x/ws/axiom/testing/xml-testsuite/target/xml-testsuite-1.2.21-SNAPSHOT-javadoc.jar>
to org.apache.ws.commons.axiom/xml-testsuite/1.2.21-20161016.172210-1/xml-testsuite-1.2.21-20161016.172210-1-javadoc.jar
[JENKINS] Archiving <https://builds.apache.org/job/axiom-1.2.x/ws/axiom/samples/pom.xml>
to org.apache.ws.commons.axiom/samples/1.2.21-SNAPSHOT/samples-1.2.21-SNAPSHOT.pom
[JENKINS] Archiving <https://builds.apache.org/job/axiom-1.2.x/ws/axiom/samples/target/samples-1.2.21-SNAPSHOT.jar>
to org.apache.ws.commons.axiom/samples/1.2.21-SNAPSHOT/samples-1.2.21-SNAPSHOT.jar
[JENKINS] Archiving <https://builds.apache.org/job/axiom-1.2.x/ws/axiom/samples/target/samples-1.2.21-SNAPSHOT-sources.jar>
to org.apache.ws.commons.axiom/samples/1.2.21-SNAPSHOT/samples-1.2.21-SNAPSHOT-sources.jar
[JENKINS] Archiving <https://builds.apache.org/job/axiom-1.2.x/ws/axiom/samples/target/jacoco.exec>
to org.apache.ws.commons.axiom/samples/1.2.21-SNAPSHOT/samples-1.2.21-SNAPSHOT-jacoco.exec
[JENKINS] Archiving <https://builds.apache.org/job/axiom-1.2.x/ws/axiom/buildutils/pom.xml>
to org.apache.ws.commons.axiom/buildutils/1.2.21-SNAPSHOT/buildutils-1.2.21-SNAPSHOT.pom
[JENKINS] Archiving <https://builds.apache.org/job/axiom-1.2.x/ws/axiom/axiom-all/pom.xml>
to org.apache.ws.commons.axiom/axiom-all/1.2.21-SNAPSHOT/axiom-all-1.2.21-SNAPSHOT.pom
[JENKINS] Archiving <https://builds.apache.org/job/axiom-1.2.x/ws/axiom/axiom-all/target/axiom-all-1.2.21-SNAPSHOT.jar>
to org.apache.ws.commons.axiom/axiom-all/1.2.21-SNAPSHOT/axiom-all-1.2.21-SNAPSHOT.jar
[JENKINS] Archiving <https://builds.apache.org/job/axiom-1.2.x/ws/axiom/axiom-all/target/axiom-all-1.2.21-SNAPSHOT-sources.jar>
to org.apache.ws.commons.axiom/axiom-all/1.2.21-SNAPSHOT/axiom-all-1.2.21-SNAPSHOT-sources.jar
[JENKINS] Archiving <https://builds.apache.org/job/axiom-1.2.x/ws/axiom/code-coverage/pom.xml>
to org.apache.ws.commons.axiom/code-coverage/1.2.21-SNAPSHOT/code-coverage-1.2.21-SNAPSHOT.pom
[JENKINS] Archiving <https://builds.apache.org/job/axiom-1.2.x/ws/axiom/implementations/pom.xml>
to org.apache.ws.commons.axiom/implementations/1.2.21-SNAPSHOT/implementations-1.2.21-SNAPSHOT.pom
[JENKINS] Archiving <https://builds.apache.org/job/axiom-1.2.x/ws/axiom/implementations/target/implementations-1.2.21-SNAPSHOT-site.xml>
to org.apache.ws.commons.axiom/implementations/1.2.21-20161016.172803-1/implementations-1.2.21-20161016.172803-1-site.xml
[JENKINS] Archiving <https://builds.apache.org/job/axiom-1.2.x/ws/axiom/systests/pom.xml>
to org.apache.ws.commons.axiom/systests/1.2.21-SNAPSHOT/systests-1.2.21-SNAPSHOT.pom
[JENKINS] Archiving <https://builds.apache.org/job/axiom-1.2.x/ws/axiom/distribution/pom.xml>
to org.apache.ws.commons.axiom/distribution/1.2.21-SNAPSHOT/distribution-1.2.21-SNAPSHOT.pom
[JENKINS] Archiving <https://builds.apache.org/job/axiom-1.2.x/ws/axiom/testing/axiom-truth/pom.xml>
to org.apache.ws.commons.axiom/axiom-truth/1.2.21-SNAPSHOT/axiom-truth-1.2.21-SNAPSHOT.pom
[JENKINS] Archiving <https://builds.apache.org/job/axiom-1.2.x/ws/axiom/testing/axiom-truth/target/axiom-truth-1.2.21-SNAPSHOT.jar>
to org.apache.ws.commons.axiom/axiom-truth/1.2.21-20161016.172647-1/axiom-truth-1.2.21-20161016.172647-1.jar
[JENKINS] Archiving <https://builds.apache.org/job/axiom-1.2.x/ws/axiom/testing/axiom-truth/target/axiom-truth-1.2.21-SNAPSHOT-sources.jar>
to org.apache.ws.commons.axiom/axiom-truth/1.2.21-20161016.172647-1/axiom-truth-1.2.21-20161016.172647-1-sources.jar
[JENKINS] Archiving <https://builds.apache.org/job/axiom-1.2.x/ws/axiom/testing/axiom-truth/target/axiom-truth-1.2.21-SNAPSHOT-javadoc.jar>
to org.apache.ws.commons.axiom/axiom-truth/1.2.21-20161016.172647-1/axiom-truth-1.2.21-20161016.172647-1-javadoc.jar
[JENKINS] Archiving <https://builds.apache.org/job/axiom-1.2.x/ws/axiom/systests/jboss-tests/pom.xml>
to org.apache.ws.commons.axiom/jboss-tests/1.2.21-SNAPSHOT/jboss-tests-1.2.21-SNAPSHOT.pom
[JENKINS] Archiving <https://builds.apache.org/job/axiom-1.2.x/ws/axiom/systests/jboss-tests/target/jboss-tests-1.2.21-SNAPSHOT.jar>
to org.apache.ws.commons.axiom/jboss-tests/1.2.21-SNAPSHOT/jboss-tests-1.2.21-SNAPSHOT.jar
[JENKINS] Archiving <https://builds.apache.org/job/axiom-1.2.x/ws/axiom/systests/jboss-tests/target/jboss-tests-1.2.21-SNAPSHOT-sources.jar>
to org.apache.ws.commons.axiom/jboss-tests/1.2.21-SNAPSHOT/jboss-tests-1.2.21-SNAPSHOT-sources.jar
[JENKINS] Archiving <https://builds.apache.org/job/axiom-1.2.x/ws/axiom/systests/jboss-tests/target/jacoco.exec>
to org.apache.ws.commons.axiom/jboss-tests/1.2.21-SNAPSHOT/jboss-tests-1.2.21-SNAPSHOT-jacoco.exec
[JENKINS] Archiving <https://builds.apache.org/job/axiom-1.2.x/ws/axiom/systests/spring-ws-tests/pom.xml>
to org.apache.ws.commons.axiom/spring-ws-tests/1.2.21-SNAPSHOT/spring-ws-tests-1.2.21-SNAPSHOT.pom
[JENKINS] Archiving <https://builds.apache.org/job/axiom-1.2.x/ws/axiom/systests/spring-ws-tests/target/spring-ws-tests-1.2.21-SNAPSHOT.jar>
to org.apache.ws.commons.axiom/spring-ws-tests/1.2.21-SNAPSHOT/spring-ws-tests-1.2.21-SNAPSHOT.jar
[JENKINS] Archiving <https://builds.apache.org/job/axiom-1.2.x/ws/axiom/systests/spring-ws-tests/target/spring-ws-tests-1.2.21-SNAPSHOT-sources.jar>
to org.apache.ws.commons.axiom/spring-ws-tests/1.2.21-SNAPSHOT/spring-ws-tests-1.2.21-SNAPSHOT-sources.jar
[JENKINS] Archiving <https://builds.apache.org/job/axiom-1.2.x/ws/axiom/systests/spring-ws-tests/target/jacoco.exec>
to org.apache.ws.commons.axiom/spring-ws-tests/1.2.21-SNAPSHOT/spring-ws-tests-1.2.21-SNAPSHOT-jacoco.exec
[JENKINS] Archiving <https://builds.apache.org/job/axiom-1.2.x/ws/axiom/aspects/om-aspects/pom.xml>
to org.apache.ws.commons.axiom/om-aspects/1.2.21-SNAPSHOT/om-aspects-1.2.21-SNAPSHOT.pom
[JENKINS] Archiving <https://builds.apache.org/job/axiom-1.2.x/ws/axiom/aspects/om-aspects/target/om-aspects-1.2.21-SNAPSHOT.jar>
to org.apache.ws.commons.axiom/om-aspects/1.2.21-20161016.172630-1/om-aspects-1.2.21-20161016.172630-1.jar
[JENKINS] Archiving <https://builds.apache.org/job/axiom-1.2.x/ws/axiom/aspects/om-aspects/target/om-aspects-1.2.21-SNAPSHOT-sources.jar>
to org.apache.ws.commons.axiom/om-aspects/1.2.21-20161016.172630-1/om-aspects-1.2.21-20161016.172630-1-sources.jar
[JENKINS] Archiving <https://builds.apache.org/job/axiom-1.2.x/ws/axiom/aspects/om-aspects/target/om-aspects-1.2.21-SNAPSHOT-javadoc.jar>
to org.apache.ws.commons.axiom/om-aspects/1.2.21-20161016.172630-1/om-aspects-1.2.21-20161016.172630-1-javadoc.jar
[JENKINS] Archiving <https://builds.apache.org/job/axiom-1.2.x/ws/axiom/aspects/om-aspects/target/jacoco.exec>
to org.apache.ws.commons.axiom/om-aspects/1.2.21-20161016.172630-1/om-aspects-1.2.21-20161016.172630-1-jacoco.exec
Compressed 1.50 MB of artifacts by 39.5% relative to #40
[JENKINS] Archiving <https://builds.apache.org/job/axiom-1.2.x/ws/axiom/testing/jaxen-testsuite/pom.xml>
to org.apache.ws.commons.axiom/jaxen-testsuite/1.2.21-SNAPSHOT/jaxen-testsuite-1.2.21-SNAPSHOT.pom
[JENKINS] Archiving <https://builds.apache.org/job/axiom-1.2.x/ws/axiom/testing/jaxen-testsuite/target/jaxen-testsuite-1.2.21-SNAPSHOT.jar>
to org.apache.ws.commons.axiom/jaxen-testsuite/1.2.21-20161016.172702-1/jaxen-testsuite-1.2.21-20161016.172702-1.jar
[JENKINS] Archiving <https://builds.apache.org/job/axiom-1.2.x/ws/axiom/testing/jaxen-testsuite/target/jaxen-testsuite-1.2.21-SNAPSHOT-sources.jar>
to org.apache.ws.commons.axiom/jaxen-testsuite/1.2.21-20161016.172702-1/jaxen-testsuite-1.2.21-20161016.172702-1-sources.jar
[JENKINS] Archiving <https://builds.apache.org/job/axiom-1.2.x/ws/axiom/testing/jaxen-testsuite/target/jaxen-testsuite-1.2.21-SNAPSHOT-javadoc.jar>
to org.apache.ws.commons.axiom/jaxen-testsuite/1.2.21-20161016.172702-1/jaxen-testsuite-1.2.21-20161016.172702-1-javadoc.jar
Compressed 248.46 KB of artifacts by 38.6% relative to #40
[JENKINS] Archiving <https://builds.apache.org/job/axiom-1.2.x/ws/axiom/systests/eclipse-tests/pom.xml>
to org.apache.ws.commons.axiom/eclipse-tests/1.2.21-SNAPSHOT/eclipse-tests-1.2.21-SNAPSHOT.pom
[JENKINS] Archiving <https://builds.apache.org/job/axiom-1.2.x/ws/axiom/systests/eclipse-tests/target/it/project/target/jacoco.exec>
to org.apache.ws.commons.axiom/eclipse-tests/1.2.21-SNAPSHOT/eclipse-tests-1.2.21-SNAPSHOT-jacoco.exec
[JENKINS] Archiving <https://builds.apache.org/job/axiom-1.2.x/ws/axiom/aspects/shared-aspects/pom.xml>
to org.apache.ws.commons.axiom/shared-aspects/1.2.21-SNAPSHOT/shared-aspects-1.2.21-SNAPSHOT.pom
[JENKINS] Archiving <https://builds.apache.org/job/axiom-1.2.x/ws/axiom/aspects/shared-aspects/target/shared-aspects-1.2.21-SNAPSHOT.jar>
to org.apache.ws.commons.axiom/shared-aspects/1.2.21-20161016.172558-1/shared-aspects-1.2.21-20161016.172558-1.jar
[JENKINS] Archiving <https://builds.apache.org/job/axiom-1.2.x/ws/axiom/aspects/shared-aspects/target/shared-aspects-1.2.21-SNAPSHOT-sources.jar>
to org.apache.ws.commons.axiom/shared-aspects/1.2.21-20161016.172558-1/shared-aspects-1.2.21-20161016.172558-1-sources.jar
[JENKINS] Archiving <https://builds.apache.org/job/axiom-1.2.x/ws/axiom/aspects/shared-aspects/target/shared-aspects-1.2.21-SNAPSHOT-javadoc.jar>
to org.apache.ws.commons.axiom/shared-aspects/1.2.21-20161016.172558-1/shared-aspects-1.2.21-20161016.172558-1-javadoc.jar
[JENKINS] Archiving <https://builds.apache.org/job/axiom-1.2.x/ws/axiom/buildutils/shade-osgi/pom.xml>
to org.apache.ws.commons.axiom/shade-osgi/1.2.21-SNAPSHOT/shade-osgi-1.2.21-SNAPSHOT.pom
[JENKINS] Archiving <https://builds.apache.org/job/axiom-1.2.x/ws/axiom/buildutils/shade-osgi/target/shade-osgi-1.2.21-SNAPSHOT.jar>
to org.apache.ws.commons.axiom/shade-osgi/1.2.21-20161016.172028-1/shade-osgi-1.2.21-20161016.172028-1.jar
[JENKINS] Archiving <https://builds.apache.org/job/axiom-1.2.x/ws/axiom/buildutils/shade-osgi/target/shade-osgi-1.2.21-SNAPSHOT-sources.jar>
to org.apache.ws.commons.axiom/shade-osgi/1.2.21-20161016.172028-1/shade-osgi-1.2.21-20161016.172028-1-sources.jar
[JENKINS] Archiving <https://builds.apache.org/job/axiom-1.2.x/ws/axiom/buildutils/shade-osgi/target/shade-osgi-1.2.21-SNAPSHOT-javadoc.jar>
to org.apache.ws.commons.axiom/shade-osgi/1.2.21-20161016.172028-1/shade-osgi-1.2.21-20161016.172028-1-javadoc.jar
[JENKINS] Archiving <https://builds.apache.org/job/axiom-1.2.x/ws/axiom/buildutils/shade-axiom-xml/pom.xml>
to org.apache.ws.commons.axiom/shade-axiom-xml/1.2.21-SNAPSHOT/shade-axiom-xml-1.2.21-SNAPSHOT.pom
[JENKINS] Archiving <https://builds.apache.org/job/axiom-1.2.x/ws/axiom/buildutils/shade-axiom-xml/target/shade-axiom-xml-1.2.21-SNAPSHOT.jar>
to org.apache.ws.commons.axiom/shade-axiom-xml/1.2.21-20161016.172012-1/shade-axiom-xml-1.2.21-20161016.172012-1.jar
[JENKINS] Archiving <https://builds.apache.org/job/axiom-1.2.x/ws/axiom/buildutils/shade-axiom-xml/target/shade-axiom-xml-1.2.21-SNAPSHOT-sources.jar>
to org.apache.ws.commons.axiom/shade-axiom-xml/1.2.21-20161016.172012-1/shade-axiom-xml-1.2.21-20161016.172012-1-sources.jar
[JENKINS] Archiving <https://builds.apache.org/job/axiom-1.2.x/ws/axiom/buildutils/shade-axiom-xml/target/shade-axiom-xml-1.2.21-SNAPSHOT-javadoc.jar>
to org.apache.ws.commons.axiom/shade-axiom-xml/1.2.21-20161016.172012-1/shade-axiom-xml-1.2.21-20161016.172012-1-javadoc.jar
[JENKINS] Archiving <https://builds.apache.org/job/axiom-1.2.x/ws/axiom/axiom-jaxb/pom.xml>
to org.apache.ws.commons.axiom/axiom-jaxb/1.2.21-SNAPSHOT/axiom-jaxb-1.2.21-SNAPSHOT.pom
[JENKINS] Archiving <https://builds.apache.org/job/axiom-1.2.x/ws/axiom/axiom-jaxb/target/axiom-jaxb-1.2.21-SNAPSHOT.jar>
to org.apache.ws.commons.axiom/axiom-jaxb/1.2.21-20161016.173650-1/axiom-jaxb-1.2.21-20161016.173650-1.jar
[JENKINS] Archiving <https://builds.apache.org/job/axiom-1.2.x/ws/axiom/axiom-jaxb/target/axiom-jaxb-1.2.21-SNAPSHOT-sources.jar>
to org.apache.ws.commons.axiom/axiom-jaxb/1.2.21-20161016.173650-1/axiom-jaxb-1.2.21-20161016.173650-1-sources.jar
[JENKINS] Archiving <https://builds.apache.org/job/axiom-1.2.x/ws/axiom/axiom-jaxb/target/axiom-jaxb-1.2.21-SNAPSHOT-javadoc.jar>
to org.apache.ws.commons.axiom/axiom-jaxb/1.2.21-20161016.173650-1/axiom-jaxb-1.2.21-20161016.173650-1-javadoc.jar
[JENKINS] Archiving <https://builds.apache.org/job/axiom-1.2.x/ws/axiom/axiom-jaxb/target/jacoco.exec>
to org.apache.ws.commons.axiom/axiom-jaxb/1.2.21-20161016.173650-1/axiom-jaxb-1.2.21-20161016.173650-1-jacoco.exec
[JENKINS] Archiving <https://builds.apache.org/job/axiom-1.2.x/ws/axiom/testing/axiom-testsuite/pom.xml>
to org.apache.ws.commons.axiom/axiom-testsuite/1.2.21-SNAPSHOT/axiom-testsuite-1.2.21-SNAPSHOT.pom
[JENKINS] Archiving <https://builds.apache.org/job/axiom-1.2.x/ws/axiom/testing/axiom-testsuite/target/axiom-testsuite-1.2.21-SNAPSHOT.jar>
to org.apache.ws.commons.axiom/axiom-testsuite/1.2.21-20161016.172751-1/axiom-testsuite-1.2.21-20161016.172751-1.jar
[JENKINS] Archiving <https://builds.apache.org/job/axiom-1.2.x/ws/axiom/testing/axiom-testsuite/target/axiom-testsuite-1.2.21-SNAPSHOT-sources.jar>
to org.apache.ws.commons.axiom/axiom-testsuite/1.2.21-20161016.172751-1/axiom-testsuite-1.2.21-20161016.172751-1-sources.jar
[JENKINS] Archiving <https://builds.apache.org/job/axiom-1.2.x/ws/axiom/testing/axiom-testsuite/target/axiom-testsuite-1.2.21-SNAPSHOT-javadoc.jar>
to org.apache.ws.commons.axiom/axiom-testsuite/1.2.21-20161016.172751-1/axiom-testsuite-1.2.21-20161016.172751-1-javadoc.jar
Compressed 5.21 MB of artifacts by 14.4% relative to #40
[JENKINS] Archiving <https://builds.apache.org/job/axiom-1.2.x/ws/axiom/testing/multiton/pom.xml>
to org.apache.ws.commons.axiom/multiton/1.2.21-SNAPSHOT/multiton-1.2.21-SNAPSHOT.pom
[JENKINS] Archiving <https://builds.apache.org/job/axiom-1.2.x/ws/axiom/testing/multiton/target/multiton-1.2.21-SNAPSHOT.jar>
to org.apache.ws.commons.axiom/multiton/1.2.21-20161016.172119-1/multiton-1.2.21-20161016.172119-1.jar
[JENKINS] Archiving <https://builds.apache.org/job/axiom-1.2.x/ws/axiom/testing/multiton/target/multiton-1.2.21-SNAPSHOT-sources.jar>
to org.apache.ws.commons.axiom/multiton/1.2.21-20161016.172119-1/multiton-1.2.21-20161016.172119-1-sources.jar
[JENKINS] Archiving <https://builds.apache.org/job/axiom-1.2.x/ws/axiom/testing/multiton/target/multiton-1.2.21-SNAPSHOT-javadoc.jar>
to org.apache.ws.commons.axiom/multiton/1.2.21-20161016.172119-1/multiton-1.2.21-20161016.172119-1-javadoc.jar
[JENKINS] Archiving <https://builds.apache.org/job/axiom-1.2.x/ws/axiom/buildutils/no-package-cycles-enforcer-rule/pom.xml>
to org.apache.ws.commons.axiom/no-package-cycles-enforcer-rule/1.2.21-SNAPSHOT/no-package-cycles-enforcer-rule-1.2.21-SNAPSHOT.pom
[JENKINS] Archiving <https://builds.apache.org/job/axiom-1.2.x/ws/axiom/buildutils/no-package-cycles-enforcer-rule/target/no-package-cycles-enforcer-rule-1.2.21-SNAPSHOT.jar>
to org.apache.ws.commons.axiom/no-package-cycles-enforcer-rule/1.2.21-20161016.172059-1/no-package-cycles-enforcer-rule-1.2.21-20161016.172059-1.jar
[JENKINS] Archiving <https://builds.apache.org/job/axiom-1.2.x/ws/axiom/buildutils/no-package-cycles-enforcer-rule/target/no-package-cycles-enforcer-rule-1.2.21-SNAPSHOT-sources.jar>
to org.apache.ws.commons.axiom/no-package-cycles-enforcer-rule/1.2.21-20161016.172059-1/no-package-cycles-enforcer-rule-1.2.21-20161016.172059-1-sources.jar
[JENKINS] Archiving <https://builds.apache.org/job/axiom-1.2.x/ws/axiom/buildutils/no-package-cycles-enforcer-rule/target/no-package-cycles-enforcer-rule-1.2.21-SNAPSHOT-javadoc.jar>
to org.apache.ws.commons.axiom/no-package-cycles-enforcer-rule/1.2.21-20161016.172059-1/no-package-cycles-enforcer-rule-1.2.21-20161016.172059-1-javadoc.jar
[JENKINS] Archiving <https://builds.apache.org/job/axiom-1.2.x/ws/axiom/axiom-compat/pom.xml>
to org.apache.ws.commons.axiom/axiom-compat/1.2.21-SNAPSHOT/axiom-compat-1.2.21-SNAPSHOT.pom
[JENKINS] Archiving <https://builds.apache.org/job/axiom-1.2.x/ws/axiom/axiom-compat/target/axiom-compat-1.2.21-SNAPSHOT.jar>
to org.apache.ws.commons.axiom/axiom-compat/1.2.21-20161016.173628-1/axiom-compat-1.2.21-20161016.173628-1.jar
[JENKINS] Archiving <https://builds.apache.org/job/axiom-1.2.x/ws/axiom/axiom-compat/target/axiom-compat-1.2.21-SNAPSHOT-sources.jar>
to org.apache.ws.commons.axiom/axiom-compat/1.2.21-20161016.173628-1/axiom-compat-1.2.21-20161016.173628-1-sources.jar
[JENKINS] Archiving <https://builds.apache.org/job/axiom-1.2.x/ws/axiom/axiom-compat/target/axiom-compat-1.2.21-SNAPSHOT-javadoc.jar>
to org.apache.ws.commons.axiom/axiom-compat/1.2.21-20161016.173628-1/axiom-compat-1.2.21-20161016.173628-1-javadoc.jar
[JENKINS] Archiving <https://builds.apache.org/job/axiom-1.2.x/ws/axiom/axiom-compat/target/jacoco.exec>
to org.apache.ws.commons.axiom/axiom-compat/1.2.21-20161016.173628-1/axiom-compat-1.2.21-20161016.173628-1-jacoco.exec
[JENKINS] Archiving <https://builds.apache.org/job/axiom-1.2.x/ws/axiom/systests/old-tests/pom.xml>
to org.apache.ws.commons.axiom/old-tests/1.2.21-SNAPSHOT/old-tests-1.2.21-SNAPSHOT.pom
[JENKINS] Archiving <https://builds.apache.org/job/axiom-1.2.x/ws/axiom/systests/old-tests/target/old-tests-1.2.21-SNAPSHOT.jar>
to org.apache.ws.commons.axiom/old-tests/1.2.21-SNAPSHOT/old-tests-1.2.21-SNAPSHOT.jar
[JENKINS] Archiving <https://builds.apache.org/job/axiom-1.2.x/ws/axiom/systests/old-tests/target/old-tests-1.2.21-SNAPSHOT-sources.jar>
to org.apache.ws.commons.axiom/old-tests/1.2.21-SNAPSHOT/old-tests-1.2.21-SNAPSHOT-sources.jar
[JENKINS] Archiving <https://builds.apache.org/job/axiom-1.2.x/ws/axiom/systests/old-tests/target/jacoco.exec>
to org.apache.ws.commons.axiom/old-tests/1.2.21-SNAPSHOT/old-tests-1.2.21-SNAPSHOT-jacoco.exec
[JENKINS] Archiving <https://builds.apache.org/job/axiom-1.2.x/ws/axiom/components/pom.xml>
to org.apache.ws.commons.axiom/components/1.2.21-SNAPSHOT/components-1.2.21-SNAPSHOT.pom
[JENKINS] Archiving <https://builds.apache.org/job/axiom-1.2.x/ws/axiom/aspects/pom.xml>
to org.apache.ws.commons.axiom/aspects/1.2.21-SNAPSHOT/aspects-1.2.21-SNAPSHOT.pom
Sending e-mails to: dev@ws.apache.org andreas.veithen@gmail.com
channel stopped

---------------------------------------------------------------------
To unsubscribe, e-mail: dev-unsubscribe@ws.apache.org
For additional commands, e-mail: dev-help@ws.apache.org


Mime
View raw message