ws-dev mailing list archives

Site index · List index
Message view « Date » · « Thread »
Top « Date » · « Thread »
From Apache Jenkins Server <jenk...@builds.apache.org>
Subject Build failed in Jenkins: wss4j-2.0 #106
Date Tue, 09 Aug 2016 11:03:31 GMT
See <https://builds.apache.org/job/wss4j-2.0/106/changes>

Changes:

[coheigea] NPE fix

------------------------------------------
[...truncated 3801 lines...]
Tests run: 6, Failures: 0, Errors: 0, Skipped: 0, Time elapsed: 0.035 sec - in org.apache.wss4j.policy.stax.test.EncryptedPartsTest
Running org.apache.wss4j.policy.stax.test.HttpsTokenTest
Tests run: 2, Failures: 0, Errors: 0, Skipped: 0, Time elapsed: 0.02 sec - in org.apache.wss4j.policy.stax.test.HttpsTokenTest
Running org.apache.wss4j.policy.stax.test.RequiredElementsTest
Tests run: 2, Failures: 0, Errors: 0, Skipped: 0, Time elapsed: 0.014 sec - in org.apache.wss4j.policy.stax.test.RequiredElementsTest
Running org.apache.wss4j.policy.stax.test.ProtectionOrderTest
Tests run: 6, Failures: 0, Errors: 0, Skipped: 0, Time elapsed: 0.036 sec - in org.apache.wss4j.policy.stax.test.ProtectionOrderTest
Running org.apache.wss4j.policy.stax.test.SignedElementsTest
Tests run: 2, Failures: 0, Errors: 0, Skipped: 0, Time elapsed: 0.012 sec - in org.apache.wss4j.policy.stax.test.SignedElementsTest
Running org.apache.wss4j.policy.stax.test.KerberosTokenTest
Tests run: 2, Failures: 0, Errors: 0, Skipped: 0, Time elapsed: 0.018 sec - in org.apache.wss4j.policy.stax.test.KerberosTokenTest
Running org.apache.wss4j.policy.stax.test.ContentEncryptedElementsTest
Tests run: 2, Failures: 0, Errors: 0, Skipped: 0, Time elapsed: 0.01 sec - in org.apache.wss4j.policy.stax.test.ContentEncryptedElementsTest
Running org.apache.wss4j.policy.stax.test.X509TokenTest
Tests run: 2, Failures: 0, Errors: 0, Skipped: 0, Time elapsed: 0.015 sec - in org.apache.wss4j.policy.stax.test.X509TokenTest
Running org.apache.wss4j.policy.stax.test.RequiredPartsTest
Tests run: 2, Failures: 0, Errors: 0, Skipped: 0, Time elapsed: 0.008 sec - in org.apache.wss4j.policy.stax.test.RequiredPartsTest
Running org.apache.wss4j.policy.stax.test.RelTokenTest
Tests run: 1, Failures: 0, Errors: 0, Skipped: 0, Time elapsed: 0.007 sec - in org.apache.wss4j.policy.stax.test.RelTokenTest
Running org.apache.wss4j.policy.stax.test.SignedPartsTest
Tests run: 6, Failures: 0, Errors: 0, Skipped: 0, Time elapsed: 0.02 sec - in org.apache.wss4j.policy.stax.test.SignedPartsTest
Running org.apache.wss4j.policy.stax.test.AsymmetricBindingTest
Tests run: 7, Failures: 0, Errors: 0, Skipped: 0, Time elapsed: 0.063 sec - in org.apache.wss4j.policy.stax.test.AsymmetricBindingTest
Running org.apache.wss4j.policy.stax.test.UsernameTokenTest
Tests run: 2, Failures: 0, Errors: 0, Skipped: 0, Time elapsed: 0.013 sec - in org.apache.wss4j.policy.stax.test.UsernameTokenTest
Running org.apache.wss4j.policy.stax.test.VulnerabliltyVectorsTest
Tests run: 2, Failures: 0, Errors: 0, Skipped: 1, Time elapsed: 0.495 sec - in org.apache.wss4j.policy.stax.test.VulnerabliltyVectorsTest
Running org.apache.wss4j.policy.stax.test.AlgorithmSuiteTest
Tests run: 6, Failures: 0, Errors: 0, Skipped: 0, Time elapsed: 0.033 sec - in org.apache.wss4j.policy.stax.test.AlgorithmSuiteTest

Results :

Tests run: 170, Failures: 0, Errors: 0, Skipped: 1

[JENKINS] Recording test results
[INFO] 
[INFO] --- maven-jar-plugin:2.6:jar (default-jar) @ wss4j-ws-security-policy-stax ---
[INFO] Building jar: <https://builds.apache.org/job/wss4j-2.0/ws/wss4j/ws-security-policy-stax/target/wss4j-ws-security-policy-stax-2.0.10-SNAPSHOT.jar>
[INFO] 
[INFO] --- maven-site-plugin:3.4:attach-descriptor (attach-descriptor) @ wss4j-ws-security-policy-stax
---
[INFO] 
[INFO] >>> maven-source-plugin:2.4:jar (default) > generate-sources @ wss4j-ws-security-policy-stax
>>>
[INFO] 
[INFO] >>> maven-pmd-plugin:3.1:check (validate) > :pmd @ wss4j-ws-security-policy-stax
>>>
[INFO] 
[INFO] --- maven-pmd-plugin:3.1:pmd (pmd) @ wss4j-ws-security-policy-stax ---
[INFO] 
[INFO] <<< maven-pmd-plugin:3.1:check (validate) < :pmd @ wss4j-ws-security-policy-stax
<<<
[INFO] 
[INFO] --- maven-pmd-plugin:3.1:check (validate) @ wss4j-ws-security-policy-stax ---
[INFO] 
[INFO] 
[INFO] --- maven-enforcer-plugin:1.3.1:enforce (enforce-bytecode-version) @ wss4j-ws-security-policy-stax
---
[INFO] 
[INFO] --- maven-bundle-plugin:2.5.4:cleanVersions (versions) @ wss4j-ws-security-policy-stax
---
[WARNING] Failed to getClass for org.apache.maven.plugin.source.SourceJarMojo
[INFO] 
[INFO] <<< maven-source-plugin:2.4:jar (default) < generate-sources @ wss4j-ws-security-policy-stax
<<<
[INFO] 
[INFO] --- maven-source-plugin:2.4:jar (default) @ wss4j-ws-security-policy-stax ---
[INFO] Building jar: <https://builds.apache.org/job/wss4j-2.0/ws/wss4j/ws-security-policy-stax/target/wss4j-ws-security-policy-stax-2.0.10-SNAPSHOT-sources.jar>
[INFO] 
[INFO] --- maven-install-plugin:2.5.2:install (default-install) @ wss4j-ws-security-policy-stax
---
[INFO] Installing <https://builds.apache.org/job/wss4j-2.0/ws/wss4j/ws-security-policy-stax/target/wss4j-ws-security-policy-stax-2.0.10-SNAPSHOT.jar>
to /home/jenkins/jenkins-slave/maven-repositories/0/org/apache/wss4j/wss4j-ws-security-policy-stax/2.0.10-SNAPSHOT/wss4j-ws-security-policy-stax-2.0.10-SNAPSHOT.jar
[INFO] Installing <https://builds.apache.org/job/wss4j-2.0/ws/wss4j/ws-security-policy-stax/pom.xml>
to /home/jenkins/jenkins-slave/maven-repositories/0/org/apache/wss4j/wss4j-ws-security-policy-stax/2.0.10-SNAPSHOT/wss4j-ws-security-policy-stax-2.0.10-SNAPSHOT.pom
[INFO] Installing <https://builds.apache.org/job/wss4j-2.0/ws/wss4j/ws-security-policy-stax/target/wss4j-ws-security-policy-stax-2.0.10-SNAPSHOT-sources.jar>
to /home/jenkins/jenkins-slave/maven-repositories/0/org/apache/wss4j/wss4j-ws-security-policy-stax/2.0.10-SNAPSHOT/wss4j-ws-security-policy-stax-2.0.10-SNAPSHOT-sources.jar
[INFO] 
[INFO] >>> maven-pmd-plugin:3.1:check (validate) > :pmd @ wss4j-ws-security-policy-stax
>>>
[INFO] 
[INFO] --- maven-pmd-plugin:3.1:pmd (pmd) @ wss4j-ws-security-policy-stax ---
[INFO] 
[INFO] <<< maven-pmd-plugin:3.1:check (validate) < :pmd @ wss4j-ws-security-policy-stax
<<<
[INFO] 
[INFO] --- maven-pmd-plugin:3.1:check (validate) @ wss4j-ws-security-policy-stax ---
[INFO] 
[INFO] 
[INFO] --- maven-enforcer-plugin:1.3.1:enforce (enforce-bytecode-version) @ wss4j-ws-security-policy-stax
---
[INFO] 
[INFO] --- maven-bundle-plugin:2.5.4:cleanVersions (versions) @ wss4j-ws-security-policy-stax
---
[INFO] 
[INFO] --- maven-remote-resources-plugin:1.5:process (default) @ wss4j-ws-security-policy-stax
---
[INFO] 
[INFO] --- maven-resources-plugin:2.7:resources (default-resources) @ wss4j-ws-security-policy-stax
---
[INFO] Using 'UTF-8' encoding to copy filtered resources.
[INFO] Copying 0 resource
[INFO] Copying 8 resources
[INFO] skip non existing resourceDirectory <https://builds.apache.org/job/wss4j-2.0/ws/wss4j/ws-security-policy-stax/src/main/resources-filtered>
[INFO] skip non existing resourceDirectory <https://builds.apache.org/job/wss4j-2.0/ws/wss4j/ws-security-policy-stax/target/generated/src/main/resources>
[INFO] Copying 3 resources
[INFO] Copying 3 resources
[INFO] 
[INFO] --- maven-compiler-plugin:3.3:compile (default-compile) @ wss4j-ws-security-policy-stax
---
[INFO] Nothing to compile - all classes are up to date
[INFO] 
[INFO] --- animal-sniffer-maven-plugin:1.14:check (check-java-compatibility) @ wss4j-ws-security-policy-stax
---
[INFO] Checking unresolved references to org.codehaus.mojo.signature:java16:1.0
[INFO] 
[INFO] >>> maven-bundle-plugin:2.5.4:manifest (bundle-manifest) > process-classes
@ wss4j-ws-security-policy-stax >>>
[INFO] 
[INFO] >>> maven-pmd-plugin:3.1:check (validate) > :pmd @ wss4j-ws-security-policy-stax
>>>
[INFO] 
[INFO] --- maven-pmd-plugin:3.1:pmd (pmd) @ wss4j-ws-security-policy-stax ---
[INFO] 
[INFO] <<< maven-pmd-plugin:3.1:check (validate) < :pmd @ wss4j-ws-security-policy-stax
<<<
[INFO] 
[INFO] --- maven-pmd-plugin:3.1:check (validate) @ wss4j-ws-security-policy-stax ---
[INFO] 
[INFO] 
[INFO] --- maven-enforcer-plugin:1.3.1:enforce (enforce-bytecode-version) @ wss4j-ws-security-policy-stax
---
[INFO] 
[INFO] --- maven-bundle-plugin:2.5.4:cleanVersions (versions) @ wss4j-ws-security-policy-stax
---
[INFO] 
[INFO] --- maven-remote-resources-plugin:1.5:process (default) @ wss4j-ws-security-policy-stax
---
[INFO] 
[INFO] --- maven-resources-plugin:2.7:resources (default-resources) @ wss4j-ws-security-policy-stax
---
[INFO] Using 'UTF-8' encoding to copy filtered resources.
[INFO] Copying 0 resource
[INFO] Copying 8 resources
[INFO] skip non existing resourceDirectory <https://builds.apache.org/job/wss4j-2.0/ws/wss4j/ws-security-policy-stax/src/main/resources-filtered>
[INFO] skip non existing resourceDirectory <https://builds.apache.org/job/wss4j-2.0/ws/wss4j/ws-security-policy-stax/target/generated/src/main/resources>
[INFO] Copying 3 resources
[INFO] Copying 3 resources
[INFO] Copying 3 resources
[INFO] 
[INFO] --- maven-compiler-plugin:3.3:compile (default-compile) @ wss4j-ws-security-policy-stax
---
[INFO] Nothing to compile - all classes are up to date
[INFO] 
[INFO] --- animal-sniffer-maven-plugin:1.14:check (check-java-compatibility) @ wss4j-ws-security-policy-stax
---
[INFO] Checking unresolved references to org.codehaus.mojo.signature:java16:1.0
[WARNING] Failed to getClass for org.apache.felix.bundleplugin.ManifestPlugin
[INFO] 
[INFO] <<< maven-bundle-plugin:2.5.4:manifest (bundle-manifest) < process-classes
@ wss4j-ws-security-policy-stax <<<
[INFO] 
[INFO] --- maven-bundle-plugin:2.5.4:manifest (bundle-manifest) @ wss4j-ws-security-policy-stax
---
[INFO] 
[INFO] --- maven-resources-plugin:2.7:testResources (default-testResources) @ wss4j-ws-security-policy-stax
---
[INFO] Using 'UTF-8' encoding to copy filtered resources.
[INFO] Copying 0 resource
[INFO] Copying 10 resources
[INFO] skip non existing resourceDirectory <https://builds.apache.org/job/wss4j-2.0/ws/wss4j/ws-security-policy-stax/target/generated/src/test/resources>
[INFO] Copying 3 resources
[INFO] Copying 3 resources
[INFO] 
[INFO] --- maven-compiler-plugin:3.3:testCompile (default-testCompile) @ wss4j-ws-security-policy-stax
---
[INFO] Nothing to compile - all classes are up to date
[INFO] 
[INFO] --- maven-surefire-plugin:2.18.1:test (default-test) @ wss4j-ws-security-policy-stax
---
[INFO] Skipping execution of surefire because it has already been run for this configuration
[JENKINS] Recording test results
[INFO] 
[INFO] --- maven-jar-plugin:2.6:jar (default-jar) @ wss4j-ws-security-policy-stax ---
[INFO] Building jar: <https://builds.apache.org/job/wss4j-2.0/ws/wss4j/ws-security-policy-stax/target/wss4j-ws-security-policy-stax-2.0.10-SNAPSHOT.jar>
[INFO] 
[INFO] --- maven-site-plugin:3.4:attach-descriptor (attach-descriptor) @ wss4j-ws-security-policy-stax
---
[INFO] 
[INFO] >>> maven-source-plugin:2.4:jar (default) > generate-sources @ wss4j-ws-security-policy-stax
>>>
[INFO] 
[INFO] >>> maven-pmd-plugin:3.1:check (validate) > :pmd @ wss4j-ws-security-policy-stax
>>>
[INFO] 
[INFO] --- maven-pmd-plugin:3.1:pmd (pmd) @ wss4j-ws-security-policy-stax ---
[INFO] 
[INFO] <<< maven-pmd-plugin:3.1:check (validate) < :pmd @ wss4j-ws-security-policy-stax
<<<
[INFO] 
[INFO] --- maven-pmd-plugin:3.1:check (validate) @ wss4j-ws-security-policy-stax ---
[INFO] 
[INFO] 
[INFO] --- maven-enforcer-plugin:1.3.1:enforce (enforce-bytecode-version) @ wss4j-ws-security-policy-stax
---
[INFO] 
[INFO] --- maven-bundle-plugin:2.5.4:cleanVersions (versions) @ wss4j-ws-security-policy-stax
---
[WARNING] Failed to getClass for org.apache.maven.plugin.source.SourceJarMojo
[INFO] 
[INFO] <<< maven-source-plugin:2.4:jar (default) < generate-sources @ wss4j-ws-security-policy-stax
<<<
[INFO] 
[INFO] --- maven-source-plugin:2.4:jar (default) @ wss4j-ws-security-policy-stax ---
[INFO] Building jar: <https://builds.apache.org/job/wss4j-2.0/ws/wss4j/ws-security-policy-stax/target/wss4j-ws-security-policy-stax-2.0.10-SNAPSHOT-sources.jar>
[INFO] 
[INFO] --- maven-install-plugin:2.5.2:install (default-install) @ wss4j-ws-security-policy-stax
---
[INFO] Installing <https://builds.apache.org/job/wss4j-2.0/ws/wss4j/ws-security-policy-stax/target/wss4j-ws-security-policy-stax-2.0.10-SNAPSHOT.jar>
to /home/jenkins/jenkins-slave/maven-repositories/0/org/apache/wss4j/wss4j-ws-security-policy-stax/2.0.10-SNAPSHOT/wss4j-ws-security-policy-stax-2.0.10-SNAPSHOT.jar
[INFO] Installing <https://builds.apache.org/job/wss4j-2.0/ws/wss4j/ws-security-policy-stax/pom.xml>
to /home/jenkins/jenkins-slave/maven-repositories/0/org/apache/wss4j/wss4j-ws-security-policy-stax/2.0.10-SNAPSHOT/wss4j-ws-security-policy-stax-2.0.10-SNAPSHOT.pom
[INFO] Installing <https://builds.apache.org/job/wss4j-2.0/ws/wss4j/ws-security-policy-stax/target/wss4j-ws-security-policy-stax-2.0.10-SNAPSHOT-sources.jar>
to /home/jenkins/jenkins-slave/maven-repositories/0/org/apache/wss4j/wss4j-ws-security-policy-stax/2.0.10-SNAPSHOT/wss4j-ws-security-policy-stax-2.0.10-SNAPSHOT-sources.jar
[INFO] Installing <https://builds.apache.org/job/wss4j-2.0/ws/wss4j/ws-security-policy-stax/target/wss4j-ws-security-policy-stax-2.0.10-SNAPSHOT-sources.jar>
to /home/jenkins/jenkins-slave/maven-repositories/0/org/apache/wss4j/wss4j-ws-security-policy-stax/2.0.10-SNAPSHOT/wss4j-ws-security-policy-stax-2.0.10-SNAPSHOT-sources.jar
[INFO] 
[INFO] --- maven-deploy-plugin:2.8.2:deploy (default-deploy) @ wss4j-ws-security-policy-stax
---
[INFO] Downloading: https://repository.apache.org/content/repositories/snapshots/org/apache/wss4j/wss4j-ws-security-policy-stax/2.0.10-SNAPSHOT/maven-metadata.xml
[INFO] Downloaded: https://repository.apache.org/content/repositories/snapshots/org/apache/wss4j/wss4j-ws-security-policy-stax/2.0.10-SNAPSHOT/maven-metadata.xml
(1013 B at 1.7 KB/sec)
[INFO] Uploading: https://repository.apache.org/content/repositories/snapshots/org/apache/wss4j/wss4j-ws-security-policy-stax/2.0.10-SNAPSHOT/wss4j-ws-security-policy-stax-2.0.10-20160809.105922-3.jar
[INFO] Uploaded: https://repository.apache.org/content/repositories/snapshots/org/apache/wss4j/wss4j-ws-security-policy-stax/2.0.10-SNAPSHOT/wss4j-ws-security-policy-stax-2.0.10-20160809.105922-3.jar
(128 KB at 80.6 KB/sec)
[INFO] Uploading: https://repository.apache.org/content/repositories/snapshots/org/apache/wss4j/wss4j-ws-security-policy-stax/2.0.10-SNAPSHOT/wss4j-ws-security-policy-stax-2.0.10-20160809.105922-3.pom
[INFO] ------------------------------------------------------------------------
[INFO] Reactor Summary:
[INFO] 
[INFO] Apache WSS4J ....................................... SUCCESS [ 21.928 s]
[INFO] Apache WSS4J parent ................................ SUCCESS [ 12.847 s]
[INFO] Apache WSS4J WS-Security Bindings .................. SUCCESS [ 30.645 s]
[INFO] Apache WSS4J WS-SecurityPolicy model ............... SUCCESS [ 42.589 s]
[INFO] Apache WSS4J WS-Security Common .................... SUCCESS [01:06 min]
[INFO] Apache WSS4J DOM WS-Security ....................... SUCCESS [01:15 min]
[INFO] Apache WSS4J Streaming WS-Security ................. SUCCESS [02:05 min]
[INFO] Apache WSS4J WS-Security Integration ............... SUCCESS [01:52 min]
[INFO] Apache WSS4J Streaming WS-SecurityPolicy ........... FAILURE [01:38 min]
[INFO] ------------------------------------------------------------------------
[INFO] BUILD FAILURE
[INFO] ------------------------------------------------------------------------
[INFO] Total time: 10:41 min
[INFO] Finished at: 2016-08-09T11:00:32+00:00
[INFO] Final Memory: 125M/859M
[INFO] ------------------------------------------------------------------------
[WARNING] The requested profile "deploy" could not be activated because it does not exist.
Waiting for Jenkins to finish collecting data
[ERROR] Failed to execute goal org.apache.maven.plugins:maven-deploy-plugin:2.8.2:deploy (default-deploy)
on project wss4j-ws-security-policy-stax: Failed to deploy artifacts: Could not transfer artifact
org.apache.wss4j:wss4j-ws-security-policy-stax:pom:2.0.10-20160809.105922-3 from/to apache.snapshots.https
(https://repository.apache.org/content/repositories/snapshots): repository.apache.org:443
failed to respond -> [Help 1]
[ERROR] 
[ERROR] To see the full stack trace of the errors, re-run Maven with the -e switch.
[ERROR] Re-run Maven using the -X switch to enable full debug logging.
[ERROR] 
[ERROR] For more information about the errors and possible solutions, please read the following
articles:
[ERROR] [Help 1] http://cwiki.apache.org/confluence/display/MAVEN/MojoExecutionException
[ERROR] 
[ERROR] After correcting the problems, you can resume the build with the command
[ERROR]   mvn <goals> -rf :wss4j-ws-security-policy-stax
[JENKINS] Archiving <https://builds.apache.org/job/wss4j-2.0/ws/wss4j/policy/pom.xml>
to org.apache.wss4j/wss4j-policy/2.0.10-SNAPSHOT/wss4j-policy-2.0.10-SNAPSHOT.pom
[JENKINS] Archiving <https://builds.apache.org/job/wss4j-2.0/ws/wss4j/policy/target/wss4j-policy-2.0.10-SNAPSHOT.jar>
to org.apache.wss4j/wss4j-policy/2.0.10-20160809.105138-3/wss4j-policy-2.0.10-20160809.105138-3.jar
[JENKINS] Archiving <https://builds.apache.org/job/wss4j-2.0/ws/wss4j/policy/target/wss4j-policy-2.0.10-SNAPSHOT-sources.jar>
to org.apache.wss4j/wss4j-policy/2.0.10-20160809.105138-3/wss4j-policy-2.0.10-20160809.105138-3-sources.jar
[JENKINS] Archiving <https://builds.apache.org/job/wss4j-2.0/ws/wss4j/bindings/pom.xml>
to org.apache.wss4j/wss4j-bindings/2.0.10-SNAPSHOT/wss4j-bindings-2.0.10-SNAPSHOT.pom
[JENKINS] Archiving <https://builds.apache.org/job/wss4j-2.0/ws/wss4j/bindings/target/wss4j-bindings-2.0.10-SNAPSHOT.jar>
to org.apache.wss4j/wss4j-bindings/2.0.10-20160809.105051-3/wss4j-bindings-2.0.10-20160809.105051-3.jar
[JENKINS] Archiving <https://builds.apache.org/job/wss4j-2.0/ws/wss4j/bindings/target/wss4j-bindings-2.0.10-SNAPSHOT-sources.jar>
to org.apache.wss4j/wss4j-bindings/2.0.10-20160809.105051-3/wss4j-bindings-2.0.10-20160809.105051-3-sources.jar
[JENKINS] Archiving <https://builds.apache.org/job/wss4j-2.0/ws/wss4j/ws-security-dom/pom.xml>
to org.apache.wss4j/wss4j-ws-security-dom/2.0.10-SNAPSHOT/wss4j-ws-security-dom-2.0.10-SNAPSHOT.pom
[JENKINS] Archiving <https://builds.apache.org/job/wss4j-2.0/ws/wss4j/ws-security-dom/target/wss4j-ws-security-dom-2.0.10-SNAPSHOT.jar>
to org.apache.wss4j/wss4j-ws-security-dom/2.0.10-20160809.105356-3/wss4j-ws-security-dom-2.0.10-20160809.105356-3.jar
[JENKINS] Archiving <https://builds.apache.org/job/wss4j-2.0/ws/wss4j/ws-security-dom/target/wss4j-ws-security-dom-2.0.10-SNAPSHOT-sources.jar>
to org.apache.wss4j/wss4j-ws-security-dom/2.0.10-20160809.105356-3/wss4j-ws-security-dom-2.0.10-20160809.105356-3-sources.jar
[JENKINS] Archiving <https://builds.apache.org/job/wss4j-2.0/ws/wss4j/ws-security-dom/target/wss4j-ws-security-dom-2.0.10-SNAPSHOT-tests.jar>
to org.apache.wss4j/wss4j-ws-security-dom/2.0.10-20160809.105356-3/wss4j-ws-security-dom-2.0.10-20160809.105356-3-tests.jar
[JENKINS] Archiving <https://builds.apache.org/job/wss4j-2.0/ws/wss4j/ws-security-common/pom.xml>
to org.apache.wss4j/wss4j-ws-security-common/2.0.10-SNAPSHOT/wss4j-ws-security-common-2.0.10-SNAPSHOT.pom
[JENKINS] Archiving <https://builds.apache.org/job/wss4j-2.0/ws/wss4j/ws-security-common/target/wss4j-ws-security-common-2.0.10-SNAPSHOT.jar>
to org.apache.wss4j/wss4j-ws-security-common/2.0.10-20160809.105243-3/wss4j-ws-security-common-2.0.10-20160809.105243-3.jar
[JENKINS] Archiving <https://builds.apache.org/job/wss4j-2.0/ws/wss4j/ws-security-common/target/wss4j-ws-security-common-2.0.10-SNAPSHOT-sources.jar>
to org.apache.wss4j/wss4j-ws-security-common/2.0.10-20160809.105243-3/wss4j-ws-security-common-2.0.10-20160809.105243-3-sources.jar
[JENKINS] Archiving <https://builds.apache.org/job/wss4j-2.0/ws/wss4j/ws-security-common/target/wss4j-ws-security-common-2.0.10-SNAPSHOT-tests.jar>
to org.apache.wss4j/wss4j-ws-security-common/2.0.10-20160809.105243-3/wss4j-ws-security-common-2.0.10-20160809.105243-3-tests.jar
[JENKINS] Archiving <https://builds.apache.org/job/wss4j-2.0/ws/wss4j/ws-security-stax/pom.xml>
to org.apache.wss4j/wss4j-ws-security-stax/2.0.10-SNAPSHOT/wss4j-ws-security-stax-2.0.10-SNAPSHOT.pom
[JENKINS] Archiving <https://builds.apache.org/job/wss4j-2.0/ws/wss4j/ws-security-stax/target/wss4j-ws-security-stax-2.0.10-SNAPSHOT.jar>
to org.apache.wss4j/wss4j-ws-security-stax/2.0.10-20160809.105608-3/wss4j-ws-security-stax-2.0.10-20160809.105608-3.jar
[JENKINS] Archiving <https://builds.apache.org/job/wss4j-2.0/ws/wss4j/ws-security-stax/target/wss4j-ws-security-stax-2.0.10-SNAPSHOT-sources.jar>
to org.apache.wss4j/wss4j-ws-security-stax/2.0.10-20160809.105608-3/wss4j-ws-security-stax-2.0.10-20160809.105608-3-sources.jar
[JENKINS] Archiving <https://builds.apache.org/job/wss4j-2.0/ws/wss4j/ws-security-stax/target/wss4j-ws-security-stax-2.0.10-SNAPSHOT-tests.jar>
to org.apache.wss4j/wss4j-ws-security-stax/2.0.10-20160809.105608-3/wss4j-ws-security-stax-2.0.10-20160809.105608-3-tests.jar
[JENKINS] Archiving <https://builds.apache.org/job/wss4j-2.0/ws/wss4j/ws-security-policy-stax/pom.xml>
to org.apache.wss4j/wss4j-ws-security-policy-stax/2.0.10-SNAPSHOT/wss4j-ws-security-policy-stax-2.0.10-SNAPSHOT.pom
[JENKINS] Archiving <https://builds.apache.org/job/wss4j-2.0/ws/wss4j/ws-security-policy-stax/target/wss4j-ws-security-policy-stax-2.0.10-SNAPSHOT.jar>
to org.apache.wss4j/wss4j-ws-security-policy-stax/2.0.10-SNAPSHOT/wss4j-ws-security-policy-stax-2.0.10-SNAPSHOT.jar
[JENKINS] Archiving <https://builds.apache.org/job/wss4j-2.0/ws/wss4j/ws-security-policy-stax/target/wss4j-ws-security-policy-stax-2.0.10-SNAPSHOT-sources.jar>
to org.apache.wss4j/wss4j-ws-security-policy-stax/2.0.10-SNAPSHOT/wss4j-ws-security-policy-stax-2.0.10-SNAPSHOT-sources.jar
[JENKINS] Archiving <https://builds.apache.org/job/wss4j-2.0/ws/wss4j/parent/pom.xml>
to org.apache.wss4j/wss4j-parent/2.0.10-SNAPSHOT/wss4j-parent-2.0.10-SNAPSHOT.pom
[JENKINS] Archiving <https://builds.apache.org/job/wss4j-2.0/ws/wss4j/integration/pom.xml>
to org.apache.wss4j/integration/2.0.10-SNAPSHOT/integration-2.0.10-SNAPSHOT.pom
[JENKINS] Archiving <https://builds.apache.org/job/wss4j-2.0/ws/wss4j/integration/target/integration-2.0.10-SNAPSHOT.jar>
to org.apache.wss4j/integration/2.0.10-20160809.105819-3/integration-2.0.10-20160809.105819-3.jar
[JENKINS] Archiving <https://builds.apache.org/job/wss4j-2.0/ws/wss4j/integration/target/integration-2.0.10-SNAPSHOT-sources.jar>
to org.apache.wss4j/integration/2.0.10-20160809.105819-3/integration-2.0.10-20160809.105819-3-sources.jar
[JENKINS] Archiving <https://builds.apache.org/job/wss4j-2.0/ws/wss4j/integration/target/integration-2.0.10-SNAPSHOT-tests.jar>
to org.apache.wss4j/integration/2.0.10-20160809.105819-3/integration-2.0.10-20160809.105819-3-tests.jar
[JENKINS] Archiving <https://builds.apache.org/job/wss4j-2.0/ws/wss4j/pom.xml> to org.apache.wss4j/wss4j/2.0.10-SNAPSHOT/wss4j-2.0.10-SNAPSHOT.pom
[JENKINS] Archiving <https://builds.apache.org/job/wss4j-2.0/ws/wss4j/target/wss4j-2.0.10-SNAPSHOT-site.xml>
to org.apache.wss4j/wss4j/2.0.10-20160809.105003-3/wss4j-2.0.10-20160809.105003-3-site.xml
Sending e-mails to: dev@ws.apache.org
channel stopped

---------------------------------------------------------------------
To unsubscribe, e-mail: dev-unsubscribe@ws.apache.org
For additional commands, e-mail: dev-help@ws.apache.org


Mime
View raw message