ws-dev mailing list archives

Site index · List index
Message view « Date » · « Thread »
Top « Date » · « Thread »
From Apache Jenkins Server <jenk...@builds.apache.org>
Subject Build failed in Jenkins: wss4j-2.1 #20
Date Thu, 07 Jan 2016 14:47:42 GMT
See <https://builds.apache.org/job/wss4j-2.1/20/changes>

Changes:

[coheigea] Remove method from Crypto interface

[coheigea] Fixing deploy

[coheigea] [WSS-565] - Support the ability to create and process EncryptedKeys that reference
a PublicKey

------------------------------------------
Started by an SCM change
[EnvInject] - Loading node environment variables.
Building remotely on ubuntu3 (Ubuntu ubuntu legacy-ubuntu) in workspace <https://builds.apache.org/job/wss4j-2.1/ws/>
Updating http://svn.apache.org/repos/asf/webservices/wss4j/branches/2_1_x-fixes at revision
'2016-01-07T14:46:19.904 +0000'
U         build-tools/pom.xml
U         ws-security-dom/src/test/java/org/apache/wss4j/dom/message/EncryptionTest.java
U         ws-security-dom/src/main/java/org/apache/wss4j/dom/util/X509Util.java
U         ws-security-dom/src/main/java/org/apache/wss4j/dom/processor/SignatureProcessor.java
U         ws-security-dom/src/main/java/org/apache/wss4j/dom/processor/EncryptedKeyProcessor.java
U         ws-security-dom/src/main/java/org/apache/wss4j/dom/message/WSSecEncrypt.java
U         ws-security-dom/src/main/java/org/apache/wss4j/dom/message/WSSecEncryptedKey.java
U         ws-security-common/src/main/java/org/apache/wss4j/common/crypto/Merlin.java
U         ws-security-common/src/main/java/org/apache/wss4j/common/crypto/CertificateStore.java
U         ws-security-common/src/main/java/org/apache/wss4j/common/crypto/Crypto.java
At revision 1723564
Parsing POMs
Downloaded artifact http://repository.apache.org/snapshots/org/apache/wss4j/wss4j/2.2.0-SNAPSHOT/maven-metadata.xml
Downloaded artifact http://repository.apache.org/snapshots/org/apache/wss4j/wss4j/2.2.0-SNAPSHOT/wss4j-2.2.0-20160107.132727-12.pom
Modules changed, recalculating dependency graph
Established TCP socket on 51067
maven-agent.jar already up to date
classworlds.jar already up to date
maven-interceptor.jar already up to date
maven2.1-interceptor.jar already up to date
[wss4j] $ /home/jenkins/tools/java/jdk1.7.0_79-unlimited-security/bin/java -Xmx2g -Xms256m
-XX:MaxPermSize=512m -cp /home/jenkins/jenkins-slave/maven-agent.jar:/home/jenkins/jenkins-slave/classworlds.jar
hudson.maven.agent.Main /home/jenkins/tools/maven/apache-maven-2.2.1 /x1/jenkins/jenkins-slave/slave.jar
/home/jenkins/jenkins-slave/maven-interceptor.jar 51067 /home/jenkins/jenkins-slave/maven2.1-interceptor.jar
<===[JENKINS REMOTING CAPACITY]===>   channel started
Executing Maven:  -B -f <https://builds.apache.org/job/wss4j-2.1/ws/wss4j/pom.xml> -Dmaven.repo.local=/home/jenkins/jenkins-slave/maven-repositories/0
clean install deploy -Pdeploy
[INFO] Scanning for projects...
[WARNING] 
	Profile with id: 'deploy' has not been activated.

[INFO] Reactor build order: 
[INFO]   Apache WSS4J
[INFO]   Apache WSS4J Build Tools
[INFO]   Apache WSS4J parent
[INFO]   Apache WSS4J WS-Security Bindings
[INFO]   Apache WSS4J WS-SecurityPolicy model
[INFO]   Apache WSS4J WS-Security Common
[INFO]   Apache WSS4J DOM WS-Security
[INFO]   Apache WSS4J Streaming WS-Security
[INFO]   Apache WSS4J WS-Security Integration
[INFO]   Apache WSS4J Streaming WS-SecurityPolicy
[INFO] ------------------------------------------------------------------------
[INFO] Building Apache WSS4J
[INFO]    task-segment: [clean, install, deploy]
[INFO] ------------------------------------------------------------------------
[INFO] [clean:clean {execution: default-clean}]
[INFO] Deleting <https://builds.apache.org/job/wss4j-2.1/ws/wss4j/target>
[INFO] Preparing pmd:check
[INFO] snapshot org.apache.wss4j:build-tools:2.1.5-SNAPSHOT: checking for updates from apache.snapshots
[INFO] [pmd:pmd {execution: pmd}]
ERROR: Could not find local repository for 2.2.1
[INFO] [pmd:check {execution: validate}]
[INFO] [remote-resources:process {execution: default}]
[INFO] [site:attach-descriptor {execution: default-attach-descriptor}]
[INFO] [site:attach-descriptor {execution: attach-descriptor}]
[INFO] Preparing source:jar
[WARNING] Removing: jar from forked lifecycle, to prevent recursive invocation.
[WARNING] Removing: check from forked lifecycle, to prevent recursive invocation.
[INFO] No goals needed for project - skipping
[INFO] [source:jar {execution: default}]
[INFO] [install:install {execution: default-install}]
[INFO] Installing <https://builds.apache.org/job/wss4j-2.1/ws/wss4j/pom.xml> to /home/jenkins/jenkins-slave/maven-repositories/0/org/apache/wss4j/wss4j/2.1.5-SNAPSHOT/wss4j-2.1.5-SNAPSHOT.pom
[INFO] Installing <https://builds.apache.org/job/wss4j-2.1/ws/wss4j/target/wss4j-2.1.5-SNAPSHOT-site.xml>
to /home/jenkins/jenkins-slave/maven-repositories/0/org/apache/wss4j/wss4j/2.1.5-SNAPSHOT/wss4j-2.1.5-SNAPSHOT-site.xml
[INFO] Installing <https://builds.apache.org/job/wss4j-2.1/ws/wss4j/target/wss4j-2.1.5-SNAPSHOT-site.xml>
to /home/jenkins/jenkins-slave/maven-repositories/0/org/apache/wss4j/wss4j/2.1.5-SNAPSHOT/wss4j-2.1.5-SNAPSHOT-site.xml
[INFO] Preparing pmd:check
[INFO] [pmd:pmd {execution: pmd}]
ERROR: Could not find local repository for 2.2.1
[INFO] [pmd:check {execution: validate}]
[INFO] [remote-resources:process {execution: default}]
[INFO] [site:attach-descriptor {execution: default-attach-descriptor}]
[INFO] [site:attach-descriptor {execution: attach-descriptor}]
[INFO] Preparing source:jar
[WARNING] Removing: jar from forked lifecycle, to prevent recursive invocation.
[WARNING] Removing: check from forked lifecycle, to prevent recursive invocation.
[INFO] No goals needed for project - skipping
[INFO] [source:jar {execution: default}]
[INFO] [install:install {execution: default-install}]
[INFO] Installing <https://builds.apache.org/job/wss4j-2.1/ws/wss4j/pom.xml> to /home/jenkins/jenkins-slave/maven-repositories/0/org/apache/wss4j/wss4j/2.1.5-SNAPSHOT/wss4j-2.1.5-SNAPSHOT.pom
[INFO] Installing <https://builds.apache.org/job/wss4j-2.1/ws/wss4j/target/wss4j-2.1.5-SNAPSHOT-site.xml>
to /home/jenkins/jenkins-slave/maven-repositories/0/org/apache/wss4j/wss4j/2.1.5-SNAPSHOT/wss4j-2.1.5-SNAPSHOT-site.xml
[INFO] Installing <https://builds.apache.org/job/wss4j-2.1/ws/wss4j/target/wss4j-2.1.5-SNAPSHOT-site.xml>
to /home/jenkins/jenkins-slave/maven-repositories/0/org/apache/wss4j/wss4j/2.1.5-SNAPSHOT/wss4j-2.1.5-SNAPSHOT-site.xml
[INFO] Installing <https://builds.apache.org/job/wss4j-2.1/ws/wss4j/target/wss4j-2.1.5-SNAPSHOT-site.xml>
to /home/jenkins/jenkins-slave/maven-repositories/0/org/apache/wss4j/wss4j/2.1.5-SNAPSHOT/wss4j-2.1.5-SNAPSHOT-site.xml
[INFO] Installing <https://builds.apache.org/job/wss4j-2.1/ws/wss4j/target/wss4j-2.1.5-SNAPSHOT-site.xml>
to /home/jenkins/jenkins-slave/maven-repositories/0/org/apache/wss4j/wss4j/2.1.5-SNAPSHOT/wss4j-2.1.5-SNAPSHOT-site.xml
[INFO] [deploy:deploy {execution: default-deploy}]
[INFO] Retrieving previous build number from apache.snapshots.https
[WARNING] *** CHECKSUM FAILED - Checksum failed on download: local = 'b06db60076d16cf63904bfb1f78a5f34af41804b';
remote = '2d4ec07f1f81296bc474b57b90cc84d3b17da61e' - RETRYING
[WARNING] *** CHECKSUM FAILED - Checksum failed on download: local = 'b06db60076d16cf63904bfb1f78a5f34af41804b';
remote = '2d4ec07f1f81296bc474b57b90cc84d3b17da61e' - IGNORING
Uploading: https://repository.apache.org/content/repositories/snapshots/org/apache/wss4j/wss4j/2.1.5-SNAPSHOT/wss4j-2.1.5-20160107.144732-18.pom
19K uploaded  (wss4j-2.1.5-20160107.144732-18.pom)
[INFO] Retrieving previous metadata from apache.snapshots.https
[INFO] Uploading repository metadata for: 'artifact org.apache.wss4j:wss4j'
[INFO] Retrieving previous metadata from apache.snapshots.https
[WARNING] *** CHECKSUM FAILED - Checksum failed on download: local = 'b06db60076d16cf63904bfb1f78a5f34af41804b';
remote = '2d4ec07f1f81296bc474b57b90cc84d3b17da61e' - RETRYING
[WARNING] *** CHECKSUM FAILED - Checksum failed on download: local = 'b06db60076d16cf63904bfb1f78a5f34af41804b';
remote = '2d4ec07f1f81296bc474b57b90cc84d3b17da61e' - IGNORING
[INFO] Uploading repository metadata for: 'snapshot org.apache.wss4j:wss4j:2.1.5-SNAPSHOT'
[INFO] Retrieving previous build number from apache.snapshots.https
Uploading: https://repository.apache.org/content/repositories/snapshots/org/apache/wss4j/wss4j/2.1.5-SNAPSHOT/wss4j-2.1.5-20160107.144732-18-site.xml
638b uploaded  (wss4j-2.1.5-20160107.144732-18-site.xml)
[INFO] Retrieving previous build number from apache.snapshots.https
Uploading: https://repository.apache.org/content/repositories/snapshots/org/apache/wss4j/wss4j/2.1.5-SNAPSHOT/wss4j-2.1.5-20160107.144732-18-site.xml
638b uploaded  (wss4j-2.1.5-20160107.144732-18-site.xml)
[INFO] Retrieving previous build number from apache.snapshots.https
Uploading: https://repository.apache.org/content/repositories/snapshots/org/apache/wss4j/wss4j/2.1.5-SNAPSHOT/wss4j-2.1.5-20160107.144732-18-site.xml
638b uploaded  (wss4j-2.1.5-20160107.144732-18-site.xml)
[INFO] Retrieving previous build number from apache.snapshots.https
Uploading: https://repository.apache.org/content/repositories/snapshots/org/apache/wss4j/wss4j/2.1.5-SNAPSHOT/wss4j-2.1.5-20160107.144732-18-site.xml
638b uploaded  (wss4j-2.1.5-20160107.144732-18-site.xml)
[INFO] ------------------------------------------------------------------------
[INFO] Building Apache WSS4J Build Tools
[INFO]    task-segment: [clean, install, deploy]
[INFO] ------------------------------------------------------------------------
[INFO] [clean:clean {execution: default-clean}]
[INFO] Deleting <https://builds.apache.org/job/wss4j-2.1/ws/wss4j/build-tools/target>
[INFO] Preparing pmd:check
[INFO] [pmd:pmd {execution: pmd}]
ERROR: Could not find local repository for 2.2.1
[INFO] [pmd:check {execution: validate}]
[INFO] 
[INFO] [remote-resources:process {execution: default}]
[INFO] [resources:resources {execution: default-resources}]
[INFO] Using 'UTF-8' encoding to copy filtered resources.
[INFO] Copying 2 resources
[INFO] Copying 3 resources
[INFO] [compiler:compile {execution: default-compile}]
[INFO] No sources to compile
[INFO] [resources:testResources {execution: default-testResources}]
[INFO] Using 'UTF-8' encoding to copy filtered resources.
[INFO] skip non existing resourceDirectory <https://builds.apache.org/job/wss4j-2.1/ws/wss4j/build-tools/src/test/resources>
[INFO] Copying 3 resources
[INFO] [compiler:testCompile {execution: default-testCompile}]
[INFO] No sources to compile
[INFO] [surefire:test {execution: default-test}]
[JENKINS] Recording test results
[INFO] [jar:jar {execution: default-jar}]
[INFO] Building jar: <https://builds.apache.org/job/wss4j-2.1/ws/wss4j/build-tools/target/build-tools-2.1.5-SNAPSHOT.jar>
[INFO] [site:attach-descriptor {execution: attach-descriptor}]
[INFO] Preparing source:jar
[WARNING] Removing: jar from forked lifecycle, to prevent recursive invocation.
[WARNING] Removing: check from forked lifecycle, to prevent recursive invocation.
[INFO] No goals needed for project - skipping
[INFO] [source:jar {execution: default}]
[INFO] Building jar: <https://builds.apache.org/job/wss4j-2.1/ws/wss4j/build-tools/target/build-tools-2.1.5-SNAPSHOT-sources.jar>
[INFO] [install:install {execution: default-install}]
[INFO] Installing <https://builds.apache.org/job/wss4j-2.1/ws/wss4j/build-tools/target/build-tools-2.1.5-SNAPSHOT.jar>
to /home/jenkins/jenkins-slave/maven-repositories/0/org/apache/wss4j/build-tools/2.1.5-SNAPSHOT/build-tools-2.1.5-SNAPSHOT.jar
[INFO] Installing <https://builds.apache.org/job/wss4j-2.1/ws/wss4j/build-tools/target/build-tools-2.1.5-SNAPSHOT-sources.jar>
to /home/jenkins/jenkins-slave/maven-repositories/0/org/apache/wss4j/build-tools/2.1.5-SNAPSHOT/build-tools-2.1.5-SNAPSHOT-sources.jar
[INFO] Preparing pmd:check
[INFO] [pmd:pmd {execution: pmd}]
ERROR: Could not find local repository for 2.2.1
[INFO] ------------------------------------------------------------------------
[ERROR] FATAL ERROR
[INFO] ------------------------------------------------------------------------
[INFO] org.apache.maven.reporting.MavenReportException: Cannot create file-based resource:invalid
distance too far back
[INFO] ------------------------------------------------------------------------
[INFO] Trace
java.lang.RuntimeException: org.apache.maven.reporting.MavenReportException: Cannot create
file-based resource:invalid distance too far back
	at org.apache.maven.plugin.pmd.PmdReport.canGenerateReport(PmdReport.java:267)
	at org.apache.maven.reporting.AbstractMavenReport.execute(AbstractMavenReport.java:119)
	at org.apache.maven.plugin.DefaultPluginManager.executeMojo(DefaultPluginManager.java:490)
	at hudson.maven.agent.PluginManagerInterceptor.executeMojo(PluginManagerInterceptor.java:182)
	at org.apache.maven.lifecycle.DefaultLifecycleExecutor.executeGoals(DefaultLifecycleExecutor.java:694)
	at org.apache.maven.lifecycle.DefaultLifecycleExecutor.forkProjectLifecycle(DefaultLifecycleExecutor.java:1211)
	at org.apache.maven.lifecycle.DefaultLifecycleExecutor.forkLifecycle(DefaultLifecycleExecutor.java:1038)
	at org.apache.maven.lifecycle.DefaultLifecycleExecutor.executeGoals(DefaultLifecycleExecutor.java:643)
	at org.apache.maven.lifecycle.DefaultLifecycleExecutor.executeGoalWithLifecycle(DefaultLifecycleExecutor.java:556)
	at org.apache.maven.lifecycle.DefaultLifecycleExecutor.executeGoal(DefaultLifecycleExecutor.java:535)
	at org.apache.maven.lifecycle.DefaultLifecycleExecutor.executeGoalAndHandleFailures(DefaultLifecycleExecutor.java:387)
	at org.apache.maven.lifecycle.DefaultLifecycleExecutor.executeTaskSegments(DefaultLifecycleExecutor.java:348)
	at org.apache.maven.lifecycle.DefaultLifecycleExecutor.execute(DefaultLifecycleExecutor.java:180)
	at org.apache.maven.lifecycle.LifecycleExecutorInterceptor.execute(LifecycleExecutorInterceptor.java:65)
	at org.apache.maven.DefaultMaven.doExecute(DefaultMaven.java:328)
	at org.apache.maven.DefaultMaven.execute(DefaultMaven.java:138)
	at org.apache.maven.cli.MavenCli.main(MavenCli.java:362)
	at sun.reflect.NativeMethodAccessorImpl.invoke0(Native Method)
	at sun.reflect.NativeMethodAccessorImpl.invoke(NativeMethodAccessorImpl.java:57)
	at sun.reflect.DelegatingMethodAccessorImpl.invoke(DelegatingMethodAccessorImpl.java:43)
	at java.lang.reflect.Method.invoke(Method.java:606)
	at org.codehaus.classworlds.Launcher.launchEnhanced(Launcher.java:315)
	at org.codehaus.classworlds.Launcher.launch(Launcher.java:255)
	at hudson.maven.agent.Main.launch(Main.java:205)
	at hudson.maven.MavenBuilder.call(MavenBuilder.java:154)
	at hudson.maven.Maven2Builder.call(Maven2Builder.java:79)
	at hudson.maven.Maven2Builder.call(Maven2Builder.java:55)
	at hudson.remoting.UserRequest.perform(UserRequest.java:121)
	at hudson.remoting.UserRequest.perform(UserRequest.java:49)
	at hudson.remoting.Request$2.run(Request.java:326)
	at hudson.remoting.InterceptingExecutorService$1.call(InterceptingExecutorService.java:68)
	at java.util.concurrent.FutureTask.run(FutureTask.java:262)
	at java.util.concurrent.ThreadPoolExecutor.runWorker(ThreadPoolExecutor.java:1145)
	at java.util.concurrent.ThreadPoolExecutor$Worker.run(ThreadPoolExecutor.java:615)
	at java.lang.Thread.run(Thread.java:745)
Caused by: org.apache.maven.reporting.MavenReportException: Cannot create file-based resource:invalid
distance too far back
	at org.apache.maven.plugin.pmd.PmdReport.executePmd(PmdReport.java:336)
	at org.apache.maven.plugin.pmd.PmdReport.executePmdWithClassloader(PmdReport.java:280)
	at org.apache.maven.plugin.pmd.PmdReport.canGenerateReport(PmdReport.java:254)
	... 34 more
Caused by: org.codehaus.plexus.resource.loader.FileResourceCreationException: Cannot create
file-based resource:invalid distance too far back
	at org.codehaus.plexus.resource.DefaultResourceManager.createResourceAsFile(DefaultResourceManager.java:220)
	at org.codehaus.plexus.resource.DefaultResourceManager.getResourceAsFile(DefaultResourceManager.java:101)
	at org.apache.maven.plugin.pmd.PmdReport.executePmd(PmdReport.java:322)
	... 36 more
Caused by: java.util.zip.ZipException: invalid distance too far back
	at java.util.zip.InflaterInputStream.read(InflaterInputStream.java:164)
	at java.io.FilterInputStream.read(FilterInputStream.java:133)
	at java.io.FilterInputStream.read(FilterInputStream.java:107)
	at org.codehaus.plexus.util.IOUtil.copy(IOUtil.java:189)
	at org.codehaus.plexus.util.IOUtil.copy(IOUtil.java:175)
	at org.codehaus.plexus.resource.DefaultResourceManager.createResourceAsFile(DefaultResourceManager.java:212)
	... 38 more
[INFO] ------------------------------------------------------------------------
[INFO] Total time: 23 seconds
[INFO] Finished at: Thu Jan 07 14:47:43 UTC 2016
[INFO] Final Memory: 63M/802M
[INFO] ------------------------------------------------------------------------
[JENKINS] Archiving <https://builds.apache.org/job/wss4j-2.1/ws/wss4j/build-tools/pom.xml>
to org.apache.wss4j/build-tools/2.1.5-SNAPSHOT/build-tools-2.1.5-SNAPSHOT.pom
[JENKINS] Archiving <https://builds.apache.org/job/wss4j-2.1/ws/wss4j/build-tools/target/build-tools-2.1.5-SNAPSHOT.jar>
to org.apache.wss4j/build-tools/2.1.5-SNAPSHOT/build-tools-2.1.5-SNAPSHOT.jar
[JENKINS] Archiving <https://builds.apache.org/job/wss4j-2.1/ws/wss4j/build-tools/target/build-tools-2.1.5-SNAPSHOT-sources.jar>
to org.apache.wss4j/build-tools/2.1.5-SNAPSHOT/build-tools-2.1.5-SNAPSHOT-sources.jar
No prior successful build to compare, so performing full copy of artifacts
[JENKINS] Archiving <https://builds.apache.org/job/wss4j-2.1/ws/wss4j/pom.xml> to org.apache.wss4j/wss4j/2.1.5-SNAPSHOT/wss4j-2.1.5-SNAPSHOT.pom
[JENKINS] Archiving <https://builds.apache.org/job/wss4j-2.1/ws/wss4j/target/wss4j-2.1.5-SNAPSHOT-site.xml>
to org.apache.wss4j/wss4j/2.1.5-SNAPSHOT/wss4j-2.1.5-SNAPSHOT-site.xml
[JENKINS] Archiving /home/jenkins/jenkins-slave/maven-repositories/0/org/apache/wss4j/wss4j/2.1.5-SNAPSHOT/wss4j-2.1.5-SNAPSHOT.pom
to org.apache.wss4j/wss4j/2.1.5-20160107.144732-18/wss4j-2.1.5-20160107.144732-18.pom
[JENKINS] Archiving <https://builds.apache.org/job/wss4j-2.1/ws/wss4j/target/wss4j-2.1.5-SNAPSHOT-site.xml>
to org.apache.wss4j/wss4j/2.1.5-20160107.144732-18/wss4j-2.1.5-20160107.144732-18-site.xml
/x1/jenkins/jenkins-slave/maven-repositories/0/org/apache/wss4j/wss4j/2.1.5-SNAPSHOT/wss4j-2.1.5-SNAPSHOT.pom
is not inside /x1/jenkins/jenkins-slave/workspace/wss4j-2.1/wss4j/; will archive in a separate
pass
Sending e-mails to: dev@ws.apache.org coheigea@apache.org
channel stopped

---------------------------------------------------------------------
To unsubscribe, e-mail: dev-unsubscribe@ws.apache.org
For additional commands, e-mail: dev-help@ws.apache.org


Mime
View raw message