ws-dev mailing list archives

Site index · List index
Message view « Date » · « Thread »
Top « Date » · « Thread »
From Apache Jenkins Server <jenk...@builds.apache.org>
Subject Build failed in Jenkins: axiom-trunk #2427
Date Wed, 20 Jan 2016 19:46:08 GMT
See <https://builds.apache.org/job/axiom-trunk/2427/changes>

Changes:

[veithen] [maven-release-plugin] prepare for next development iteration

[veithen] [maven-release-plugin] prepare branch 1.2.x

------------------------------------------
[...truncated 18917 lines...]
[INFO] jaxp-testsuite ..................................... SUCCESS [  9.653 s]
[INFO] Google Truth extension for XML ..................... SUCCESS [ 11.878 s]
[INFO] components ......................................... SUCCESS [  2.039 s]
[INFO] xml-utils .......................................... SUCCESS [ 11.503 s]
[INFO] SOAP Test Suite .................................... SUCCESS [ 10.552 s]
[INFO] Axiom API .......................................... SUCCESS [01:28 min]
[INFO] Aspects ............................................ SUCCESS [  8.814 s]
[INFO] Core Aspects ....................................... SUCCESS [  9.967 s]
[INFO] Shared Aspects ..................................... SUCCESS [  5.144 s]
[INFO] OM Aspects ......................................... SUCCESS [ 22.965 s]
[INFO] Google Truth extension for Axiom ................... SUCCESS [  6.481 s]
[INFO] Jaxen Test Suite ................................... SUCCESS [  7.245 s]
[INFO] Axiom Implementation Test Suite .................... SUCCESS [ 32.793 s]
[INFO] Implementations .................................... SUCCESS [  3.066 s]
[INFO] LLOM ............................................... SUCCESS [02:34 min]
[INFO] DOM Aspects ........................................ SUCCESS [ 11.539 s]
[INFO] DOM Test Suite ..................................... SUCCESS [ 55.652 s]
[INFO] DOOM ............................................... SUCCESS [03:09 min]
[INFO] Axiom Compatibility Classes ........................ SUCCESS [ 14.123 s]
[INFO] Axiom JAXB Integration ............................. SUCCESS [ 14.942 s]
[INFO] Axiom C14N ......................................... SUCCESS [ 13.874 s]
[INFO] Axiom Uber-JAR ..................................... SUCCESS [  2.823 s]
[INFO] Samples ............................................ SUCCESS [ 14.692 s]
[INFO] System Tests ....................................... SUCCESS [  1.449 s]
[INFO] Cross OM Tests ..................................... SUCCESS [  4.907 s]
[INFO] Eclipse Tests ...................................... SUCCESS [01:07 min]
[INFO] JBoss Tests ........................................ SUCCESS [01:45 min]
[INFO] Axiom Test Suite (old) ............................. SUCCESS [  8.113 s]
[INFO] Axiom OSGi Tests ................................... SUCCESS [ 20.249 s]
[INFO] Spring-WS Test Suite ............................... SUCCESS [ 31.975 s]
[INFO] Spring WS Tests .................................... SUCCESS [ 18.631 s]
[INFO] WSS4J Tests ........................................ SUCCESS [  9.537 s]
[INFO] Developer Guide .................................... SUCCESS [ 19.333 s]
[INFO] User Guide ......................................... SUCCESS [  6.089 s]
[INFO] Javadoc ............................................ SUCCESS [ 16.395 s]
[INFO] FOM Aspects ........................................ SUCCESS [ 10.768 s]
[INFO] FOM Test Suite ..................................... SUCCESS [ 12.989 s]
[INFO] Abdera Model (FOM) Implementation .................. SUCCESS [ 41.543 s]
[INFO] Distribution ....................................... FAILURE [  2.509 s]
[INFO] Code Coverage Report ............................... SKIPPED
[INFO] SAAJ Test Suite .................................... SKIPPED
[INFO] ------------------------------------------------------------------------
[INFO] BUILD FAILURE
[INFO] ------------------------------------------------------------------------
[INFO] Total time: 20:56 min
[INFO] Finished at: 2016-01-20T19:45:48+00:00
[INFO] Final Memory: 136M/233M
[INFO] ------------------------------------------------------------------------
[ERROR] Failed to execute goal org.codehaus.gmavenplus:gmavenplus-plugin:1.5:execute (generate-release-note)
on project distribution: Error occurred while calling a method on a Groovy class from classpath.
InvocationTargetException: <https://builds.apache.org/job/axiom-trunk/ws/axiom/distribution/../src/site/markdown/release-notes/1.3.0.md>
(No such file or directory) -> [Help 1]
[ERROR] 
[ERROR] To see the full stack trace of the errors, re-run Maven with the -e switch.
[ERROR] Re-run Maven using the -X switch to enable full debug logging.
[ERROR] 
[ERROR] For more information about the errors and possible solutions, please read the following
articles:
[ERROR] [Help 1] http://cwiki.apache.org/confluence/display/MAVEN/MojoExecutionException
[ERROR] 
[ERROR] After correcting the problems, you can resume the build with the command
[ERROR]   mvn <goals> -rf :distribution
[JENKINS] Archiving <https://builds.apache.org/job/axiom-trunk/ws/axiom/axiom-compat/pom.xml>
to org.apache.ws.commons.axiom/axiom-compat/1.3.0-SNAPSHOT/axiom-compat-1.3.0-SNAPSHOT.pom
[JENKINS] Archiving <https://builds.apache.org/job/axiom-trunk/ws/axiom/axiom-compat/target/axiom-compat-1.3.0-SNAPSHOT.jar>
to org.apache.ws.commons.axiom/axiom-compat/1.3.0-20160120.193815-1/axiom-compat-1.3.0-20160120.193815-1.jar
[JENKINS] Archiving <https://builds.apache.org/job/axiom-trunk/ws/axiom/axiom-compat/target/axiom-compat-1.3.0-SNAPSHOT-sources.jar>
to org.apache.ws.commons.axiom/axiom-compat/1.3.0-20160120.193815-1/axiom-compat-1.3.0-20160120.193815-1-sources.jar
[JENKINS] Archiving <https://builds.apache.org/job/axiom-trunk/ws/axiom/axiom-compat/target/axiom-compat-1.3.0-SNAPSHOT-javadoc.jar>
to org.apache.ws.commons.axiom/axiom-compat/1.3.0-20160120.193815-1/axiom-compat-1.3.0-20160120.193815-1-javadoc.jar
[JENKINS] Archiving <https://builds.apache.org/job/axiom-trunk/ws/axiom/axiom-compat/target/jacoco.exec>
to org.apache.ws.commons.axiom/axiom-compat/1.3.0-20160120.193815-1/axiom-compat-1.3.0-20160120.193815-1-jacoco.exec
[JENKINS] Archiving <https://builds.apache.org/job/axiom-trunk/ws/axiom/implementations/fom-impl/pom.xml>
to org.apache.ws.commons.axiom/fom-impl/1.3.0-SNAPSHOT/fom-impl-1.3.0-SNAPSHOT.pom
[JENKINS] Archiving <https://builds.apache.org/job/axiom-trunk/ws/axiom/implementations/fom-impl/target/fom-impl-1.3.0-SNAPSHOT.jar>
to org.apache.ws.commons.axiom/fom-impl/1.3.0-20160120.194529-1/fom-impl-1.3.0-20160120.194529-1.jar
[JENKINS] Archiving <https://builds.apache.org/job/axiom-trunk/ws/axiom/implementations/fom-impl/target/fom-impl-1.3.0-SNAPSHOT-sources.jar>
to org.apache.ws.commons.axiom/fom-impl/1.3.0-20160120.194529-1/fom-impl-1.3.0-20160120.194529-1-sources.jar
[JENKINS] Archiving <https://builds.apache.org/job/axiom-trunk/ws/axiom/implementations/fom-impl/target/fom-impl-1.3.0-SNAPSHOT-javadoc.jar>
to org.apache.ws.commons.axiom/fom-impl/1.3.0-20160120.194529-1/fom-impl-1.3.0-20160120.194529-1-javadoc.jar
[JENKINS] Archiving <https://builds.apache.org/job/axiom-trunk/ws/axiom/implementations/fom-impl/target/jacoco.exec>
to org.apache.ws.commons.axiom/fom-impl/1.3.0-20160120.194529-1/fom-impl-1.3.0-20160120.194529-1-jacoco.exec
[JENKINS] Archiving <https://builds.apache.org/job/axiom-trunk/ws/axiom/implementations/axiom-impl/pom.xml>
to org.apache.ws.commons.axiom/axiom-impl/1.3.0-SNAPSHOT/axiom-impl-1.3.0-SNAPSHOT.pom
[JENKINS] Archiving <https://builds.apache.org/job/axiom-trunk/ws/axiom/implementations/axiom-impl/target/axiom-impl-1.3.0-SNAPSHOT.jar>
to org.apache.ws.commons.axiom/axiom-impl/1.3.0-20160120.193340-1/axiom-impl-1.3.0-20160120.193340-1.jar
[JENKINS] Archiving <https://builds.apache.org/job/axiom-trunk/ws/axiom/implementations/axiom-impl/target/axiom-impl-1.3.0-SNAPSHOT-sources.jar>
to org.apache.ws.commons.axiom/axiom-impl/1.3.0-20160120.193340-1/axiom-impl-1.3.0-20160120.193340-1-sources.jar
[JENKINS] Archiving <https://builds.apache.org/job/axiom-trunk/ws/axiom/implementations/axiom-impl/target/axiom-impl-1.3.0-SNAPSHOT-javadoc.jar>
to org.apache.ws.commons.axiom/axiom-impl/1.3.0-20160120.193340-1/axiom-impl-1.3.0-20160120.193340-1-javadoc.jar
[JENKINS] Archiving <https://builds.apache.org/job/axiom-trunk/ws/axiom/implementations/axiom-impl/target/jacoco.exec>
to org.apache.ws.commons.axiom/axiom-impl/1.3.0-20160120.193340-1/axiom-impl-1.3.0-20160120.193340-1-jacoco.exec
[JENKINS] Archiving <https://builds.apache.org/job/axiom-trunk/ws/axiom/buildutils/pom.xml>
to org.apache.ws.commons.axiom/buildutils/1.3.0-SNAPSHOT/buildutils-1.3.0-SNAPSHOT.pom
[JENKINS] Archiving <https://builds.apache.org/job/axiom-trunk/ws/axiom/axiom-all/pom.xml>
to org.apache.ws.commons.axiom/axiom-all/1.3.0-SNAPSHOT/axiom-all-1.3.0-SNAPSHOT.pom
[JENKINS] Archiving <https://builds.apache.org/job/axiom-trunk/ws/axiom/axiom-all/target/axiom-all-1.3.0-SNAPSHOT.jar>
to org.apache.ws.commons.axiom/axiom-all/1.3.0-SNAPSHOT/axiom-all-1.3.0-SNAPSHOT.jar
[JENKINS] Archiving <https://builds.apache.org/job/axiom-trunk/ws/axiom/axiom-all/target/axiom-all-1.3.0-SNAPSHOT-sources.jar>
to org.apache.ws.commons.axiom/axiom-all/1.3.0-SNAPSHOT/axiom-all-1.3.0-SNAPSHOT-sources.jar
[JENKINS] Archiving <https://builds.apache.org/job/axiom-trunk/ws/axiom/implementations/pom.xml>
to org.apache.ws.commons.axiom/implementations/1.3.0-SNAPSHOT/implementations-1.3.0-SNAPSHOT.pom
[JENKINS] Archiving <https://builds.apache.org/job/axiom-trunk/ws/axiom/implementations/target/implementations-1.3.0-SNAPSHOT-site.xml>
to org.apache.ws.commons.axiom/implementations/1.3.0-20160120.193107-1/implementations-1.3.0-20160120.193107-1-site.xml
[JENKINS] Archiving <https://builds.apache.org/job/axiom-trunk/ws/axiom/buildutils/shade-osgi/pom.xml>
to org.apache.ws.commons.axiom/shade-osgi/1.3.0-SNAPSHOT/shade-osgi-1.3.0-SNAPSHOT.pom
[JENKINS] Archiving <https://builds.apache.org/job/axiom-trunk/ws/axiom/buildutils/shade-osgi/target/shade-osgi-1.3.0-SNAPSHOT.jar>
to org.apache.ws.commons.axiom/shade-osgi/1.3.0-20160120.192620-1/shade-osgi-1.3.0-20160120.192620-1.jar
[JENKINS] Archiving <https://builds.apache.org/job/axiom-trunk/ws/axiom/buildutils/shade-osgi/target/shade-osgi-1.3.0-SNAPSHOT-sources.jar>
to org.apache.ws.commons.axiom/shade-osgi/1.3.0-20160120.192620-1/shade-osgi-1.3.0-20160120.192620-1-sources.jar
[JENKINS] Archiving <https://builds.apache.org/job/axiom-trunk/ws/axiom/buildutils/shade-osgi/target/shade-osgi-1.3.0-SNAPSHOT-javadoc.jar>
to org.apache.ws.commons.axiom/shade-osgi/1.3.0-20160120.192620-1/shade-osgi-1.3.0-20160120.192620-1-javadoc.jar
[JENKINS] Archiving <https://builds.apache.org/job/axiom-trunk/ws/axiom/axiom-c14n/pom.xml>
to org.apache.ws.commons.axiom/axiom-c14n/1.3.0-SNAPSHOT/axiom-c14n-1.3.0-SNAPSHOT.pom
[JENKINS] Archiving <https://builds.apache.org/job/axiom-trunk/ws/axiom/axiom-c14n/target/axiom-c14n-1.3.0-SNAPSHOT.jar>
to org.apache.ws.commons.axiom/axiom-c14n/1.3.0-20160120.193846-1/axiom-c14n-1.3.0-20160120.193846-1.jar
[JENKINS] Archiving <https://builds.apache.org/job/axiom-trunk/ws/axiom/axiom-c14n/target/axiom-c14n-1.3.0-SNAPSHOT-sources.jar>
to org.apache.ws.commons.axiom/axiom-c14n/1.3.0-20160120.193846-1/axiom-c14n-1.3.0-20160120.193846-1-sources.jar
[JENKINS] Archiving <https://builds.apache.org/job/axiom-trunk/ws/axiom/axiom-c14n/target/axiom-c14n-1.3.0-SNAPSHOT-javadoc.jar>
to org.apache.ws.commons.axiom/axiom-c14n/1.3.0-20160120.193846-1/axiom-c14n-1.3.0-20160120.193846-1-javadoc.jar
[JENKINS] Archiving <https://builds.apache.org/job/axiom-trunk/ws/axiom/axiom-c14n/target/jacoco.exec>
to org.apache.ws.commons.axiom/axiom-c14n/1.3.0-20160120.193846-1/axiom-c14n-1.3.0-20160120.193846-1-jacoco.exec
[JENKINS] Archiving <https://builds.apache.org/job/axiom-trunk/ws/axiom/testing/dom-testsuite/pom.xml>
to org.apache.ws.commons.axiom/dom-testsuite/1.3.0-SNAPSHOT/dom-testsuite-1.3.0-SNAPSHOT.pom
[JENKINS] Archiving <https://builds.apache.org/job/axiom-trunk/ws/axiom/testing/dom-testsuite/target/dom-testsuite-1.3.0-SNAPSHOT.jar>
to org.apache.ws.commons.axiom/dom-testsuite/1.3.0-20160120.193447-1/dom-testsuite-1.3.0-20160120.193447-1.jar
[JENKINS] Archiving <https://builds.apache.org/job/axiom-trunk/ws/axiom/testing/dom-testsuite/target/dom-testsuite-1.3.0-SNAPSHOT-sources.jar>
to org.apache.ws.commons.axiom/dom-testsuite/1.3.0-20160120.193447-1/dom-testsuite-1.3.0-20160120.193447-1-sources.jar
[JENKINS] Archiving <https://builds.apache.org/job/axiom-trunk/ws/axiom/testing/dom-testsuite/target/dom-testsuite-1.3.0-SNAPSHOT-javadoc.jar>
to org.apache.ws.commons.axiom/dom-testsuite/1.3.0-20160120.193447-1/dom-testsuite-1.3.0-20160120.193447-1-javadoc.jar
[JENKINS] Archiving <https://builds.apache.org/job/axiom-trunk/ws/axiom/testing/dom-testsuite/target/jacoco.exec>
to org.apache.ws.commons.axiom/dom-testsuite/1.3.0-20160120.193447-1/dom-testsuite-1.3.0-20160120.193447-1-jacoco.exec
[JENKINS] Archiving <https://builds.apache.org/job/axiom-trunk/ws/axiom/testing/spring-ws-testsuite/pom.xml>
to org.apache.ws.commons.axiom/spring-ws-testsuite/1.3.0-SNAPSHOT/spring-ws-testsuite-1.3.0-SNAPSHOT.pom
[JENKINS] Archiving <https://builds.apache.org/job/axiom-trunk/ws/axiom/testing/spring-ws-testsuite/target/spring-ws-testsuite-1.3.0-SNAPSHOT.jar>
to org.apache.ws.commons.axiom/spring-ws-testsuite/1.3.0-20160120.194308-1/spring-ws-testsuite-1.3.0-20160120.194308-1.jar
[JENKINS] Archiving <https://builds.apache.org/job/axiom-trunk/ws/axiom/testing/spring-ws-testsuite/target/spring-ws-testsuite-1.3.0-SNAPSHOT-sources.jar>
to org.apache.ws.commons.axiom/spring-ws-testsuite/1.3.0-20160120.194308-1/spring-ws-testsuite-1.3.0-20160120.194308-1-sources.jar
[JENKINS] Archiving <https://builds.apache.org/job/axiom-trunk/ws/axiom/testing/spring-ws-testsuite/target/spring-ws-testsuite-1.3.0-SNAPSHOT-javadoc.jar>
to org.apache.ws.commons.axiom/spring-ws-testsuite/1.3.0-20160120.194308-1/spring-ws-testsuite-1.3.0-20160120.194308-1-javadoc.jar
[JENKINS] Archiving <https://builds.apache.org/job/axiom-trunk/ws/axiom/testing/spring-ws-testsuite/target/jacoco.exec>
to org.apache.ws.commons.axiom/spring-ws-testsuite/1.3.0-20160120.194308-1/spring-ws-testsuite-1.3.0-20160120.194308-1-jacoco.exec
[JENKINS] Archiving <https://builds.apache.org/job/axiom-trunk/ws/axiom/systests/jboss-tests/pom.xml>
to org.apache.ws.commons.axiom/jboss-tests/1.3.0-SNAPSHOT/jboss-tests-1.3.0-SNAPSHOT.pom
[JENKINS] Archiving <https://builds.apache.org/job/axiom-trunk/ws/axiom/systests/jboss-tests/target/jboss-tests-1.3.0-SNAPSHOT.jar>
to org.apache.ws.commons.axiom/jboss-tests/1.3.0-SNAPSHOT/jboss-tests-1.3.0-SNAPSHOT.jar
[JENKINS] Archiving <https://builds.apache.org/job/axiom-trunk/ws/axiom/systests/jboss-tests/target/jboss-tests-1.3.0-SNAPSHOT-sources.jar>
to org.apache.ws.commons.axiom/jboss-tests/1.3.0-SNAPSHOT/jboss-tests-1.3.0-SNAPSHOT-sources.jar
[JENKINS] Archiving <https://builds.apache.org/job/axiom-trunk/ws/axiom/systests/jboss-tests/target/jacoco.exec>
to org.apache.ws.commons.axiom/jboss-tests/1.3.0-SNAPSHOT/jboss-tests-1.3.0-SNAPSHOT-jacoco.exec
[JENKINS] Archiving <https://builds.apache.org/job/axiom-trunk/ws/axiom/systests/eclipse-tests/pom.xml>
to org.apache.ws.commons.axiom/eclipse-tests/1.3.0-SNAPSHOT/eclipse-tests-1.3.0-SNAPSHOT.pom
[JENKINS] Archiving <https://builds.apache.org/job/axiom-trunk/ws/axiom/systests/eclipse-tests/target/it/project/target/jacoco.exec>
to org.apache.ws.commons.axiom/eclipse-tests/1.3.0-SNAPSHOT/eclipse-tests-1.3.0-SNAPSHOT-jacoco.exec
[JENKINS] Archiving <https://builds.apache.org/job/axiom-trunk/ws/axiom/testing/axiom-testsuite/pom.xml>
to org.apache.ws.commons.axiom/axiom-testsuite/1.3.0-SNAPSHOT/axiom-testsuite-1.3.0-SNAPSHOT.pom
[JENKINS] Archiving <https://builds.apache.org/job/axiom-trunk/ws/axiom/testing/axiom-testsuite/target/axiom-testsuite-1.3.0-SNAPSHOT.jar>
to org.apache.ws.commons.axiom/axiom-testsuite/1.3.0-20160120.193102-1/axiom-testsuite-1.3.0-20160120.193102-1.jar
[JENKINS] Archiving <https://builds.apache.org/job/axiom-trunk/ws/axiom/testing/axiom-testsuite/target/axiom-testsuite-1.3.0-SNAPSHOT-sources.jar>
to org.apache.ws.commons.axiom/axiom-testsuite/1.3.0-20160120.193102-1/axiom-testsuite-1.3.0-20160120.193102-1-sources.jar
[JENKINS] Archiving <https://builds.apache.org/job/axiom-trunk/ws/axiom/testing/axiom-testsuite/target/axiom-testsuite-1.3.0-SNAPSHOT-javadoc.jar>
to org.apache.ws.commons.axiom/axiom-testsuite/1.3.0-20160120.193102-1/axiom-testsuite-1.3.0-20160120.193102-1-javadoc.jar
[JENKINS] Archiving <https://builds.apache.org/job/axiom-trunk/ws/axiom/systests/pom.xml>
to org.apache.ws.commons.axiom/systests/1.3.0-SNAPSHOT/systests-1.3.0-SNAPSHOT.pom
[JENKINS] Archiving <https://builds.apache.org/job/axiom-trunk/ws/axiom/testing/fom-testsuite/pom.xml>
to org.apache.ws.commons.axiom/fom-testsuite/1.3.0-SNAPSHOT/fom-testsuite-1.3.0-SNAPSHOT.pom
[JENKINS] Archiving <https://builds.apache.org/job/axiom-trunk/ws/axiom/testing/fom-testsuite/target/fom-testsuite-1.3.0-SNAPSHOT.jar>
to org.apache.ws.commons.axiom/fom-testsuite/1.3.0-20160120.194447-1/fom-testsuite-1.3.0-20160120.194447-1.jar
[JENKINS] Archiving <https://builds.apache.org/job/axiom-trunk/ws/axiom/testing/fom-testsuite/target/fom-testsuite-1.3.0-SNAPSHOT-sources.jar>
to org.apache.ws.commons.axiom/fom-testsuite/1.3.0-20160120.194447-1/fom-testsuite-1.3.0-20160120.194447-1-sources.jar
[JENKINS] Archiving <https://builds.apache.org/job/axiom-trunk/ws/axiom/testing/fom-testsuite/target/fom-testsuite-1.3.0-SNAPSHOT-javadoc.jar>
to org.apache.ws.commons.axiom/fom-testsuite/1.3.0-20160120.194447-1/fom-testsuite-1.3.0-20160120.194447-1-javadoc.jar
[JENKINS] Archiving <https://builds.apache.org/job/axiom-trunk/ws/axiom/testing/fom-testsuite/target/jacoco.exec>
to org.apache.ws.commons.axiom/fom-testsuite/1.3.0-20160120.194447-1/fom-testsuite-1.3.0-20160120.194447-1-jacoco.exec
[JENKINS] Archiving <https://builds.apache.org/job/axiom-trunk/ws/axiom/aspects/shared-aspects/pom.xml>
to org.apache.ws.commons.axiom/shared-aspects/1.3.0-SNAPSHOT/shared-aspects-1.3.0-SNAPSHOT.pom
[JENKINS] Archiving <https://builds.apache.org/job/axiom-trunk/ws/axiom/aspects/shared-aspects/target/shared-aspects-1.3.0-SNAPSHOT.jar>
to org.apache.ws.commons.axiom/shared-aspects/1.3.0-20160120.192950-1/shared-aspects-1.3.0-20160120.192950-1.jar
[JENKINS] Archiving <https://builds.apache.org/job/axiom-trunk/ws/axiom/aspects/shared-aspects/target/shared-aspects-1.3.0-SNAPSHOT-sources.jar>
to org.apache.ws.commons.axiom/shared-aspects/1.3.0-20160120.192950-1/shared-aspects-1.3.0-20160120.192950-1-sources.jar
[JENKINS] Archiving <https://builds.apache.org/job/axiom-trunk/ws/axiom/aspects/shared-aspects/target/shared-aspects-1.3.0-SNAPSHOT-javadoc.jar>
to org.apache.ws.commons.axiom/shared-aspects/1.3.0-20160120.192950-1/shared-aspects-1.3.0-20160120.192950-1-javadoc.jar
[JENKINS] Archiving <https://builds.apache.org/job/axiom-trunk/ws/axiom/testing/xml-truth/pom.xml>
to org.apache.ws.commons.axiom/xml-truth/1.3.0-SNAPSHOT/xml-truth-1.3.0-SNAPSHOT.pom
[JENKINS] Archiving <https://builds.apache.org/job/axiom-trunk/ws/axiom/testing/xml-truth/target/xml-truth-1.3.0-SNAPSHOT.jar>
to org.apache.ws.commons.axiom/xml-truth/1.3.0-20160120.192728-1/xml-truth-1.3.0-20160120.192728-1.jar
[JENKINS] Archiving <https://builds.apache.org/job/axiom-trunk/ws/axiom/testing/xml-truth/target/xml-truth-1.3.0-SNAPSHOT-sources.jar>
to org.apache.ws.commons.axiom/xml-truth/1.3.0-20160120.192728-1/xml-truth-1.3.0-20160120.192728-1-sources.jar
[JENKINS] Archiving <https://builds.apache.org/job/axiom-trunk/ws/axiom/testing/xml-truth/target/xml-truth-1.3.0-SNAPSHOT-javadoc.jar>
to org.apache.ws.commons.axiom/xml-truth/1.3.0-20160120.192728-1/xml-truth-1.3.0-20160120.192728-1-javadoc.jar
[JENKINS] Archiving <https://builds.apache.org/job/axiom-trunk/ws/axiom/testing/xml-truth/target/jacoco.exec>
to org.apache.ws.commons.axiom/xml-truth/1.3.0-20160120.192728-1/xml-truth-1.3.0-20160120.192728-1-jacoco.exec
[JENKINS] Archiving <https://builds.apache.org/job/axiom-trunk/ws/axiom/userguide/pom.xml>
to org.apache.ws.commons.axiom/userguide/1.3.0-SNAPSHOT/userguide-1.3.0-SNAPSHOT.pom
[JENKINS] Archiving <https://builds.apache.org/job/axiom-trunk/ws/axiom/userguide/target/docbkx/pdf/userguide.pdf>
to org.apache.ws.commons.axiom/userguide/1.3.0-SNAPSHOT/userguide-1.3.0-SNAPSHOT.pdf
Compressed 349.50 KB of artifacts by 64.1% relative to #2426
[JENKINS] Archiving <https://builds.apache.org/job/axiom-trunk/ws/axiom/axiom-api/pom.xml>
to org.apache.ws.commons.axiom/axiom-api/1.3.0-SNAPSHOT/axiom-api-1.3.0-SNAPSHOT.pom
[JENKINS] Archiving <https://builds.apache.org/job/axiom-trunk/ws/axiom/axiom-api/target/axiom-api-1.3.0-SNAPSHOT.jar>
to org.apache.ws.commons.axiom/axiom-api/1.3.0-20160120.192923-1/axiom-api-1.3.0-20160120.192923-1.jar
[JENKINS] Archiving <https://builds.apache.org/job/axiom-trunk/ws/axiom/axiom-api/target/axiom-api-1.3.0-SNAPSHOT-sources.jar>
to org.apache.ws.commons.axiom/axiom-api/1.3.0-20160120.192923-1/axiom-api-1.3.0-20160120.192923-1-sources.jar
[JENKINS] Archiving <https://builds.apache.org/job/axiom-trunk/ws/axiom/axiom-api/target/axiom-api-1.3.0-SNAPSHOT-javadoc.jar>
to org.apache.ws.commons.axiom/axiom-api/1.3.0-20160120.192923-1/axiom-api-1.3.0-20160120.192923-1-javadoc.jar
[JENKINS] Archiving <https://builds.apache.org/job/axiom-trunk/ws/axiom/axiom-api/target/axiom-api-1.3.0-SNAPSHOT-tests.jar>
to org.apache.ws.commons.axiom/axiom-api/1.3.0-20160120.192923-1/axiom-api-1.3.0-20160120.192923-1-tests.jar
[JENKINS] Archiving <https://builds.apache.org/job/axiom-trunk/ws/axiom/axiom-api/target/jacoco.exec>
to org.apache.ws.commons.axiom/axiom-api/1.3.0-20160120.192923-1/axiom-api-1.3.0-20160120.192923-1-jacoco.exec
[JENKINS] Archiving <https://builds.apache.org/job/axiom-trunk/ws/axiom/aspects/core-aspects/pom.xml>
to org.apache.ws.commons.axiom/core-aspects/1.3.0-SNAPSHOT/core-aspects-1.3.0-SNAPSHOT.pom
[JENKINS] Archiving <https://builds.apache.org/job/axiom-trunk/ws/axiom/aspects/core-aspects/target/core-aspects-1.3.0-SNAPSHOT.jar>
to org.apache.ws.commons.axiom/core-aspects/1.3.0-20160120.192944-1/core-aspects-1.3.0-20160120.192944-1.jar
[JENKINS] Archiving <https://builds.apache.org/job/axiom-trunk/ws/axiom/aspects/core-aspects/target/core-aspects-1.3.0-SNAPSHOT-sources.jar>
to org.apache.ws.commons.axiom/core-aspects/1.3.0-20160120.192944-1/core-aspects-1.3.0-20160120.192944-1-sources.jar
[JENKINS] Archiving <https://builds.apache.org/job/axiom-trunk/ws/axiom/aspects/core-aspects/target/core-aspects-1.3.0-SNAPSHOT-javadoc.jar>
to org.apache.ws.commons.axiom/core-aspects/1.3.0-20160120.192944-1/core-aspects-1.3.0-20160120.192944-1-javadoc.jar
[JENKINS] Archiving <https://builds.apache.org/job/axiom-trunk/ws/axiom/aspects/fom-aspects/pom.xml>
to org.apache.ws.commons.axiom/fom-aspects/1.3.0-SNAPSHOT/fom-aspects-1.3.0-SNAPSHOT.pom
[JENKINS] Archiving <https://builds.apache.org/job/axiom-trunk/ws/axiom/aspects/fom-aspects/target/fom-aspects-1.3.0-SNAPSHOT.jar>
to org.apache.ws.commons.axiom/fom-aspects/1.3.0-20160120.194434-1/fom-aspects-1.3.0-20160120.194434-1.jar
[JENKINS] Archiving <https://builds.apache.org/job/axiom-trunk/ws/axiom/aspects/fom-aspects/target/fom-aspects-1.3.0-SNAPSHOT-sources.jar>
to org.apache.ws.commons.axiom/fom-aspects/1.3.0-20160120.194434-1/fom-aspects-1.3.0-20160120.194434-1-sources.jar
[JENKINS] Archiving <https://builds.apache.org/job/axiom-trunk/ws/axiom/aspects/fom-aspects/target/fom-aspects-1.3.0-SNAPSHOT-javadoc.jar>
to org.apache.ws.commons.axiom/fom-aspects/1.3.0-20160120.194434-1/fom-aspects-1.3.0-20160120.194434-1-javadoc.jar
[JENKINS] Archiving <https://builds.apache.org/job/axiom-trunk/ws/axiom/testing/xml-testsuite/pom.xml>
to org.apache.ws.commons.axiom/xml-testsuite/1.3.0-SNAPSHOT/xml-testsuite-1.3.0-SNAPSHOT.pom
[JENKINS] Archiving <https://builds.apache.org/job/axiom-trunk/ws/axiom/testing/xml-testsuite/target/xml-testsuite-1.3.0-SNAPSHOT.jar>
to org.apache.ws.commons.axiom/xml-testsuite/1.3.0-20160120.192706-1/xml-testsuite-1.3.0-20160120.192706-1.jar
[JENKINS] Archiving <https://builds.apache.org/job/axiom-trunk/ws/axiom/testing/xml-testsuite/target/xml-testsuite-1.3.0-SNAPSHOT-sources.jar>
to org.apache.ws.commons.axiom/xml-testsuite/1.3.0-20160120.192706-1/xml-testsuite-1.3.0-20160120.192706-1-sources.jar
[JENKINS] Archiving <https://builds.apache.org/job/axiom-trunk/ws/axiom/testing/xml-testsuite/target/xml-testsuite-1.3.0-SNAPSHOT-javadoc.jar>
to org.apache.ws.commons.axiom/xml-testsuite/1.3.0-20160120.192706-1/xml-testsuite-1.3.0-20160120.192706-1-javadoc.jar
[JENKINS] Archiving <https://builds.apache.org/job/axiom-trunk/ws/axiom/systests/wss4j-tests/pom.xml>
to org.apache.ws.commons.axiom/wss4j-tests/1.3.0-SNAPSHOT/wss4j-tests-1.3.0-SNAPSHOT.pom
[JENKINS] Archiving <https://builds.apache.org/job/axiom-trunk/ws/axiom/systests/wss4j-tests/target/wss4j-tests-1.3.0-SNAPSHOT.jar>
to org.apache.ws.commons.axiom/wss4j-tests/1.3.0-SNAPSHOT/wss4j-tests-1.3.0-SNAPSHOT.jar
[JENKINS] Archiving <https://builds.apache.org/job/axiom-trunk/ws/axiom/systests/wss4j-tests/target/wss4j-tests-1.3.0-SNAPSHOT-sources.jar>
to org.apache.ws.commons.axiom/wss4j-tests/1.3.0-SNAPSHOT/wss4j-tests-1.3.0-SNAPSHOT-sources.jar
[JENKINS] Archiving <https://builds.apache.org/job/axiom-trunk/ws/axiom/systests/wss4j-tests/target/jacoco.exec>
to org.apache.ws.commons.axiom/wss4j-tests/1.3.0-SNAPSHOT/wss4j-tests-1.3.0-SNAPSHOT-jacoco.exec
[JENKINS] Archiving <https://builds.apache.org/job/axiom-trunk/ws/axiom/aspects/pom.xml>
to org.apache.ws.commons.axiom/aspects/1.3.0-SNAPSHOT/aspects-1.3.0-SNAPSHOT.pom
[JENKINS] Archiving <https://builds.apache.org/job/axiom-trunk/ws/axiom/aspects/om-aspects/pom.xml>
to org.apache.ws.commons.axiom/om-aspects/1.3.0-SNAPSHOT/om-aspects-1.3.0-SNAPSHOT.pom
[JENKINS] Archiving <https://builds.apache.org/job/axiom-trunk/ws/axiom/aspects/om-aspects/target/om-aspects-1.3.0-SNAPSHOT.jar>
to org.apache.ws.commons.axiom/om-aspects/1.3.0-20160120.193013-1/om-aspects-1.3.0-20160120.193013-1.jar
[JENKINS] Archiving <https://builds.apache.org/job/axiom-trunk/ws/axiom/aspects/om-aspects/target/om-aspects-1.3.0-SNAPSHOT-sources.jar>
to org.apache.ws.commons.axiom/om-aspects/1.3.0-20160120.193013-1/om-aspects-1.3.0-20160120.193013-1-sources.jar
[JENKINS] Archiving <https://builds.apache.org/job/axiom-trunk/ws/axiom/aspects/om-aspects/target/om-aspects-1.3.0-SNAPSHOT-javadoc.jar>
to org.apache.ws.commons.axiom/om-aspects/1.3.0-20160120.193013-1/om-aspects-1.3.0-20160120.193013-1-javadoc.jar
[JENKINS] Archiving <https://builds.apache.org/job/axiom-trunk/ws/axiom/aspects/om-aspects/target/jacoco.exec>
to org.apache.ws.commons.axiom/om-aspects/1.3.0-20160120.193013-1/om-aspects-1.3.0-20160120.193013-1-jacoco.exec
Compressed 1.50 MB of artifacts by 27.0% relative to #2426
[JENKINS] Archiving <https://builds.apache.org/job/axiom-trunk/ws/axiom/axiom-jaxb/pom.xml>
to org.apache.ws.commons.axiom/axiom-jaxb/1.3.0-SNAPSHOT/axiom-jaxb-1.3.0-SNAPSHOT.pom
[JENKINS] Archiving <https://builds.apache.org/job/axiom-trunk/ws/axiom/axiom-jaxb/target/axiom-jaxb-1.3.0-SNAPSHOT.jar>
to org.apache.ws.commons.axiom/axiom-jaxb/1.3.0-20160120.193831-1/axiom-jaxb-1.3.0-20160120.193831-1.jar
[JENKINS] Archiving <https://builds.apache.org/job/axiom-trunk/ws/axiom/axiom-jaxb/target/axiom-jaxb-1.3.0-SNAPSHOT-sources.jar>
to org.apache.ws.commons.axiom/axiom-jaxb/1.3.0-20160120.193831-1/axiom-jaxb-1.3.0-20160120.193831-1-sources.jar
[JENKINS] Archiving <https://builds.apache.org/job/axiom-trunk/ws/axiom/axiom-jaxb/target/axiom-jaxb-1.3.0-SNAPSHOT-javadoc.jar>
to org.apache.ws.commons.axiom/axiom-jaxb/1.3.0-20160120.193831-1/axiom-jaxb-1.3.0-20160120.193831-1-javadoc.jar
[JENKINS] Archiving <https://builds.apache.org/job/axiom-trunk/ws/axiom/axiom-jaxb/target/jacoco.exec>
to org.apache.ws.commons.axiom/axiom-jaxb/1.3.0-20160120.193831-1/axiom-jaxb-1.3.0-20160120.193831-1-jacoco.exec
[JENKINS] Archiving <https://builds.apache.org/job/axiom-trunk/ws/axiom/testing/testutils/pom.xml>
to org.apache.ws.commons.axiom/testutils/1.3.0-SNAPSHOT/testutils-1.3.0-SNAPSHOT.pom
[JENKINS] Archiving <https://builds.apache.org/job/axiom-trunk/ws/axiom/testing/testutils/target/testutils-1.3.0-SNAPSHOT.jar>
to org.apache.ws.commons.axiom/testutils/1.3.0-20160120.192657-1/testutils-1.3.0-20160120.192657-1.jar
[JENKINS] Archiving <https://builds.apache.org/job/axiom-trunk/ws/axiom/testing/testutils/target/testutils-1.3.0-SNAPSHOT-sources.jar>
to org.apache.ws.commons.axiom/testutils/1.3.0-20160120.192657-1/testutils-1.3.0-20160120.192657-1-sources.jar
[JENKINS] Archiving <https://builds.apache.org/job/axiom-trunk/ws/axiom/testing/testutils/target/testutils-1.3.0-SNAPSHOT-javadoc.jar>
to org.apache.ws.commons.axiom/testutils/1.3.0-20160120.192657-1/testutils-1.3.0-20160120.192657-1-javadoc.jar
[JENKINS] Archiving <https://builds.apache.org/job/axiom-trunk/ws/axiom/testing/testutils/target/jacoco.exec>
to org.apache.ws.commons.axiom/testutils/1.3.0-20160120.192657-1/testutils-1.3.0-20160120.192657-1-jacoco.exec
[JENKINS] Archiving <https://builds.apache.org/job/axiom-trunk/ws/axiom/buildutils/shade-axiom-xml/pom.xml>
to org.apache.ws.commons.axiom/shade-axiom-xml/1.3.0-SNAPSHOT/shade-axiom-xml-1.3.0-SNAPSHOT.pom
[JENKINS] Archiving <https://builds.apache.org/job/axiom-trunk/ws/axiom/buildutils/shade-axiom-xml/target/shade-axiom-xml-1.3.0-SNAPSHOT.jar>
to org.apache.ws.commons.axiom/shade-axiom-xml/1.3.0-20160120.192611-1/shade-axiom-xml-1.3.0-20160120.192611-1.jar
[JENKINS] Archiving <https://builds.apache.org/job/axiom-trunk/ws/axiom/buildutils/shade-axiom-xml/target/shade-axiom-xml-1.3.0-SNAPSHOT-sources.jar>
to org.apache.ws.commons.axiom/shade-axiom-xml/1.3.0-20160120.192611-1/shade-axiom-xml-1.3.0-20160120.192611-1-sources.jar
[JENKINS] Archiving <https://builds.apache.org/job/axiom-trunk/ws/axiom/buildutils/shade-axiom-xml/target/shade-axiom-xml-1.3.0-SNAPSHOT-javadoc.jar>
to org.apache.ws.commons.axiom/shade-axiom-xml/1.3.0-20160120.192611-1/shade-axiom-xml-1.3.0-20160120.192611-1-javadoc.jar
[JENKINS] Archiving <https://builds.apache.org/job/axiom-trunk/ws/axiom/systests/spring-ws-tests/pom.xml>
to org.apache.ws.commons.axiom/spring-ws-tests/1.3.0-SNAPSHOT/spring-ws-tests-1.3.0-SNAPSHOT.pom
[JENKINS] Archiving <https://builds.apache.org/job/axiom-trunk/ws/axiom/systests/spring-ws-tests/target/spring-ws-tests-1.3.0-SNAPSHOT.jar>
to org.apache.ws.commons.axiom/spring-ws-tests/1.3.0-SNAPSHOT/spring-ws-tests-1.3.0-SNAPSHOT.jar
[JENKINS] Archiving <https://builds.apache.org/job/axiom-trunk/ws/axiom/systests/spring-ws-tests/target/spring-ws-tests-1.3.0-SNAPSHOT-sources.jar>
to org.apache.ws.commons.axiom/spring-ws-tests/1.3.0-SNAPSHOT/spring-ws-tests-1.3.0-SNAPSHOT-sources.jar
[JENKINS] Archiving <https://builds.apache.org/job/axiom-trunk/ws/axiom/systests/spring-ws-tests/target/jacoco.exec>
to org.apache.ws.commons.axiom/spring-ws-tests/1.3.0-SNAPSHOT/spring-ws-tests-1.3.0-SNAPSHOT-jacoco.exec
[JENKINS] Archiving <https://builds.apache.org/job/axiom-trunk/ws/axiom/devguide/pom.xml>
to org.apache.ws.commons.axiom/devguide/1.3.0-SNAPSHOT/devguide-1.3.0-SNAPSHOT.pom
[JENKINS] Archiving <https://builds.apache.org/job/axiom-trunk/ws/axiom/devguide/target/docbkx/pdf/devguide.pdf>
to org.apache.ws.commons.axiom/devguide/1.3.0-SNAPSHOT/devguide-1.3.0-SNAPSHOT.pdf
Compressed 353.31 KB of artifacts by 81.5% relative to #2426
[JENKINS] Archiving <https://builds.apache.org/job/axiom-trunk/ws/axiom/testing/jaxp-testsuite/pom.xml>
to org.apache.ws.commons.axiom/jaxp-testsuite/1.3.0-SNAPSHOT/jaxp-testsuite-1.3.0-SNAPSHOT.pom
[JENKINS] Archiving <https://builds.apache.org/job/axiom-trunk/ws/axiom/testing/jaxp-testsuite/target/jaxp-testsuite-1.3.0-SNAPSHOT.jar>
to org.apache.ws.commons.axiom/jaxp-testsuite/1.3.0-20160120.192715-1/jaxp-testsuite-1.3.0-20160120.192715-1.jar
[JENKINS] Archiving <https://builds.apache.org/job/axiom-trunk/ws/axiom/testing/jaxp-testsuite/target/jaxp-testsuite-1.3.0-SNAPSHOT-sources.jar>
to org.apache.ws.commons.axiom/jaxp-testsuite/1.3.0-20160120.192715-1/jaxp-testsuite-1.3.0-20160120.192715-1-sources.jar
[JENKINS] Archiving <https://builds.apache.org/job/axiom-trunk/ws/axiom/testing/jaxp-testsuite/target/jaxp-testsuite-1.3.0-SNAPSHOT-javadoc.jar>
to org.apache.ws.commons.axiom/jaxp-testsuite/1.3.0-20160120.192715-1/jaxp-testsuite-1.3.0-20160120.192715-1-javadoc.jar
[JENKINS] Archiving <https://builds.apache.org/job/axiom-trunk/ws/axiom/implementations/axiom-dom/pom.xml>
to org.apache.ws.commons.axiom/axiom-dom/1.3.0-SNAPSHOT/axiom-dom-1.3.0-SNAPSHOT.pom
[JENKINS] Archiving <https://builds.apache.org/job/axiom-trunk/ws/axiom/implementations/axiom-dom/target/axiom-dom-1.3.0-SNAPSHOT.jar>
to org.apache.ws.commons.axiom/axiom-dom/1.3.0-20160120.193759-1/axiom-dom-1.3.0-20160120.193759-1.jar
[JENKINS] Archiving <https://builds.apache.org/job/axiom-trunk/ws/axiom/implementations/axiom-dom/target/axiom-dom-1.3.0-SNAPSHOT-sources.jar>
to org.apache.ws.commons.axiom/axiom-dom/1.3.0-20160120.193759-1/axiom-dom-1.3.0-20160120.193759-1-sources.jar
[JENKINS] Archiving <https://builds.apache.org/job/axiom-trunk/ws/axiom/implementations/axiom-dom/target/axiom-dom-1.3.0-SNAPSHOT-javadoc.jar>
to org.apache.ws.commons.axiom/axiom-dom/1.3.0-20160120.193759-1/axiom-dom-1.3.0-20160120.193759-1-javadoc.jar
[JENKINS] Archiving <https://builds.apache.org/job/axiom-trunk/ws/axiom/implementations/axiom-dom/target/jacoco.exec>
to org.apache.ws.commons.axiom/axiom-dom/1.3.0-20160120.193759-1/axiom-dom-1.3.0-20160120.193759-1-jacoco.exec
[JENKINS] Archiving <https://builds.apache.org/job/axiom-trunk/ws/axiom/samples/pom.xml>
to org.apache.ws.commons.axiom/samples/1.3.0-SNAPSHOT/samples-1.3.0-SNAPSHOT.pom
[JENKINS] Archiving <https://builds.apache.org/job/axiom-trunk/ws/axiom/samples/target/samples-1.3.0-SNAPSHOT.jar>
to org.apache.ws.commons.axiom/samples/1.3.0-SNAPSHOT/samples-1.3.0-SNAPSHOT.jar
[JENKINS] Archiving <https://builds.apache.org/job/axiom-trunk/ws/axiom/samples/target/samples-1.3.0-SNAPSHOT-sources.jar>
to org.apache.ws.commons.axiom/samples/1.3.0-SNAPSHOT/samples-1.3.0-SNAPSHOT-sources.jar
[JENKINS] Archiving <https://builds.apache.org/job/axiom-trunk/ws/axiom/samples/target/jacoco.exec>
to org.apache.ws.commons.axiom/samples/1.3.0-SNAPSHOT/samples-1.3.0-SNAPSHOT-jacoco.exec
[JENKINS] Archiving <https://builds.apache.org/job/axiom-trunk/ws/axiom/pom.xml> to
org.apache.ws.commons.axiom/axiom/1.3.0-SNAPSHOT/axiom-1.3.0-SNAPSHOT.pom
[JENKINS] Archiving <https://builds.apache.org/job/axiom-trunk/ws/axiom/target/axiom-1.3.0-SNAPSHOT-site.xml>
to org.apache.ws.commons.axiom/axiom/1.3.0-20160120.192550-1/axiom-1.3.0-20160120.192550-1-site.xml
[JENKINS] Archiving <https://builds.apache.org/job/axiom-trunk/ws/axiom/buildutils/jar-resource-bundle/pom.xml>
to org.apache.ws.commons.axiom/jar-resource-bundle/1.3.0-SNAPSHOT/jar-resource-bundle-1.3.0-SNAPSHOT.pom
[JENKINS] Archiving <https://builds.apache.org/job/axiom-trunk/ws/axiom/buildutils/jar-resource-bundle/target/jar-resource-bundle-1.3.0-SNAPSHOT.jar>
to org.apache.ws.commons.axiom/jar-resource-bundle/1.3.0-20160120.192602-1/jar-resource-bundle-1.3.0-20160120.192602-1.jar
[JENKINS] Archiving <https://builds.apache.org/job/axiom-trunk/ws/axiom/buildutils/jar-resource-bundle/target/jar-resource-bundle-1.3.0-SNAPSHOT-sources.jar>
to org.apache.ws.commons.axiom/jar-resource-bundle/1.3.0-20160120.192602-1/jar-resource-bundle-1.3.0-20160120.192602-1-sources.jar
[JENKINS] Archiving <https://builds.apache.org/job/axiom-trunk/ws/axiom/testing/axiom-truth/pom.xml>
to org.apache.ws.commons.axiom/axiom-truth/1.3.0-SNAPSHOT/axiom-truth-1.3.0-SNAPSHOT.pom
[JENKINS] Archiving <https://builds.apache.org/job/axiom-trunk/ws/axiom/testing/axiom-truth/target/axiom-truth-1.3.0-SNAPSHOT.jar>
to org.apache.ws.commons.axiom/axiom-truth/1.3.0-20160120.193021-1/axiom-truth-1.3.0-20160120.193021-1.jar
[JENKINS] Archiving <https://builds.apache.org/job/axiom-trunk/ws/axiom/testing/axiom-truth/target/axiom-truth-1.3.0-SNAPSHOT-sources.jar>
to org.apache.ws.commons.axiom/axiom-truth/1.3.0-20160120.193021-1/axiom-truth-1.3.0-20160120.193021-1-sources.jar
[JENKINS] Archiving <https://builds.apache.org/job/axiom-trunk/ws/axiom/testing/axiom-truth/target/axiom-truth-1.3.0-SNAPSHOT-javadoc.jar>
to org.apache.ws.commons.axiom/axiom-truth/1.3.0-20160120.193021-1/axiom-truth-1.3.0-20160120.193021-1-javadoc.jar
[JENKINS] Archiving <https://builds.apache.org/job/axiom-trunk/ws/axiom/code-coverage/pom.xml>
to org.apache.ws.commons.axiom/code-coverage/1.3.0-SNAPSHOT/code-coverage-1.3.0-SNAPSHOT.pom
[JENKINS] Archiving <https://builds.apache.org/job/axiom-trunk/ws/axiom/aspects/dom-aspects/pom.xml>
to org.apache.ws.commons.axiom/dom-aspects/1.3.0-SNAPSHOT/dom-aspects-1.3.0-SNAPSHOT.pom
[JENKINS] Archiving <https://builds.apache.org/job/axiom-trunk/ws/axiom/aspects/dom-aspects/target/dom-aspects-1.3.0-SNAPSHOT.jar>
to org.apache.ws.commons.axiom/dom-aspects/1.3.0-20160120.193353-1/dom-aspects-1.3.0-20160120.193353-1.jar
[JENKINS] Archiving <https://builds.apache.org/job/axiom-trunk/ws/axiom/aspects/dom-aspects/target/dom-aspects-1.3.0-SNAPSHOT-sources.jar>
to org.apache.ws.commons.axiom/dom-aspects/1.3.0-20160120.193353-1/dom-aspects-1.3.0-20160120.193353-1-sources.jar
[JENKINS] Archiving <https://builds.apache.org/job/axiom-trunk/ws/axiom/aspects/dom-aspects/target/dom-aspects-1.3.0-SNAPSHOT-javadoc.jar>
to org.apache.ws.commons.axiom/dom-aspects/1.3.0-20160120.193353-1/dom-aspects-1.3.0-20160120.193353-1-javadoc.jar
[JENKINS] Archiving <https://builds.apache.org/job/axiom-trunk/ws/axiom/aspects/dom-aspects/target/jacoco.exec>
to org.apache.ws.commons.axiom/dom-aspects/1.3.0-20160120.193353-1/dom-aspects-1.3.0-20160120.193353-1-jacoco.exec
[JENKINS] Archiving <https://builds.apache.org/job/axiom-trunk/ws/axiom/components/pom.xml>
to org.apache.ws.commons.axiom/components/1.3.0-SNAPSHOT/components-1.3.0-SNAPSHOT.pom
[JENKINS] Archiving <https://builds.apache.org/job/axiom-trunk/ws/axiom/buildutils/javadoc-postprocessor-plugin/pom.xml>
to org.apache.ws.commons.axiom/javadoc-postprocessor-plugin/1.3.0-SNAPSHOT/javadoc-postprocessor-plugin-1.3.0-SNAPSHOT.pom
[JENKINS] Archiving <https://builds.apache.org/job/axiom-trunk/ws/axiom/buildutils/javadoc-postprocessor-plugin/target/javadoc-postprocessor-plugin-1.3.0-SNAPSHOT.jar>
to org.apache.ws.commons.axiom/javadoc-postprocessor-plugin/1.3.0-20160120.192629-1/javadoc-postprocessor-plugin-1.3.0-20160120.192629-1.jar
[JENKINS] Archiving <https://builds.apache.org/job/axiom-trunk/ws/axiom/buildutils/javadoc-postprocessor-plugin/target/javadoc-postprocessor-plugin-1.3.0-SNAPSHOT-sources.jar>
to org.apache.ws.commons.axiom/javadoc-postprocessor-plugin/1.3.0-20160120.192629-1/javadoc-postprocessor-plugin-1.3.0-20160120.192629-1-sources.jar
[JENKINS] Archiving <https://builds.apache.org/job/axiom-trunk/ws/axiom/buildutils/javadoc-postprocessor-plugin/target/javadoc-postprocessor-plugin-1.3.0-SNAPSHOT-javadoc.jar>
to org.apache.ws.commons.axiom/javadoc-postprocessor-plugin/1.3.0-20160120.192629-1/javadoc-postprocessor-plugin-1.3.0-20160120.192629-1-javadoc.jar
[JENKINS] Archiving <https://builds.apache.org/job/axiom-trunk/ws/axiom/systests/cross-om-tests/pom.xml>
to org.apache.ws.commons.axiom/cross-om-tests/1.3.0-SNAPSHOT/cross-om-tests-1.3.0-SNAPSHOT.pom
[JENKINS] Archiving <https://builds.apache.org/job/axiom-trunk/ws/axiom/systests/cross-om-tests/target/cross-om-tests-1.3.0-SNAPSHOT.jar>
to org.apache.ws.commons.axiom/cross-om-tests/1.3.0-SNAPSHOT/cross-om-tests-1.3.0-SNAPSHOT.jar
[JENKINS] Archiving <https://builds.apache.org/job/axiom-trunk/ws/axiom/systests/cross-om-tests/target/cross-om-tests-1.3.0-SNAPSHOT-sources.jar>
to org.apache.ws.commons.axiom/cross-om-tests/1.3.0-SNAPSHOT/cross-om-tests-1.3.0-SNAPSHOT-sources.jar
[JENKINS] Archiving <https://builds.apache.org/job/axiom-trunk/ws/axiom/systests/cross-om-tests/target/jacoco.exec>
to org.apache.ws.commons.axiom/cross-om-tests/1.3.0-SNAPSHOT/cross-om-tests-1.3.0-SNAPSHOT-jacoco.exec
[JENKINS] Archiving <https://builds.apache.org/job/axiom-trunk/ws/axiom/testing/saaj-testsuite/pom.xml>
to org.apache.ws.commons.axiom/saaj-testsuite/1.3.0-SNAPSHOT/saaj-testsuite-1.3.0-SNAPSHOT.pom
[JENKINS] Archiving <https://builds.apache.org/job/axiom-trunk/ws/axiom/testing/jaxen-testsuite/pom.xml>
to org.apache.ws.commons.axiom/jaxen-testsuite/1.3.0-SNAPSHOT/jaxen-testsuite-1.3.0-SNAPSHOT.pom
[JENKINS] Archiving <https://builds.apache.org/job/axiom-trunk/ws/axiom/testing/jaxen-testsuite/target/jaxen-testsuite-1.3.0-SNAPSHOT.jar>
to org.apache.ws.commons.axiom/jaxen-testsuite/1.3.0-20160120.193030-1/jaxen-testsuite-1.3.0-20160120.193030-1.jar
[JENKINS] Archiving <https://builds.apache.org/job/axiom-trunk/ws/axiom/testing/jaxen-testsuite/target/jaxen-testsuite-1.3.0-SNAPSHOT-sources.jar>
to org.apache.ws.commons.axiom/jaxen-testsuite/1.3.0-20160120.193030-1/jaxen-testsuite-1.3.0-20160120.193030-1-sources.jar
[JENKINS] Archiving <https://builds.apache.org/job/axiom-trunk/ws/axiom/testing/jaxen-testsuite/target/jaxen-testsuite-1.3.0-SNAPSHOT-javadoc.jar>
to org.apache.ws.commons.axiom/jaxen-testsuite/1.3.0-20160120.193030-1/jaxen-testsuite-1.3.0-20160120.193030-1-javadoc.jar
Compressed 248.44 KB of artifacts by 25.8% relative to #2426
[JENKINS] Archiving <https://builds.apache.org/job/axiom-trunk/ws/axiom/distribution/pom.xml>
to org.apache.ws.commons.axiom/distribution/1.3.0-SNAPSHOT/distribution-1.3.0-SNAPSHOT.pom
[JENKINS] Archiving <https://builds.apache.org/job/axiom-trunk/ws/axiom/components/xml-utils/pom.xml>
to org.apache.ws.commons.axiom/xml-utils/1.3.0-SNAPSHOT/xml-utils-1.3.0-SNAPSHOT.pom
[JENKINS] Archiving <https://builds.apache.org/job/axiom-trunk/ws/axiom/components/xml-utils/target/xml-utils-1.3.0-SNAPSHOT.jar>
to org.apache.ws.commons.axiom/xml-utils/1.3.0-20160120.192743-1/xml-utils-1.3.0-20160120.192743-1.jar
[JENKINS] Archiving <https://builds.apache.org/job/axiom-trunk/ws/axiom/components/xml-utils/target/xml-utils-1.3.0-SNAPSHOT-sources.jar>
to org.apache.ws.commons.axiom/xml-utils/1.3.0-20160120.192743-1/xml-utils-1.3.0-20160120.192743-1-sources.jar
[JENKINS] Archiving <https://builds.apache.org/job/axiom-trunk/ws/axiom/components/xml-utils/target/xml-utils-1.3.0-SNAPSHOT-javadoc.jar>
to org.apache.ws.commons.axiom/xml-utils/1.3.0-20160120.192743-1/xml-utils-1.3.0-20160120.192743-1-javadoc.jar
[JENKINS] Archiving <https://builds.apache.org/job/axiom-trunk/ws/axiom/components/xml-utils/target/jacoco.exec>
to org.apache.ws.commons.axiom/xml-utils/1.3.0-20160120.192743-1/xml-utils-1.3.0-20160120.192743-1-jacoco.exec
[JENKINS] Archiving <https://builds.apache.org/job/axiom-trunk/ws/axiom/testing/multiton/pom.xml>
to org.apache.ws.commons.axiom/multiton/1.3.0-SNAPSHOT/multiton-1.3.0-SNAPSHOT.pom
[JENKINS] Archiving <https://builds.apache.org/job/axiom-trunk/ws/axiom/testing/multiton/target/multiton-1.3.0-SNAPSHOT.jar>
to org.apache.ws.commons.axiom/multiton/1.3.0-20160120.192639-1/multiton-1.3.0-20160120.192639-1.jar
[JENKINS] Archiving <https://builds.apache.org/job/axiom-trunk/ws/axiom/testing/multiton/target/multiton-1.3.0-SNAPSHOT-sources.jar>
to org.apache.ws.commons.axiom/multiton/1.3.0-20160120.192639-1/multiton-1.3.0-20160120.192639-1-sources.jar
[JENKINS] Archiving <https://builds.apache.org/job/axiom-trunk/ws/axiom/testing/multiton/target/multiton-1.3.0-SNAPSHOT-javadoc.jar>
to org.apache.ws.commons.axiom/multiton/1.3.0-20160120.192639-1/multiton-1.3.0-20160120.192639-1-javadoc.jar
[JENKINS] Archiving <https://builds.apache.org/job/axiom-trunk/ws/axiom/apidocs/pom.xml>
to org.apache.ws.commons.axiom/apidocs/1.3.0-SNAPSHOT/apidocs-1.3.0-SNAPSHOT.pom
[JENKINS] Archiving <https://builds.apache.org/job/axiom-trunk/ws/axiom/apidocs/target/apidocs-1.3.0-SNAPSHOT-javadoc.zip>
to org.apache.ws.commons.axiom/apidocs/1.3.0-SNAPSHOT/apidocs-1.3.0-SNAPSHOT-javadoc.zip
[JENKINS] Archiving <https://builds.apache.org/job/axiom-trunk/ws/axiom/testing/pom.xml>
to org.apache.ws.commons.axiom/testing/1.3.0-SNAPSHOT/testing-1.3.0-SNAPSHOT.pom
[JENKINS] Archiving <https://builds.apache.org/job/axiom-trunk/ws/axiom/testing/target/testing-1.3.0-SNAPSHOT-site.xml>
to org.apache.ws.commons.axiom/testing/1.3.0-20160120.192633-1/testing-1.3.0-20160120.192633-1-site.xml
[JENKINS] Archiving <https://builds.apache.org/job/axiom-trunk/ws/axiom/systests/old-tests/pom.xml>
to org.apache.ws.commons.axiom/old-tests/1.3.0-SNAPSHOT/old-tests-1.3.0-SNAPSHOT.pom
[JENKINS] Archiving <https://builds.apache.org/job/axiom-trunk/ws/axiom/systests/old-tests/target/old-tests-1.3.0-SNAPSHOT.jar>
to org.apache.ws.commons.axiom/old-tests/1.3.0-SNAPSHOT/old-tests-1.3.0-SNAPSHOT.jar
[JENKINS] Archiving <https://builds.apache.org/job/axiom-trunk/ws/axiom/systests/old-tests/target/old-tests-1.3.0-SNAPSHOT-sources.jar>
to org.apache.ws.commons.axiom/old-tests/1.3.0-SNAPSHOT/old-tests-1.3.0-SNAPSHOT-sources.jar
[JENKINS] Archiving <https://builds.apache.org/job/axiom-trunk/ws/axiom/systests/old-tests/target/jacoco.exec>
to org.apache.ws.commons.axiom/old-tests/1.3.0-SNAPSHOT/old-tests-1.3.0-SNAPSHOT-jacoco.exec
[JENKINS] Archiving <https://builds.apache.org/job/axiom-trunk/ws/axiom/systests/osgi-tests/pom.xml>
to org.apache.ws.commons.axiom/osgi-tests/1.3.0-SNAPSHOT/osgi-tests-1.3.0-SNAPSHOT.pom
[JENKINS] Archiving <https://builds.apache.org/job/axiom-trunk/ws/axiom/systests/osgi-tests/target/osgi-tests-1.3.0-SNAPSHOT.jar>
to org.apache.ws.commons.axiom/osgi-tests/1.3.0-SNAPSHOT/osgi-tests-1.3.0-SNAPSHOT.jar
[JENKINS] Archiving <https://builds.apache.org/job/axiom-trunk/ws/axiom/systests/osgi-tests/target/osgi-tests-1.3.0-SNAPSHOT-sources.jar>
to org.apache.ws.commons.axiom/osgi-tests/1.3.0-SNAPSHOT/osgi-tests-1.3.0-SNAPSHOT-sources.jar
[JENKINS] Archiving <https://builds.apache.org/job/axiom-trunk/ws/axiom/systests/osgi-tests/target/jacoco.exec>
to org.apache.ws.commons.axiom/osgi-tests/1.3.0-SNAPSHOT/osgi-tests-1.3.0-SNAPSHOT-jacoco.exec
[JENKINS] Archiving <https://builds.apache.org/job/axiom-trunk/ws/axiom/testing/soap-testsuite/pom.xml>
to org.apache.ws.commons.axiom/soap-testsuite/1.3.0-SNAPSHOT/soap-testsuite-1.3.0-SNAPSHOT.pom
[JENKINS] Archiving <https://builds.apache.org/job/axiom-trunk/ws/axiom/testing/soap-testsuite/target/soap-testsuite-1.3.0-SNAPSHOT.jar>
to org.apache.ws.commons.axiom/soap-testsuite/1.3.0-20160120.192754-1/soap-testsuite-1.3.0-20160120.192754-1.jar
[JENKINS] Archiving <https://builds.apache.org/job/axiom-trunk/ws/axiom/testing/soap-testsuite/target/soap-testsuite-1.3.0-SNAPSHOT-sources.jar>
to org.apache.ws.commons.axiom/soap-testsuite/1.3.0-20160120.192754-1/soap-testsuite-1.3.0-20160120.192754-1-sources.jar
[JENKINS] Archiving <https://builds.apache.org/job/axiom-trunk/ws/axiom/testing/soap-testsuite/target/soap-testsuite-1.3.0-SNAPSHOT-javadoc.jar>
to org.apache.ws.commons.axiom/soap-testsuite/1.3.0-20160120.192754-1/soap-testsuite-1.3.0-20160120.192754-1-javadoc.jar
[JENKINS] Archiving <https://builds.apache.org/job/axiom-trunk/ws/axiom/testing/soap-testsuite/target/jacoco.exec>
to org.apache.ws.commons.axiom/soap-testsuite/1.3.0-20160120.192754-1/soap-testsuite-1.3.0-20160120.192754-1-jacoco.exec
Compressed 400.52 KB of artifacts by 32.0% relative to #2426
Sending e-mails to: dev@ws.apache.org andreas.veithen@gmail.com
channel stopped

---------------------------------------------------------------------
To unsubscribe, e-mail: dev-unsubscribe@ws.apache.org
For additional commands, e-mail: dev-help@ws.apache.org


Mime
View raw message