ws-dev mailing list archives

Site index · List index
Message view « Date » · « Thread »
Top « Date » · « Thread »
From Apache Jenkins Server <jenk...@builds.apache.org>
Subject Build failed in Jenkins: woden-trunk #1222
Date Sat, 05 Sep 2015 23:36:23 GMT
See <https://builds.apache.org/job/woden-trunk/1222/changes>

Changes:

[veithen] Remove unused images.

[veithen] Implement branding guidelines.

------------------------------------------
Started by an SCM change
[EnvInject] - Loading node environment variables.
Building remotely on ubuntu3 (Ubuntu ubuntu legacy-ubuntu) in workspace <https://builds.apache.org/job/woden-trunk/ws/>
Cleaning up <https://builds.apache.org/job/woden-trunk/ws/woden>
Deleting <https://builds.apache.org/job/woden-trunk/ws/woden/target>
Updating http://svn.apache.org/repos/asf/webservices/woden/trunk/java at revision '2015-09-05T23:36:11.145
+0000'
D         src/site/resources/images/project.svg
D         src/site/resources/images/project-logo.gif
D         src/site/resources/images/group.svg
D         src/site/resources/images/icon.png
D         src/site/resources/images/ws-logo.gif
D         src/site/resources/images/apachecon_small.gif
D         src/site/resources/images/group-logo.gif
U         src/site/resources/images/wodentitle.png
U         src/site/markdown/index.md.vm
At revision 1701435
Parsing POMs
maven3-agent.jar already up to date
maven3-interceptor.jar already up to date
maven3-interceptor-commons.jar already up to date
[woden] $ /home/jenkins/tools/java/latest1.7/bin/java -Xmx2g -Xms256m -XX:MaxPermSize=512m
-cp /home/jenkins/jenkins-slave/maven3-agent.jar:/home/jenkins/jenkins-slave/tools/hudson.tasks.Maven_MavenInstallation/Maven_3.0.5/boot/plexus-classworlds-2.4.jar
org.jvnet.hudson.maven3.agent.Maven3Main /home/jenkins/jenkins-slave/tools/hudson.tasks.Maven_MavenInstallation/Maven_3.0.5
/x1/jenkins/jenkins-slave/slave.jar /home/jenkins/jenkins-slave/maven3-interceptor.jar /home/jenkins/jenkins-slave/maven3-interceptor-commons.jar
36893
<===[JENKINS REMOTING CAPACITY]===>   channel started
Executing Maven:  -B -f <https://builds.apache.org/job/woden-trunk/ws/woden/pom.xml>
-Dmaven.repo.local=<https://builds.apache.org/job/woden-trunk/ws/.repository> -U clean
deploy -Papache-release -Dgpg.skip=true
[INFO] Scanning for projects...
[INFO] ------------------------------------------------------------------------
[INFO] Reactor Build Order:
[INFO] 
[INFO] Woden
[INFO] Woden - Core
[INFO] Woden - Tests
[INFO] Woden - Tool
[INFO] Woden - converter Maven plugin
[INFO] Woden - Ant
[INFO] Woden - dist
[INFO] Woden - W3C tests
[INFO]                                                                         
[INFO] ------------------------------------------------------------------------
[INFO] Building Woden 1.0M10-SNAPSHOT
[INFO] ------------------------------------------------------------------------
[INFO] 
[INFO] --- maven-clean-plugin:2.5:clean (default-clean) @ woden ---
[INFO] 
[INFO] --- maven-remote-resources-plugin:1.5:process (default) @ woden ---
[INFO] 
[INFO] --- maven-site-plugin:3.4:attach-descriptor (attach-descriptor) @ woden ---
[INFO] 
[INFO] --- maven-source-plugin:2.4:jar-no-fork (source-jars) @ woden ---
[INFO] 
[INFO] --- maven-javadoc-plugin:2.10.3:jar (attach-javadocs) @ woden ---
[INFO] Not executing Javadoc as the project is not a Java classpath-capable package
[INFO] 
[INFO] --- apache-rat-plugin:0.11:check (default) @ woden ---
[INFO] 58 implicit excludes (use -debug for more details).
[INFO] Exclude: legal/LICENSE.xerces
[INFO] Exclude: legal/LICENSE.dom
[INFO] Exclude: legal/LICENSE.sax
[INFO] Exclude: legal/LICENSE.wsdl4j.html
[INFO] Exclude: woden-1.0.0M6-test-results.html
[INFO] Exclude: ant-test/validation-results.xml
[INFO] Exclude: ant-test/documents-bad-report.xml
[INFO] Exclude: ant-test/documents-good-report.xml
[INFO] Exclude: ant-test/validation-results-without-ids.xml
[INFO] Exclude: ant-test/test-suite-results.zip
[INFO] Exclude: **/META-INF/MANIFEST.MF
[INFO] Exclude: **/about-this-package
[INFO] 49 resources included (use -debug for more details)
[INFO] Rat check: Summary of files. Unapproved: 2 unknown: 2 generated: 0 approved: 38 licence.
[INFO] ------------------------------------------------------------------------
[INFO] Reactor Summary:
[INFO] 
[INFO] Woden ............................................. FAILURE [3.158s]
[INFO] Woden - Core ...................................... SKIPPED
[INFO] Woden - Tests ..................................... SKIPPED
[INFO] Woden - Tool ...................................... SKIPPED
[INFO] Woden - converter Maven plugin .................... SKIPPED
[INFO] Woden - Ant ....................................... SKIPPED
[INFO] Woden - dist ...................................... SKIPPED
[INFO] Woden - W3C tests ................................. SKIPPED
[INFO] ------------------------------------------------------------------------
[INFO] BUILD FAILURE
[INFO] ------------------------------------------------------------------------
[INFO] Total time: 4.410s
[INFO] Finished at: Sat Sep 05 23:37:40 UTC 2015
[INFO] Final Memory: 22M/444M
[INFO] ------------------------------------------------------------------------
Waiting for Jenkins to finish collecting data
[ERROR] Failed to execute goal org.apache.rat:apache-rat-plugin:0.11:check (default) on project
woden: Too many files with unapproved license: 2 See RAT report in: <https://builds.apache.org/job/woden-trunk/ws/woden/target/rat.txt>
-> [Help 1]
[ERROR] 
[ERROR] To see the full stack trace of the errors, re-run Maven with the -e switch.
[ERROR] Re-run Maven using the -X switch to enable full debug logging.
[ERROR] 
[ERROR] For more information about the errors and possible solutions, please read the following
articles:
[ERROR] [Help 1] http://cwiki.apache.org/confluence/display/MAVEN/MojoFailureException
[JENKINS] Archiving <https://builds.apache.org/job/woden-trunk/ws/woden/woden-dist/pom.xml>
to org.apache.woden/woden-dist/1.0M10-SNAPSHOT/woden-dist-1.0M10-SNAPSHOT.pom
Sending artifact delta relative to woden-trunk ? Woden - dist #1219
Archived 1 artifacts
Archive block size is 32768
Received 0 blocks and 7886 bytes
Compression is 0.0%
Took 72 ms
[JENKINS] Archiving <https://builds.apache.org/job/woden-trunk/ws/woden/woden-converter-maven-plugin/pom.xml>
to org.apache.woden/woden-converter-maven-plugin/1.0M10-SNAPSHOT/woden-converter-maven-plugin-1.0M10-SNAPSHOT.pom
Sending artifact delta relative to woden-trunk ? Woden - converter Maven plugin #1219
Archived 1 artifacts
Archive block size is 32768
Received 0 blocks and 3395 bytes
Compression is 0.0%
Took 7 ms
[JENKINS] Archiving <https://builds.apache.org/job/woden-trunk/ws/woden/woden-ant/pom.xml>
to org.apache.woden/woden-ant/1.0M10-SNAPSHOT/woden-ant-1.0M10-SNAPSHOT.pom
Sending artifact delta relative to woden-trunk ? Woden - Ant #1219
Archived 1 artifacts
Archive block size is 32768
Received 0 blocks and 3021 bytes
Compression is 0.0%
Took 10 ms
[JENKINS] Archiving <https://builds.apache.org/job/woden-trunk/ws/woden/w3c-tests/pom.xml>
to org.apache.woden/w3c-tests/1.0M10-SNAPSHOT/w3c-tests-1.0M10-SNAPSHOT.pom
Sending artifact delta relative to woden-trunk ? Woden - W3C tests #1219
Archived 1 artifacts
Archive block size is 32768
Received 0 blocks and 4257 bytes
Compression is 0.0%
Took 7 ms
[JENKINS] Archiving <https://builds.apache.org/job/woden-trunk/ws/woden/woden-tool/pom.xml>
to org.apache.woden/woden-tool/1.0M10-SNAPSHOT/woden-tool-1.0M10-SNAPSHOT.pom
Sending artifact delta relative to woden-trunk ? Woden - Tool #1219
Archived 1 artifacts
Archive block size is 32768
Received 0 blocks and 4499 bytes
Compression is 0.0%
Took 8 ms
[JENKINS] Archiving <https://builds.apache.org/job/woden-trunk/ws/woden/woden-core/pom.xml>
to org.apache.woden/woden-core/1.0M10-SNAPSHOT/woden-core-1.0M10-SNAPSHOT.pom
Sending artifact delta relative to woden-trunk ? Woden - Core #1219
Archived 1 artifacts
Archive block size is 32768
Received 0 blocks and 4475 bytes
Compression is 0.0%
Took 63 ms
[JENKINS] Archiving <https://builds.apache.org/job/woden-trunk/ws/woden/pom.xml> to
org.apache.woden/woden/1.0M10-SNAPSHOT/woden-1.0M10-SNAPSHOT.pom
[JENKINS] Archiving <https://builds.apache.org/job/woden-trunk/ws/woden/target/woden-1.0M10-SNAPSHOT-site.xml>
to org.apache.woden/woden/1.0M10-SNAPSHOT/woden-1.0M10-SNAPSHOT-site.xml
Sending artifact delta relative to woden-trunk ? Woden #1219
Archived 2 artifacts
Archive block size is 32768
Received 0 blocks and 15382 bytes
Compression is 0.0%
Took 9 ms
[JENKINS] Archiving <https://builds.apache.org/job/woden-trunk/ws/woden/woden-tests/pom.xml>
to org.apache.woden/woden-tests/1.0M10-SNAPSHOT/woden-tests-1.0M10-SNAPSHOT.pom
Sending artifact delta relative to woden-trunk ? Woden - Tests #1219
Archived 1 artifacts
Archive block size is 32768
Received 0 blocks and 3678 bytes
Compression is 0.0%
Took 6 ms
channel stopped

---------------------------------------------------------------------
To unsubscribe, e-mail: dev-unsubscribe@ws.apache.org
For additional commands, e-mail: dev-help@ws.apache.org


Mime
View raw message