ws-dev mailing list archives

Site index · List index
Message view « Date » · « Thread »
Top « Date » · « Thread »
From Apache Jenkins Server <jenk...@builds.apache.org>
Subject Build failed in Jenkins: woden-trunk #1224
Date Sun, 06 Sep 2015 10:42:52 GMT
See <https://builds.apache.org/job/woden-trunk/1224/changes>

Changes:

[veithen] [maven-release-plugin] prepare for next development iteration

[veithen] [maven-release-plugin] prepare release 1.0M10

[veithen] Clean up the RAT configuration.

[veithen] Move the maven-release-plugin configuration to the right location.

[veithen] Complete the apache-release profile setup.

------------------------------------------
[...truncated 1434 lines...]
Generating <https://builds.apache.org/job/woden-trunk/ws/woden/woden-ant/target/apidocs/org/apache/woden/ant/task/ConverterTask.html...>
Generating <https://builds.apache.org/job/woden-trunk/ws/woden/woden-ant/target/apidocs/overview-frame.html...>
Generating <https://builds.apache.org/job/woden-trunk/ws/woden/woden-ant/target/apidocs/org/apache/woden/ant/package-frame.html...>
Generating <https://builds.apache.org/job/woden-trunk/ws/woden/woden-ant/target/apidocs/org/apache/woden/ant/package-summary.html...>
Generating <https://builds.apache.org/job/woden-trunk/ws/woden/woden-ant/target/apidocs/org/apache/woden/ant/package-tree.html...>
Generating <https://builds.apache.org/job/woden-trunk/ws/woden/woden-ant/target/apidocs/org/apache/woden/ant/task/package-frame.html...>
Generating <https://builds.apache.org/job/woden-trunk/ws/woden/woden-ant/target/apidocs/org/apache/woden/ant/task/package-summary.html...>
Generating <https://builds.apache.org/job/woden-trunk/ws/woden/woden-ant/target/apidocs/org/apache/woden/ant/task/package-tree.html...>
Generating <https://builds.apache.org/job/woden-trunk/ws/woden/woden-ant/target/apidocs/constant-values.html...>
Generating <https://builds.apache.org/job/woden-trunk/ws/woden/woden-ant/target/apidocs/org/apache/woden/ant/class-use/ValidateWSDL20.html...>
Generating <https://builds.apache.org/job/woden-trunk/ws/woden/woden-ant/target/apidocs/org/apache/woden/ant/class-use/CmHttpWriter.html...>
Generating <https://builds.apache.org/job/woden-trunk/ws/woden/woden-ant/target/apidocs/org/apache/woden/ant/class-use/CmSoapWriter.html...>
Generating <https://builds.apache.org/job/woden-trunk/ws/woden/woden-ant/target/apidocs/org/apache/woden/ant/class-use/CmExtensionsWriter.html...>
Generating <https://builds.apache.org/job/woden-trunk/ws/woden/woden-ant/target/apidocs/org/apache/woden/ant/class-use/XMLWriter.html...>
Generating <https://builds.apache.org/job/woden-trunk/ws/woden/woden-ant/target/apidocs/org/apache/woden/ant/class-use/NamespaceWriter.html...>
Generating <https://builds.apache.org/job/woden-trunk/ws/woden/woden-ant/target/apidocs/org/apache/woden/ant/class-use/Report.html...>
Generating <https://builds.apache.org/job/woden-trunk/ws/woden/woden-ant/target/apidocs/org/apache/woden/ant/class-use/WsdlCm.html...>
Generating <https://builds.apache.org/job/woden-trunk/ws/woden/woden-ant/target/apidocs/org/apache/woden/ant/class-use/CmRpcWriter.html...>
Generating <https://builds.apache.org/job/woden-trunk/ws/woden/woden-ant/target/apidocs/org/apache/woden/ant/class-use/CmWriter.html...>
Generating <https://builds.apache.org/job/woden-trunk/ws/woden/woden-ant/target/apidocs/org/apache/woden/ant/class-use/ObjectIdTable.html...>
Generating <https://builds.apache.org/job/woden-trunk/ws/woden/woden-ant/target/apidocs/org/apache/woden/ant/class-use/CmBaseWriter.html...>
Generating <https://builds.apache.org/job/woden-trunk/ws/woden/woden-ant/target/apidocs/org/apache/woden/ant/task/class-use/ConverterTask.html...>
Generating <https://builds.apache.org/job/woden-trunk/ws/woden/woden-ant/target/apidocs/org/apache/woden/ant/package-use.html...>
Generating <https://builds.apache.org/job/woden-trunk/ws/woden/woden-ant/target/apidocs/org/apache/woden/ant/task/package-use.html...>
Building index for all the packages and classes...
Generating <https://builds.apache.org/job/woden-trunk/ws/woden/woden-ant/target/apidocs/overview-tree.html...>
Generating <https://builds.apache.org/job/woden-trunk/ws/woden/woden-ant/target/apidocs/index-all.html...>
Generating <https://builds.apache.org/job/woden-trunk/ws/woden/woden-ant/target/apidocs/deprecated-list.html...>
Building index for all classes...
Generating <https://builds.apache.org/job/woden-trunk/ws/woden/woden-ant/target/apidocs/allclasses-frame.html...>
Generating <https://builds.apache.org/job/woden-trunk/ws/woden/woden-ant/target/apidocs/allclasses-noframe.html...>
Generating <https://builds.apache.org/job/woden-trunk/ws/woden/woden-ant/target/apidocs/index.html...>
Generating <https://builds.apache.org/job/woden-trunk/ws/woden/woden-ant/target/apidocs/overview-summary.html...>
Generating <https://builds.apache.org/job/woden-trunk/ws/woden/woden-ant/target/apidocs/help-doc.html...>
[INFO] Building jar: <https://builds.apache.org/job/woden-trunk/ws/woden/woden-ant/target/woden-ant-1.0M11-SNAPSHOT-javadoc.jar>
[INFO] 
[INFO] --- apache-rat-plugin:0.11:check (default) @ woden-ant ---
[INFO] 51 implicit excludes (use -debug for more details).
[INFO] Exclude: legal/**
[INFO] Exclude: src/site/markdown/release-notes/**
[INFO] Exclude: **/META-INF/MANIFEST.MF
[INFO] Exclude: **/about-this-package
[INFO] 17 resources included (use -debug for more details)
[INFO] Rat check: Summary of files. Unapproved: 0 unknown: 0 generated: 0 approved: 17 licence.
[INFO] 
[INFO] --- maven-gpg-plugin:1.5:sign (default) @ woden-ant ---
[INFO] 
[INFO] --- maven-install-plugin:2.5.2:install (default-install) @ woden-ant ---
[INFO] Installing <https://builds.apache.org/job/woden-trunk/ws/woden/woden-ant/target/woden-ant-1.0M11-SNAPSHOT.jar>
to <https://builds.apache.org/job/woden-trunk/ws/.repository/org/apache/woden/woden-ant/1.0M11-SNAPSHOT/woden-ant-1.0M11-SNAPSHOT.jar>
[INFO] Installing <https://builds.apache.org/job/woden-trunk/ws/woden/woden-ant/pom.xml>
to <https://builds.apache.org/job/woden-trunk/ws/.repository/org/apache/woden/woden-ant/1.0M11-SNAPSHOT/woden-ant-1.0M11-SNAPSHOT.pom>
[INFO] Installing <https://builds.apache.org/job/woden-trunk/ws/woden/woden-ant/target/woden-ant-1.0M11-SNAPSHOT-sources.jar>
to <https://builds.apache.org/job/woden-trunk/ws/.repository/org/apache/woden/woden-ant/1.0M11-SNAPSHOT/woden-ant-1.0M11-SNAPSHOT-sources.jar>
[INFO] Installing <https://builds.apache.org/job/woden-trunk/ws/woden/woden-ant/target/woden-ant-1.0M11-SNAPSHOT-javadoc.jar>
to <https://builds.apache.org/job/woden-trunk/ws/.repository/org/apache/woden/woden-ant/1.0M11-SNAPSHOT/woden-ant-1.0M11-SNAPSHOT-javadoc.jar>
[INFO] 
[INFO] --- maven-deploy-plugin:2.8.2:deploy (default-deploy) @ woden-ant ---
Downloading: https://repository.apache.org/content/repositories/snapshots/org/apache/woden/woden-ant/1.0M11-SNAPSHOT/maven-metadata.xml
Uploading: https://repository.apache.org/content/repositories/snapshots/org/apache/woden/woden-ant/1.0M11-SNAPSHOT/woden-ant-1.0M11-20150906.104403-1.jar
Uploaded: https://repository.apache.org/content/repositories/snapshots/org/apache/woden/woden-ant/1.0M11-SNAPSHOT/woden-ant-1.0M11-20150906.104403-1.jar
(56 KB at 382.9 KB/sec)
Uploading: https://repository.apache.org/content/repositories/snapshots/org/apache/woden/woden-ant/1.0M11-SNAPSHOT/woden-ant-1.0M11-20150906.104403-1.pom
Uploaded: https://repository.apache.org/content/repositories/snapshots/org/apache/woden/woden-ant/1.0M11-SNAPSHOT/woden-ant-1.0M11-20150906.104403-1.pom
(3 KB at 23.1 KB/sec)
Downloading: https://repository.apache.org/content/repositories/snapshots/org/apache/woden/woden-ant/maven-metadata.xml
Downloaded: https://repository.apache.org/content/repositories/snapshots/org/apache/woden/woden-ant/maven-metadata.xml
(382 B at 3.9 KB/sec)
Uploading: https://repository.apache.org/content/repositories/snapshots/org/apache/woden/woden-ant/1.0M11-SNAPSHOT/maven-metadata.xml
Uploaded: https://repository.apache.org/content/repositories/snapshots/org/apache/woden/woden-ant/1.0M11-SNAPSHOT/maven-metadata.xml
(778 B at 6.2 KB/sec)
Uploading: https://repository.apache.org/content/repositories/snapshots/org/apache/woden/woden-ant/maven-metadata.xml
Uploaded: https://repository.apache.org/content/repositories/snapshots/org/apache/woden/woden-ant/maven-metadata.xml
(423 B at 3.4 KB/sec)
Uploading: https://repository.apache.org/content/repositories/snapshots/org/apache/woden/woden-ant/1.0M11-SNAPSHOT/woden-ant-1.0M11-20150906.104403-1-sources.jar
Uploaded: https://repository.apache.org/content/repositories/snapshots/org/apache/woden/woden-ant/1.0M11-SNAPSHOT/woden-ant-1.0M11-20150906.104403-1-sources.jar
(31 KB at 209.3 KB/sec)
Uploading: https://repository.apache.org/content/repositories/snapshots/org/apache/woden/woden-ant/1.0M11-SNAPSHOT/maven-metadata.xml
Uploaded: https://repository.apache.org/content/repositories/snapshots/org/apache/woden/woden-ant/1.0M11-SNAPSHOT/maven-metadata.xml
(993 B at 6.6 KB/sec)
Uploading: https://repository.apache.org/content/repositories/snapshots/org/apache/woden/woden-ant/1.0M11-SNAPSHOT/woden-ant-1.0M11-20150906.104403-1-javadoc.jar
Uploaded: https://repository.apache.org/content/repositories/snapshots/org/apache/woden/woden-ant/1.0M11-SNAPSHOT/woden-ant-1.0M11-20150906.104403-1-javadoc.jar
(107 KB at 654.0 KB/sec)
Uploading: https://repository.apache.org/content/repositories/snapshots/org/apache/woden/woden-ant/1.0M11-SNAPSHOT/maven-metadata.xml
Uploaded: https://repository.apache.org/content/repositories/snapshots/org/apache/woden/woden-ant/1.0M11-SNAPSHOT/maven-metadata.xml
(2 KB at 9.7 KB/sec)
[INFO]                                                                         
[INFO] ------------------------------------------------------------------------
[INFO] Building Woden - dist 1.0M11-SNAPSHOT
[INFO] ------------------------------------------------------------------------
Downloading: http://repo.maven.apache.org/maven2/org/codehaus/gmavenplus/gmavenplus-plugin/1.5/gmavenplus-plugin-1.5.pom
Downloaded: http://repo.maven.apache.org/maven2/org/codehaus/gmavenplus/gmavenplus-plugin/1.5/gmavenplus-plugin-1.5.pom
(21 KB at 84.2 KB/sec)
Downloading: http://repo.maven.apache.org/maven2/org/codehaus/gmavenplus/gmavenplus-plugin/1.5/gmavenplus-plugin-1.5.jar
Downloaded: http://repo.maven.apache.org/maven2/org/codehaus/gmavenplus/gmavenplus-plugin/1.5/gmavenplus-plugin-1.5.jar
(88 KB at 913.5 KB/sec)
[INFO] 
[INFO] --- maven-clean-plugin:2.5:clean (default-clean) @ woden-dist ---
[INFO] 
[INFO] --- maven-remote-resources-plugin:1.5:process (default) @ woden-dist ---
[INFO] 
[INFO] --- gmavenplus-plugin:1.5:execute (generate-release-note) @ woden-dist ---
Downloading: http://repo.maven.apache.org/maven2/org/codehaus/groovy/groovy-all/2.4.4/groovy-all-2.4.4.pom
Downloaded: http://repo.maven.apache.org/maven2/org/codehaus/groovy/groovy-all/2.4.4/groovy-all-2.4.4.pom
(20 KB at 383.6 KB/sec)
Downloading: http://repo.maven.apache.org/maven2/org/apache/maven/shared/file-management/1.2.1/file-management-1.2.1.pom
Downloaded: http://repo.maven.apache.org/maven2/org/apache/maven/shared/file-management/1.2.1/file-management-1.2.1.pom
(4 KB at 74.3 KB/sec)
Downloading: http://repo.maven.apache.org/maven2/org/apache/maven/shared/maven-shared-components/10/maven-shared-components-10.pom
Downloaded: http://repo.maven.apache.org/maven2/org/apache/maven/shared/maven-shared-components/10/maven-shared-components-10.pom
(9 KB at 161.5 KB/sec)
Downloading: http://repo.maven.apache.org/maven2/org/apache/maven/maven-parent/9/maven-parent-9.pom
Downloaded: http://repo.maven.apache.org/maven2/org/apache/maven/maven-parent/9/maven-parent-9.pom
(33 KB at 628.8 KB/sec)
Downloading: http://repo.maven.apache.org/maven2/org/codehaus/plexus/plexus-container-default/1.6/plexus-container-default-1.6.pom
Downloaded: http://repo.maven.apache.org/maven2/org/codehaus/plexus/plexus-container-default/1.6/plexus-container-default-1.6.pom
(3 KB at 50.0 KB/sec)
Downloading: http://repo.maven.apache.org/maven2/org/codehaus/plexus/plexus-containers/1.6/plexus-containers-1.6.pom
Downloaded: http://repo.maven.apache.org/maven2/org/codehaus/plexus/plexus-containers/1.6/plexus-containers-1.6.pom
(4 KB at 70.7 KB/sec)
Downloading: http://repo.maven.apache.org/maven2/org/codehaus/plexus/plexus/3.3.2/plexus-3.3.2.pom
Downloaded: http://repo.maven.apache.org/maven2/org/codehaus/plexus/plexus/3.3.2/plexus-3.3.2.pom
(22 KB at 396.7 KB/sec)
Downloading: http://repo.maven.apache.org/maven2/org/codehaus/plexus/plexus-classworlds/2.5.1/plexus-classworlds-2.5.1.pom
Downloaded: http://repo.maven.apache.org/maven2/org/codehaus/plexus/plexus-classworlds/2.5.1/plexus-classworlds-2.5.1.pom
(5 KB at 94.1 KB/sec)
Downloading: http://repo.maven.apache.org/maven2/org/apache/xbean/xbean-reflect/3.7/xbean-reflect-3.7.pom
Downloaded: http://repo.maven.apache.org/maven2/org/apache/xbean/xbean-reflect/3.7/xbean-reflect-3.7.pom
(5 KB at 97.5 KB/sec)
Downloading: http://repo.maven.apache.org/maven2/org/apache/xbean/xbean/3.7/xbean-3.7.pom
Downloaded: http://repo.maven.apache.org/maven2/org/apache/xbean/xbean/3.7/xbean-3.7.pom (16
KB at 295.6 KB/sec)
Downloading: http://repo.maven.apache.org/maven2/org/apache/geronimo/genesis/genesis-java5-flava/2.0/genesis-java5-flava-2.0.pom
Downloaded: http://repo.maven.apache.org/maven2/org/apache/geronimo/genesis/genesis-java5-flava/2.0/genesis-java5-flava-2.0.pom
(6 KB at 105.0 KB/sec)
Downloading: http://repo.maven.apache.org/maven2/org/apache/geronimo/genesis/genesis-default-flava/2.0/genesis-default-flava-2.0.pom
Downloaded: http://repo.maven.apache.org/maven2/org/apache/geronimo/genesis/genesis-default-flava/2.0/genesis-default-flava-2.0.pom
(18 KB at 347.9 KB/sec)
Downloading: http://repo.maven.apache.org/maven2/org/apache/geronimo/genesis/genesis/2.0/genesis-2.0.pom
Downloaded: http://repo.maven.apache.org/maven2/org/apache/geronimo/genesis/genesis/2.0/genesis-2.0.pom
(18 KB at 352.7 KB/sec)
Downloading: http://repo.maven.apache.org/maven2/org/codehaus/plexus/plexus-classworlds/2.5.2/plexus-classworlds-2.5.2.pom
Downloaded: http://repo.maven.apache.org/maven2/org/codehaus/plexus/plexus-classworlds/2.5.2/plexus-classworlds-2.5.2.pom
(8 KB at 139.9 KB/sec)
Downloading: http://repo.maven.apache.org/maven2/org/fusesource/jansi/jansi/1.11/jansi-1.11.pom
Downloaded: http://repo.maven.apache.org/maven2/org/fusesource/jansi/jansi/1.11/jansi-1.11.pom
(4 KB at 69.0 KB/sec)
Downloading: http://repo.maven.apache.org/maven2/org/fusesource/jansi/jansi-project/1.11/jansi-project-1.11.pom
Downloaded: http://repo.maven.apache.org/maven2/org/fusesource/jansi/jansi-project/1.11/jansi-project-1.11.pom
(12 KB at 223.6 KB/sec)
Downloading: http://repo.maven.apache.org/maven2/org/fusesource/fusesource-pom/1.8/fusesource-pom-1.8.pom
Downloaded: http://repo.maven.apache.org/maven2/org/fusesource/fusesource-pom/1.8/fusesource-pom-1.8.pom
(15 KB at 270.0 KB/sec)
Downloading: http://repo.maven.apache.org/maven2/jline/jline/2.12.1/jline-2.12.1.pom
Downloaded: http://repo.maven.apache.org/maven2/jline/jline/2.12.1/jline-2.12.1.pom (17 KB
at 318.2 KB/sec)
Downloading: http://repo.maven.apache.org/maven2/org/apache/ant/ant/1.9.4/ant-1.9.4.pom
Downloaded: http://repo.maven.apache.org/maven2/org/apache/ant/ant/1.9.4/ant-1.9.4.pom (10
KB at 184.3 KB/sec)
Downloading: http://repo.maven.apache.org/maven2/org/apache/ant/ant-parent/1.9.4/ant-parent-1.9.4.pom
Downloaded: http://repo.maven.apache.org/maven2/org/apache/ant/ant-parent/1.9.4/ant-parent-1.9.4.pom
(6 KB at 109.4 KB/sec)
Downloading: http://repo.maven.apache.org/maven2/org/apache/ant/ant-launcher/1.9.4/ant-launcher-1.9.4.pom
Downloaded: http://repo.maven.apache.org/maven2/org/apache/ant/ant-launcher/1.9.4/ant-launcher-1.9.4.pom
(3 KB at 43.9 KB/sec)
Downloading: http://repo.maven.apache.org/maven2/org/apache/ivy/ivy/2.4.0/ivy-2.4.0.pom
Downloaded: http://repo.maven.apache.org/maven2/org/apache/ivy/ivy/2.4.0/ivy-2.4.0.pom (7
KB at 120.3 KB/sec)
Downloading: http://repo.maven.apache.org/maven2/org/codehaus/groovy/groovy-all/2.4.4/groovy-all-2.4.4.jar
Downloading: http://repo.maven.apache.org/maven2/org/apache/maven/shared/file-management/1.2.1/file-management-1.2.1.jar
Downloading: http://repo.maven.apache.org/maven2/org/fusesource/jansi/jansi/1.11/jansi-1.11.jar
Downloading: http://repo.maven.apache.org/maven2/org/apache/xbean/xbean-reflect/3.7/xbean-reflect-3.7.jar
Downloading: http://repo.maven.apache.org/maven2/jline/jline/2.12.1/jline-2.12.1.jar
Downloaded: http://repo.maven.apache.org/maven2/org/apache/maven/shared/file-management/1.2.1/file-management-1.2.1.jar
(37 KB at 311.0 KB/sec)
Downloading: http://repo.maven.apache.org/maven2/org/apache/ant/ant/1.9.4/ant-1.9.4.jar
Downloaded: http://repo.maven.apache.org/maven2/org/fusesource/jansi/jansi/1.11/jansi-1.11.jar
(112 KB at 792.4 KB/sec)
Downloading: http://repo.maven.apache.org/maven2/org/apache/ant/ant-launcher/1.9.4/ant-launcher-1.9.4.jar
Downloaded: http://repo.maven.apache.org/maven2/org/apache/xbean/xbean-reflect/3.7/xbean-reflect-3.7.jar
(145 KB at 1011.4 KB/sec)
Downloading: http://repo.maven.apache.org/maven2/org/apache/ivy/ivy/2.4.0/ivy-2.4.0.jar
Downloaded: http://repo.maven.apache.org/maven2/jline/jline/2.12.1/jline-2.12.1.jar (209 KB
at 1236.1 KB/sec)
Downloaded: http://repo.maven.apache.org/maven2/org/apache/ant/ant-launcher/1.9.4/ant-launcher-1.9.4.jar
(18 KB at 332.4 KB/sec)
Downloaded: http://repo.maven.apache.org/maven2/org/codehaus/groovy/groovy-all/2.4.4/groovy-all-2.4.4.jar
(6835 KB at 23814.3 KB/sec)
Downloaded: http://repo.maven.apache.org/maven2/org/apache/ivy/ivy/2.4.0/ivy-2.4.0.jar (1253
KB at 8132.3 KB/sec)
Downloaded: http://repo.maven.apache.org/maven2/org/apache/ant/ant/1.9.4/ant-1.9.4.jar (1972
KB at 3874.2 KB/sec)
[INFO] Using Groovy 2.4.4 to perform execute.
[INFO] ------------------------------------------------------------------------
[INFO] Reactor Summary:
[INFO] 
[INFO] Woden ............................................. SUCCESS [5.764s]
[INFO] Woden - Core ...................................... SUCCESS [21.781s]
[INFO] Woden - Tests ..................................... SUCCESS [9.246s]
[INFO] Woden - Tool ...................................... SUCCESS [4.142s]
[INFO] Woden - converter Maven plugin .................... SUCCESS [4.375s]
[INFO] Woden - Ant ....................................... SUCCESS [4.192s]
[INFO] Woden - dist ...................................... FAILURE [3.385s]
[INFO] Woden - W3C tests ................................. SKIPPED
[INFO] ------------------------------------------------------------------------
[INFO] BUILD FAILURE
[INFO] ------------------------------------------------------------------------
[INFO] Total time: 59.887s
[INFO] Finished at: Sun Sep 06 10:44:08 UTC 2015
[INFO] Final Memory: 49M/417M
[INFO] ------------------------------------------------------------------------
Waiting for Jenkins to finish collecting data[ERROR] Failed to execute goal org.codehaus.gmavenplus:gmavenplus-plugin:1.5:execute
(generate-release-note) on project woden-dist: Error occurred while calling a method on a
Groovy class from classpath. InvocationTargetException: <https://builds.apache.org/job/woden-trunk/ws/woden/woden-dist/../src/site/markdown/release-notes/1.0M11.md>
(No such file or directory) -> [Help 1]
[ERROR] 
[ERROR] To see the full stack trace of the errors, re-run Maven with the -e switch.
[ERROR] Re-run Maven using the -X switch to enable full debug logging.
[ERROR] 
[ERROR] For more information about the errors and possible solutions, please read the following
articles:
[ERROR] [Help 1] http://cwiki.apache.org/confluence/display/MAVEN/MojoExecutionException
[ERROR] 
[ERROR] After correcting the problems, you can resume the build with the command
[ERROR]   mvn <goals> -rf :woden-dist

[JENKINS] Archiving <https://builds.apache.org/job/woden-trunk/ws/woden/woden-dist/pom.xml>
to org.apache.woden/woden-dist/1.0M11-SNAPSHOT/woden-dist-1.0M11-SNAPSHOT.pom
Sending artifact delta relative to woden-trunk » Woden - dist #1223
Archived 1 artifacts
Archive block size is 32768
Received 0 blocks and 7960 bytes
Compression is 0.0%
Took 84 ms
[JENKINS] Archiving <https://builds.apache.org/job/woden-trunk/ws/woden/woden-converter-maven-plugin/pom.xml>
to org.apache.woden/woden-converter-maven-plugin/1.0M11-SNAPSHOT/woden-converter-maven-plugin-1.0M11-SNAPSHOT.pom
[JENKINS] Archiving <https://builds.apache.org/job/woden-trunk/ws/woden/woden-converter-maven-plugin/target/woden-converter-maven-plugin-1.0M11-SNAPSHOT.jar>
to org.apache.woden/woden-converter-maven-plugin/1.0M11-20150906.104358-1/woden-converter-maven-plugin-1.0M11-20150906.104358-1.jar
[JENKINS] Archiving <https://builds.apache.org/job/woden-trunk/ws/woden/woden-converter-maven-plugin/target/woden-converter-maven-plugin-1.0M11-SNAPSHOT-sources.jar>
to org.apache.woden/woden-converter-maven-plugin/1.0M11-20150906.104358-1/woden-converter-maven-plugin-1.0M11-20150906.104358-1-sources.jar
[JENKINS] Archiving <https://builds.apache.org/job/woden-trunk/ws/woden/woden-converter-maven-plugin/target/woden-converter-maven-plugin-1.0M11-SNAPSHOT-javadoc.jar>
to org.apache.woden/woden-converter-maven-plugin/1.0M11-20150906.104358-1/woden-converter-maven-plugin-1.0M11-20150906.104358-1-javadoc.jar
Sending artifact delta relative to woden-trunk » Woden - converter Maven plugin #1223
Archived 4 artifacts
Archive block size is 32768
Received 0 blocks and 77099 bytes
Compression is 0.0%
Took 48 ms
[JENKINS] Archiving <https://builds.apache.org/job/woden-trunk/ws/woden/woden-ant/pom.xml>
to org.apache.woden/woden-ant/1.0M11-SNAPSHOT/woden-ant-1.0M11-SNAPSHOT.pom
[JENKINS] Archiving <https://builds.apache.org/job/woden-trunk/ws/woden/woden-ant/target/woden-ant-1.0M11-SNAPSHOT.jar>
to org.apache.woden/woden-ant/1.0M11-20150906.104403-1/woden-ant-1.0M11-20150906.104403-1.jar
[JENKINS] Archiving <https://builds.apache.org/job/woden-trunk/ws/woden/woden-ant/target/woden-ant-1.0M11-SNAPSHOT-sources.jar>
to org.apache.woden/woden-ant/1.0M11-20150906.104403-1/woden-ant-1.0M11-20150906.104403-1-sources.jar
[JENKINS] Archiving <https://builds.apache.org/job/woden-trunk/ws/woden/woden-ant/target/woden-ant-1.0M11-SNAPSHOT-javadoc.jar>
to org.apache.woden/woden-ant/1.0M11-20150906.104403-1/woden-ant-1.0M11-20150906.104403-1-javadoc.jar
Sending artifact delta relative to woden-trunk » Woden - Ant #1223
Archived 4 artifacts
Archive block size is 32768
Received 0 blocks and 200446 bytes
Compression is 0.0%
Took 75 ms
[JENKINS] Archiving <https://builds.apache.org/job/woden-trunk/ws/woden/w3c-tests/pom.xml>
to org.apache.woden/w3c-tests/1.0M11-SNAPSHOT/w3c-tests-1.0M11-SNAPSHOT.pom
Sending artifact delta relative to woden-trunk » Woden - W3C tests #1223
Archived 1 artifacts
Archive block size is 32768
Received 0 blocks and 4257 bytes
Compression is 0.0%
Took 24 ms
[JENKINS] Archiving <https://builds.apache.org/job/woden-trunk/ws/woden/woden-tool/pom.xml>
to org.apache.woden/woden-tool/1.0M11-SNAPSHOT/woden-tool-1.0M11-SNAPSHOT.pom
[JENKINS] Archiving <https://builds.apache.org/job/woden-trunk/ws/woden/woden-tool/target/woden-tool-1.0M11-SNAPSHOT.jar>
to org.apache.woden/woden-tool/1.0M11-20150906.104353-1/woden-tool-1.0M11-20150906.104353-1.jar
[JENKINS] Archiving <https://builds.apache.org/job/woden-trunk/ws/woden/woden-tool/target/woden-tool-1.0M11-SNAPSHOT-sources.jar>
to org.apache.woden/woden-tool/1.0M11-20150906.104353-1/woden-tool-1.0M11-20150906.104353-1-sources.jar
[JENKINS] Archiving <https://builds.apache.org/job/woden-trunk/ws/woden/woden-tool/target/woden-tool-1.0M11-SNAPSHOT-javadoc.jar>
to org.apache.woden/woden-tool/1.0M11-20150906.104353-1/woden-tool-1.0M11-20150906.104353-1-javadoc.jar
Sending artifact delta relative to woden-trunk » Woden - Tool #1223
Archived 4 artifacts
Archive block size is 32768
Received 0 blocks and 106782 bytes
Compression is 0.0%
Took 56 ms
[JENKINS] Archiving <https://builds.apache.org/job/woden-trunk/ws/woden/woden-core/pom.xml>
to org.apache.woden/woden-core/1.0M11-SNAPSHOT/woden-core-1.0M11-SNAPSHOT.pom
[JENKINS] Archiving <https://builds.apache.org/job/woden-trunk/ws/woden/woden-core/target/woden-core-1.0M11-SNAPSHOT.jar>
to org.apache.woden/woden-core/1.0M11-20150906.104336-1/woden-core-1.0M11-20150906.104336-1.jar
[JENKINS] Archiving <https://builds.apache.org/job/woden-trunk/ws/woden/woden-core/target/woden-core-1.0M11-SNAPSHOT-sources.jar>
to org.apache.woden/woden-core/1.0M11-20150906.104336-1/woden-core-1.0M11-20150906.104336-1-sources.jar
[JENKINS] Archiving <https://builds.apache.org/job/woden-trunk/ws/woden/woden-core/target/woden-core-1.0M11-SNAPSHOT-javadoc.jar>
to org.apache.woden/woden-core/1.0M11-20150906.104336-1/woden-core-1.0M11-20150906.104336-1-javadoc.jar
Sending artifact delta relative to woden-trunk » Woden - Core #1223
Archived 4 artifacts
Archive block size is 32768
Received 0 blocks and 2531236 bytes
Compression is 0.0%
Took 0.72 sec
[JENKINS] Archiving <https://builds.apache.org/job/woden-trunk/ws/woden/pom.xml> to
org.apache.woden/woden/1.0M11-SNAPSHOT/woden-1.0M11-SNAPSHOT.pom
[JENKINS] Archiving <https://builds.apache.org/job/woden-trunk/ws/woden/target/woden-1.0M11-SNAPSHOT-site.xml>
to org.apache.woden/woden/1.0M11-20150906.104314-1/woden-1.0M11-20150906.104314-1-site.xml
Sending artifact delta relative to woden-trunk » Woden #1223
Archived 2 artifacts
Archive block size is 32768
Received 0 blocks and 13899 bytes
Compression is 0.0%
Took 27 ms
[JENKINS] Archiving <https://builds.apache.org/job/woden-trunk/ws/woden/woden-tests/pom.xml>
to org.apache.woden/woden-tests/1.0M11-SNAPSHOT/woden-tests-1.0M11-SNAPSHOT.pom
[JENKINS] Archiving <https://builds.apache.org/job/woden-trunk/ws/woden/woden-tests/target/dom/woden-tests-1.0M11-SNAPSHOT.jar>
to org.apache.woden/woden-tests/1.0M11-SNAPSHOT/woden-tests-1.0M11-SNAPSHOT.jar
[JENKINS] Archiving <https://builds.apache.org/job/woden-trunk/ws/woden/woden-tests/target/dom/woden-tests-1.0M11-SNAPSHOT-sources.jar>
to org.apache.woden/woden-tests/1.0M11-SNAPSHOT/woden-tests-1.0M11-SNAPSHOT-sources.jar
Sending artifact delta relative to woden-trunk » Woden - Tests #1223
Archived 3 artifacts
Archive block size is 32768
Received 0 blocks and 16416 bytes
Compression is 0.0%
Took 28 ms
channel stopped

---------------------------------------------------------------------
To unsubscribe, e-mail: dev-unsubscribe@ws.apache.org
For additional commands, e-mail: dev-help@ws.apache.org


Mime
View raw message