ws-dev mailing list archives

Site index · List index
Message view « Date » · « Thread »
Top « Date » · « Thread »
From Apache Jenkins Server <jenk...@builds.apache.org>
Subject Build failed in Jenkins: xmlschema-trunk #191
Date Fri, 12 Jun 2015 18:41:04 GMT
See <https://builds.apache.org/job/xmlschema-trunk/191/changes>

Changes:

[dkulp] Bug fix for XmlSchemaScope: support user-defined types for complex types.
Patch from mikepigott applied
This closes #2

------------------------------------------
Started by an SCM change
Building remotely on ubuntu-1 (docker Ubuntu ubuntu ubuntu1) in workspace <https://builds.apache.org/job/xmlschema-trunk/ws/>
Updating https://svn.apache.org/repos/asf/webservices/xmlschema/trunk at revision '2015-06-12T18:40:17.286
+0000'
U         xmlschema-walker/src/main/java/org/apache/ws/commons/schema/walker/XmlSchemaScope.java
At revision 1685144
Parsing POMs
maven3-agent.jar already up to date
maven3-interceptor.jar already up to date
maven3-interceptor-commons.jar already up to date
[xmlschema-trunk] $ /home/jenkins/tools/java/latest1.6/bin/java -Xmx2g -Xms256m -XX:MaxPermSize=512m
-cp /home/jenkins/jenkins-slave/maven3-agent.jar:/home/jenkins/tools/maven/apache-maven-3.0.4/boot/plexus-classworlds-2.4.jar
org.jvnet.hudson.maven3.agent.Maven3Main /home/jenkins/tools/maven/apache-maven-3.0.4 /home/jenkins/jenkins-slave/slave.jar
/home/jenkins/jenkins-slave/maven3-interceptor.jar /home/jenkins/jenkins-slave/maven3-interceptor-commons.jar
46435
<===[JENKINS REMOTING CAPACITY]===>   channel started
Executing Maven:  -B -f <https://builds.apache.org/job/xmlschema-trunk/ws/pom.xml> -Dmaven.repo.local=<https://builds.apache.org/job/xmlschema-trunk/ws/.repository>
deploy -Papache-release -Dgpg.skip=true
[INFO] Scanning for projects...
[INFO] ------------------------------------------------------------------------
[INFO] Reactor Build Order:
[INFO] 
[INFO] XmlSchema
[INFO] XmlSchema Core
[INFO] xmlschema-walker
[INFO] XmlSchema OSGi bundle test
[INFO] XmlSchema W3C tests
[INFO]                                                                         
[INFO] ------------------------------------------------------------------------
[INFO] Building XmlSchema 2.2.2-SNAPSHOT
[INFO] ------------------------------------------------------------------------
[INFO] 
[INFO] --- maven-checkstyle-plugin:2.12.1:checkstyle (validate) @ xmlschema ---
[INFO] Starting audit...
Audit done.

[INFO] 
[INFO] --- maven-pmd-plugin:2.5:pmd (pmd) @ xmlschema ---
[INFO] 
[INFO] --- maven-pmd-plugin:2.5:check (validate) @ xmlschema ---
[INFO] 
[INFO] --- maven-remote-resources-plugin:1.5:process (default) @ xmlschema ---
[INFO] 
[INFO] --- maven-assembly-plugin:2.4.1:single (source-release-assembly) @ xmlschema ---
[INFO] Building zip: <https://builds.apache.org/job/xmlschema-trunk/ws/target/xmlschema-2.2.2-SNAPSHOT-source-release.zip>
[INFO] 
[INFO] --- maven-checkstyle-plugin:2.12.1:checkstyle (validate) @ xmlschema ---
[INFO] Starting audit...
Audit done.

[INFO] 
[INFO] --- maven-pmd-plugin:2.5:pmd (pmd) @ xmlschema ---
[INFO] 
[INFO] --- maven-pmd-plugin:2.5:check (validate) @ xmlschema ---
[WARNING] Failed to getClass for org.apache.maven.plugin.source.SourceJarMojo
[INFO] 
[INFO] --- maven-source-plugin:2.2.1:jar (default) @ xmlschema ---
[INFO] 
[INFO] --- maven-checkstyle-plugin:2.12.1:checkstyle (validate) @ xmlschema ---
[INFO] Starting audit...
Audit done.

[INFO] 
[INFO] --- maven-pmd-plugin:2.5:pmd (pmd) @ xmlschema ---
[INFO] 
[INFO] --- maven-pmd-plugin:2.5:check (validate) @ xmlschema ---
[WARNING] Failed to getClass for org.apache.maven.plugin.source.SourceJarMojo
[INFO] 
[INFO] --- maven-source-plugin:2.2.1:jar (attach-sources) @ xmlschema ---
[INFO] 
[INFO] --- maven-javadoc-plugin:2.9.1:jar (attach-javadocs) @ xmlschema ---
[INFO] Not executing Javadoc as the project is not a Java classpath-capable package
[INFO] 
[INFO] --- maven-site-plugin:3.4:attach-descriptor (attach-descriptor) @ xmlschema ---
[INFO] 
[INFO] --- maven-gpg-plugin:1.4:sign (default) @ xmlschema ---
[INFO] 
[INFO] --- maven-install-plugin:2.5.1:install (default-install) @ xmlschema ---
[INFO] Installing <https://builds.apache.org/job/xmlschema-trunk/ws/pom.xml> to <https://builds.apache.org/job/xmlschema-trunk/ws/.repository/org/apache/ws/xmlschema/xmlschema/2.2.2-SNAPSHOT/xmlschema-2.2.2-SNAPSHOT.pom>
[INFO] Installing <https://builds.apache.org/job/xmlschema-trunk/ws/target/xmlschema-2.2.2-SNAPSHOT-source-release.zip>
to <https://builds.apache.org/job/xmlschema-trunk/ws/.repository/org/apache/ws/xmlschema/xmlschema/2.2.2-SNAPSHOT/xmlschema-2.2.2-SNAPSHOT-source-release.zip>
[INFO] Installing <https://builds.apache.org/job/xmlschema-trunk/ws/target/xmlschema-2.2.2-SNAPSHOT-site.xml>
to <https://builds.apache.org/job/xmlschema-trunk/ws/.repository/org/apache/ws/xmlschema/xmlschema/2.2.2-SNAPSHOT/xmlschema-2.2.2-SNAPSHOT-site.xml>
[INFO] 
[INFO] --- maven-deploy-plugin:2.8.1:deploy (default-deploy) @ xmlschema ---
Downloading: https://repository.apache.org/content/repositories/snapshots/org/apache/ws/xmlschema/xmlschema/2.2.2-SNAPSHOT/maven-metadata.xml
[WARNING] Could not transfer metadata org.apache.ws.xmlschema:xmlschema:2.2.2-SNAPSHOT/maven-metadata.xml
from/to apache.snapshots.https (https://repository.apache.org/content/repositories/snapshots):
java.lang.RuntimeException: Could not generate DH keypair
[JENKINS] Archiving disabled
[INFO] ------------------------------------------------------------------------
[INFO] Reactor Summary:
[INFO] 
[INFO] XmlSchema ......................................... FAILURE [25.503s]
[INFO] XmlSchema Core .................................... SKIPPED
[INFO] xmlschema-walker .................................. SKIPPED
[INFO] XmlSchema OSGi bundle test ........................ SKIPPED
[INFO] XmlSchema W3C tests ............................... SKIPPED
[INFO] ------------------------------------------------------------------------
[INFO] BUILD FAILURE
[INFO] ------------------------------------------------------------------------
[INFO] Total time: 28.946s
[INFO] Finished at: Fri Jun 12 18:41:01 UTC 2015
[INFO] Final Memory: 29M/376M
[INFO] ------------------------------------------------------------------------
[JENKINS] Archiving disabled
[JENKINS] Archiving disabled
[JENKINS] Archiving disabled
[JENKINS] Archiving disabled
[JENKINS] Archiving disabled
Waiting for Jenkins to finish collecting data
[ERROR] Failed to execute goal org.apache.maven.plugins:maven-deploy-plugin:2.8.1:deploy (default-deploy)
on project xmlschema: Failed to retrieve remote metadata org.apache.ws.xmlschema:xmlschema:2.2.2-SNAPSHOT/maven-metadata.xml:
Could not transfer metadata org.apache.ws.xmlschema:xmlschema:2.2.2-SNAPSHOT/maven-metadata.xml
from/to apache.snapshots.https (https://repository.apache.org/content/repositories/snapshots):
java.lang.RuntimeException: Could not generate DH keypair: Prime size must be multiple of
64, and can only range from 512 to 1024 (inclusive) -> [Help 1]
[ERROR] 
[ERROR] To see the full stack trace of the errors, re-run Maven with the -e switch.
[ERROR] Re-run Maven using the -X switch to enable full debug logging.
[ERROR] 
[ERROR] For more information about the errors and possible solutions, please read the following
articles:
[ERROR] [Help 1] http://cwiki.apache.org/confluence/display/MAVEN/MojoExecutionException
Sending e-mails to: dev@ws.apache.org
channel stopped

---------------------------------------------------------------------
To unsubscribe, e-mail: dev-unsubscribe@ws.apache.org
For additional commands, e-mail: dev-help@ws.apache.org


Mime
View raw message