ws-dev mailing list archives

Site index · List index
Message view « Date » · « Thread »
Top « Date » · « Thread »
From Apache Jenkins Server <jenk...@builds.apache.org>
Subject Build failed in Jenkins: ws-axiom-trunk #1509
Date Fri, 10 May 2013 18:01:12 GMT
See <https://builds.apache.org/job/ws-axiom-trunk/1509/>

------------------------------------------
[...truncated 1145 lines...]
[INFO] Configured Artifact: org.codehaus.woodstox:woodstox-core-asl:4.0.11:jar
[INFO] Configured Artifact: org.codehaus.woodstox:woodstox-core-asl:4.1.0:jar
[INFO] Configured Artifact: org.codehaus.woodstox:woodstox-core-asl:4.1.2:jar
[INFO] Configured Artifact: org.codehaus.woodstox:woodstox-core-asl:4.1.3:jar
[INFO] Configured Artifact: org.codehaus.woodstox:woodstox-core-asl:4.1.4:jar
[INFO] Configured Artifact: org.codehaus.woodstox:woodstox-core-asl:4.2.0:jar
[INFO] Configured Artifact: com.sun.xml.stream:sjsxp:1.0.1:jar
[INFO] Configured Artifact: stax:stax:1.2.0:jar
[INFO] Copying wstx-asl-3.2.7.jar to <https://builds.apache.org/job/ws-axiom-trunk/ws/axiom/modules/axiom-api/target/parsers/wstx-asl-3.2.7.jar>
[INFO] Copying wstx-asl-3.2.8.jar to <https://builds.apache.org/job/ws-axiom-trunk/ws/axiom/modules/axiom-api/target/parsers/wstx-asl-3.2.8.jar>
[INFO] Copying wstx-asl-3.2.9.jar to <https://builds.apache.org/job/ws-axiom-trunk/ws/axiom/modules/axiom-api/target/parsers/wstx-asl-3.2.9.jar>
[INFO] Copying woodstox-core-asl-4.0.8.jar to <https://builds.apache.org/job/ws-axiom-trunk/ws/axiom/modules/axiom-api/target/parsers/woodstox-core-asl-4.0.8.jar>
[INFO] Copying woodstox-core-asl-4.0.11.jar to <https://builds.apache.org/job/ws-axiom-trunk/ws/axiom/modules/axiom-api/target/parsers/woodstox-core-asl-4.0.11.jar>
[INFO] Copying woodstox-core-asl-4.1.0.jar to <https://builds.apache.org/job/ws-axiom-trunk/ws/axiom/modules/axiom-api/target/parsers/woodstox-core-asl-4.1.0.jar>
[INFO] Copying woodstox-core-asl-4.1.2.jar to <https://builds.apache.org/job/ws-axiom-trunk/ws/axiom/modules/axiom-api/target/parsers/woodstox-core-asl-4.1.2.jar>
[INFO] Copying woodstox-core-asl-4.1.3.jar to <https://builds.apache.org/job/ws-axiom-trunk/ws/axiom/modules/axiom-api/target/parsers/woodstox-core-asl-4.1.3.jar>
[INFO] Copying woodstox-core-asl-4.1.4.jar to <https://builds.apache.org/job/ws-axiom-trunk/ws/axiom/modules/axiom-api/target/parsers/woodstox-core-asl-4.1.4.jar>
[INFO] Copying woodstox-core-asl-4.2.0.jar to <https://builds.apache.org/job/ws-axiom-trunk/ws/axiom/modules/axiom-api/target/parsers/woodstox-core-asl-4.2.0.jar>
[INFO] Copying sjsxp-1.0.1.jar to <https://builds.apache.org/job/ws-axiom-trunk/ws/axiom/modules/axiom-api/target/parsers/sjsxp-1.0.1.jar>
[INFO] Copying stax-1.2.0.jar to <https://builds.apache.org/job/ws-axiom-trunk/ws/axiom/modules/axiom-api/target/parsers/stax-1.2.0.jar>
[INFO] [INFO] Using 'UTF-8' encoding to copy filtered resources.

[INFO] --- maven-resources-plugin:2.4.3:testResources (default-testResources) @ axiom-api
---
[INFO] Copying 45 resources
[INFO] Copying 3 resources
[INFO] [INFO] Compiling 100 source files to <https://builds.apache.org/job/ws-axiom-trunk/ws/axiom/modules/axiom-api/target/test-classes>

[INFO] --- maven-compiler-plugin:2.3.2:testCompile (default-testCompile) @ axiom-api ---
[INFO] [INFO] Surefire report directory: <https://builds.apache.org/job/ws-axiom-trunk/ws/axiom/modules/axiom-api/target/surefire-reports>

-------------------------------------------------------
 T E S T S
-------------------------------------------------------

[INFO] --- maven-surefire-plugin:2.10:test (default-test) @ axiom-api ---
Running org.apache.axiom.attachments.utils.BAAInputStreamTest
Tests run: 1, Failures: 0, Errors: 0, Skipped: 0, Time elapsed: 0.054 sec
Running org.apache.axiom.attachments.utils.BAATest
Tests run: 1, Failures: 0, Errors: 0, Skipped: 0, Time elapsed: 0.167 sec
Running org.apache.axiom.attachments.AttachmentCacheMonitorTest
Tests run: 1, Failures: 0, Errors: 0, Skipped: 0, Time elapsed: 45.025 sec
Running org.apache.axiom.attachments.AttachmentsTest
Tests run: 40, Failures: 0, Errors: 0, Skipped: 0, Time elapsed: 121.473 sec
Running org.apache.axiom.attachments.impl.BufferUtilsTest
Tests run: 4, Failures: 0, Errors: 0, Skipped: 0, Time elapsed: 0.145 sec
Running org.apache.axiom.attachments.PdfAttachmentStreamingTest
Tests run: 1, Failures: 0, Errors: 0, Skipped: 0, Time elapsed: 0.001 sec
Running org.apache.axiom.attachments.PartOnFileTest
Tests run: 2, Failures: 0, Errors: 0, Skipped: 0, Time elapsed: 0.001 sec
Running org.apache.axiom.util.activation.DataHandlerWrapperTest
Tests run: 1, Failures: 0, Errors: 0, Skipped: 0, Time elapsed: 0.002 sec
Running org.apache.axiom.util.UIDGeneratorTest
Tests run: 5, Failures: 0, Errors: 0, Skipped: 0, Time elapsed: 1.489 sec
Running org.apache.axiom.util.blob.MemoryBlobTest
Tests run: 9, Failures: 0, Errors: 0, Skipped: 0, Time elapsed: 0.01 sec
Running org.apache.axiom.util.blob.OverflowBlobTest
Tests run: 9, Failures: 0, Errors: 0, Skipped: 0, Time elapsed: 0.01 sec
Running org.apache.axiom.util.namespace.ScopedNamespaceContextTest
Tests run: 5, Failures: 0, Errors: 0, Skipped: 0, Time elapsed: 0.004 sec
Running org.apache.axiom.util.stax.xop.XOPDecodingStreamReaderTest
Tests run: 2, Failures: 0, Errors: 0, Skipped: 0, Time elapsed: 0.426 sec
Running org.apache.axiom.util.stax.xop.XOPEncodingStreamReaderTest
Tests run: 1, Failures: 0, Errors: 0, Skipped: 0, Time elapsed: 0.043 sec
Running org.apache.axiom.util.stax.xop.XOPUtilsTest
Tests run: 2, Failures: 0, Errors: 0, Skipped: 0, Time elapsed: 0.002 sec
Running org.apache.axiom.util.stax.debug.XMLStreamReaderValidatorTest
Tests run: 2, Failures: 0, Errors: 0, Skipped: 0, Time elapsed: 0.005 sec
Running org.apache.axiom.util.stax.XMLFragmentStreamReaderTest
Tests run: 1, Failures: 0, Errors: 0, Skipped: 0, Time elapsed: 0.009 sec
Running org.apache.axiom.util.stax.dialect.DialectTestSuite
May 10, 2013 5:59:09 PM org.apache.axiom.util.blob.OverflowBlob finalize
WARNING: Cleaning up unreleased temporary file <https://builds.apache.org/job/ws-axiom-trunk/ws/axiom/modules/axiom-api/target/tmp/test2809983874702146562.dat>
May 10, 2013 5:59:09 PM org.apache.axiom.util.blob.OverflowBlob finalize
WARNING: Cleaning up unreleased temporary file <https://builds.apache.org/job/ws-axiom-trunk/ws/axiom/modules/axiom-api/target/tmp/test5157708366333616102.dat>
Tests run: 1701, Failures: 0, Errors: 0, Skipped: 0, Time elapsed: 7.982 sec
Running org.apache.axiom.util.stax.XMLStreamReaderUtilsTest
Tests run: 10, Failures: 0, Errors: 0, Skipped: 0, Time elapsed: 0.048 sec
Running org.apache.axiom.soap.DOMCompatibilityTest
Tests run: 14, Failures: 0, Errors: 0, Skipped: 0, Time elapsed: 0.023 sec
Running org.apache.axiom.mime.impl.axiom.MultipartWriterTest
Tests run: 2, Failures: 0, Errors: 0, Skipped: 0, Time elapsed: 0.016 sec
Running org.apache.axiom.om.util.StAXUtilsTest
Tests run: 2, Failures: 0, Errors: 0, Skipped: 0, Time elapsed: 0.015 sec
Running org.apache.axiom.om.util.Base64Test
Tests run: 1, Failures: 0, Errors: 0, Skipped: 0, Time elapsed: 0.005 sec
Running org.apache.axiom.om.util.CommonUtilsTest
Tests run: 1, Failures: 0, Errors: 0, Skipped: 0, Time elapsed: 0 sec
Running org.apache.axiom.om.DOMCompatibilityTest
Tests run: 10, Failures: 0, Errors: 0, Skipped: 0, Time elapsed: 0.004 sec
Running org.apache.axiom.om.impl.serialize.StreamingOMSerializerTest
Tests run: 22, Failures: 0, Errors: 0, Skipped: 0, Time elapsed: 0.387 sec
Running org.apache.axiom.om.OMOutputFormatTest
Tests run: 9, Failures: 0, Errors: 0, Skipped: 0, Time elapsed: 0.002 sec

Results :

Tests run: 1859, Failures: 0, Errors: 0, Skipped: 0

[INFO] ------------------------------------------------------------------------
[INFO] Reactor Summary:
[INFO] 
[INFO] Axiom ............................................. SUCCESS [1:03.382s]
[INFO] Axiom Build Utilities ............................. SUCCESS [14.546s]
[INFO] Axiom Test Utilities .............................. SUCCESS [12.918s]
[INFO] Axiom Jaxen Test Suite ............................ SUCCESS [11.837s]
[INFO] Axiom DOM Test Suite .............................. SUCCESS [25.172s]
[INFO] Axiom API ......................................... FAILURE [3:08.764s]
[INFO] Axiom Implementation Test Suite ................... SKIPPED
[INFO] Axiom Common Implementation Classes ............... SKIPPED
[INFO] Axiom Impl ........................................ SKIPPED
[INFO] Axiom DOM ......................................... SKIPPED
[INFO] Axiom Compatibility Classes ....................... SKIPPED
[INFO] Axiom JAXB Integration ............................ SKIPPED
[INFO] Axiom C14N ........................................ SKIPPED
[INFO] Axiom Test Suite .................................. SKIPPED
[INFO] Axiom Integration Test Suite ...................... SKIPPED
[INFO] Axiom Uber-JAR .................................... SKIPPED
[INFO] Axiom Samples ..................................... SKIPPED
[INFO] System Tests ...................................... SKIPPED
[INFO] JBoss Tests ....................................... SKIPPED
[INFO] Axiom OSGi Tests .................................. SKIPPED
[INFO] Spring WS Tests ................................... SKIPPED
[INFO] Developer Guide ................................... SKIPPED
[INFO] User Guide ........................................ SKIPPED
[INFO] Javadoc ........................................... SKIPPED
[INFO] Distribution ...................................... SKIPPED
[INFO] Code Coverage Report .............................. SKIPPED
[INFO] ------------------------------------------------------------------------
[INFO] BUILD FAILURE
[INFO] ------------------------------------------------------------------------
[INFO] Total time: 5:21.860s
[INFO] Finished at: Fri May 10 17:59:17 UTC 2013
[INFO] Final Memory: 58M/129M
[INFO] ------------------------------------------------------------------------
[JENKINS] Archiving <https://builds.apache.org/job/ws-axiom-trunk/ws/axiom/userguide/pom.xml>
to /home/hudson/hudson/jobs/ws-axiom-trunk/modules/org.apache.ws.commons.axiom$userguide/builds/2013-05-10_17-53-42/archive/org.apache.ws.commons.axiom/userguide/1.2.15-SNAPSHOT/userguide-1.2.15-SNAPSHOT.pom
[JENKINS] Archiving <https://builds.apache.org/job/ws-axiom-trunk/ws/axiom/modules/axiom-dom-testsuite/pom.xml>
to /home/hudson/hudson/jobs/ws-axiom-trunk/modules/org.apache.ws.commons.axiom$axiom-dom-testsuite/builds/2013-05-10_17-53-40/archive/org.apache.ws.commons.axiom/axiom-dom-testsuite/1.2.15-SNAPSHOT/axiom-dom-testsuite-1.2.15-SNAPSHOT.pom
[JENKINS] Archiving <https://builds.apache.org/job/ws-axiom-trunk/ws/axiom/modules/axiom-dom-testsuite/target/axiom-dom-testsuite-1.2.15-SNAPSHOT.jar>
to /home/hudson/hudson/jobs/ws-axiom-trunk/modules/org.apache.ws.commons.axiom$axiom-dom-testsuite/builds/2013-05-10_17-53-40/archive/org.apache.ws.commons.axiom/axiom-dom-testsuite/1.2.15-20130510.175603-212/axiom-dom-testsuite-1.2.15-20130510.175603-212.jar
[JENKINS] Archiving <https://builds.apache.org/job/ws-axiom-trunk/ws/axiom/modules/axiom-dom-testsuite/target/jacoco.exec>
to /home/hudson/hudson/jobs/ws-axiom-trunk/modules/org.apache.ws.commons.axiom$axiom-dom-testsuite/builds/2013-05-10_17-53-40/archive/org.apache.ws.commons.axiom/axiom-dom-testsuite/1.2.15-20130510.175603-212/axiom-dom-testsuite-1.2.15-20130510.175603-212-jacoco.exec
[JENKINS] Archiving <https://builds.apache.org/job/ws-axiom-trunk/ws/axiom/modules/axiom-dom-testsuite/target/axiom-dom-testsuite-1.2.15-SNAPSHOT-sources.jar>
to /home/hudson/hudson/jobs/ws-axiom-trunk/modules/org.apache.ws.commons.axiom$axiom-dom-testsuite/builds/2013-05-10_17-53-40/archive/org.apache.ws.commons.axiom/axiom-dom-testsuite/1.2.15-20130510.175603-212/axiom-dom-testsuite-1.2.15-20130510.175603-212-sources.jar
[JENKINS] Archiving <https://builds.apache.org/job/ws-axiom-trunk/ws/axiom/modules/axiom-dom-testsuite/target/axiom-dom-testsuite-1.2.15-SNAPSHOT-javadoc.jar>
to /home/hudson/hudson/jobs/ws-axiom-trunk/modules/org.apache.ws.commons.axiom$axiom-dom-testsuite/builds/2013-05-10_17-53-40/archive/org.apache.ws.commons.axiom/axiom-dom-testsuite/1.2.15-20130510.175603-212/axiom-dom-testsuite-1.2.15-20130510.175603-212-javadoc.jar
[JENKINS] Archiving <https://builds.apache.org/job/ws-axiom-trunk/ws/axiom/modules/axiom-impl/pom.xml>
to /home/hudson/hudson/jobs/ws-axiom-trunk/modules/org.apache.ws.commons.axiom$axiom-impl/builds/2013-05-10_17-53-40/archive/org.apache.ws.commons.axiom/axiom-impl/1.2.15-SNAPSHOT/axiom-impl-1.2.15-SNAPSHOT.pom
[JENKINS] Archiving <https://builds.apache.org/job/ws-axiom-trunk/ws/axiom/distribution/pom.xml>
to /home/hudson/hudson/jobs/ws-axiom-trunk/modules/org.apache.ws.commons.axiom$distribution/builds/2013-05-10_17-53-42/archive/org.apache.ws.commons.axiom/distribution/1.2.15-SNAPSHOT/distribution-1.2.15-SNAPSHOT.pom
[JENKINS] Archiving <https://builds.apache.org/job/ws-axiom-trunk/ws/axiom/code-coverage/pom.xml>
to /home/hudson/hudson/jobs/ws-axiom-trunk/modules/org.apache.ws.commons.axiom$code-coverage/builds/2013-05-10_17-53-42/archive/org.apache.ws.commons.axiom/code-coverage/1.2.15-SNAPSHOT/code-coverage-1.2.15-SNAPSHOT.pom
[JENKINS] Archiving <https://builds.apache.org/job/ws-axiom-trunk/ws/axiom/systests/pom.xml>
to /home/hudson/hudson/jobs/ws-axiom-trunk/modules/org.apache.ws.commons.axiom$systests/builds/2013-05-10_17-53-41/archive/org.apache.ws.commons.axiom/systests/1.2.15-SNAPSHOT/systests-1.2.15-SNAPSHOT.pom
[JENKINS] Archiving <https://builds.apache.org/job/ws-axiom-trunk/ws/axiom/modules/axiom-samples/pom.xml>
to /home/hudson/hudson/jobs/ws-axiom-trunk/modules/org.apache.ws.commons.axiom$axiom-samples/builds/2013-05-10_17-53-41/archive/org.apache.ws.commons.axiom/axiom-samples/1.2.15-SNAPSHOT/axiom-samples-1.2.15-SNAPSHOT.pom
[JENKINS] Archiving <https://builds.apache.org/job/ws-axiom-trunk/ws/axiom/systests/spring-ws-tests/pom.xml>
to /home/hudson/hudson/jobs/ws-axiom-trunk/modules/org.apache.ws.commons.axiom$spring-ws-tests/builds/2013-05-10_17-53-41/archive/org.apache.ws.commons.axiom/spring-ws-tests/1.2.15-SNAPSHOT/spring-ws-tests-1.2.15-SNAPSHOT.pom
[JENKINS] Archiving <https://builds.apache.org/job/ws-axiom-trunk/ws/axiom/modules/axiom-integration/pom.xml>
to /home/hudson/hudson/jobs/ws-axiom-trunk/modules/org.apache.ws.commons.axiom$axiom-integration/builds/2013-05-10_17-53-41/archive/org.apache.ws.commons.axiom/axiom-integration/1.2.15-SNAPSHOT/axiom-integration-1.2.15-SNAPSHOT.pom
[JENKINS] Archiving <https://builds.apache.org/job/ws-axiom-trunk/ws/axiom/modules/axiom-testsuite/pom.xml>
to /home/hudson/hudson/jobs/ws-axiom-trunk/modules/org.apache.ws.commons.axiom$axiom-testsuite/builds/2013-05-10_17-53-40/archive/org.apache.ws.commons.axiom/axiom-testsuite/1.2.15-SNAPSHOT/axiom-testsuite-1.2.15-SNAPSHOT.pom
[JENKINS] Archiving <https://builds.apache.org/job/ws-axiom-trunk/ws/axiom/modules/axiom-jaxb/pom.xml>
to /home/hudson/hudson/jobs/ws-axiom-trunk/modules/org.apache.ws.commons.axiom$axiom-jaxb/builds/2013-05-10_17-53-41/archive/org.apache.ws.commons.axiom/axiom-jaxb/1.2.15-SNAPSHOT/axiom-jaxb-1.2.15-SNAPSHOT.pom
[JENKINS] Archiving <https://builds.apache.org/job/ws-axiom-trunk/ws/axiom/modules/axiom-testutils/pom.xml>
to /home/hudson/hudson/jobs/ws-axiom-trunk/modules/org.apache.ws.commons.axiom$axiom-testutils/builds/2013-05-10_17-53-39/archive/org.apache.ws.commons.axiom/axiom-testutils/1.2.15-SNAPSHOT/axiom-testutils-1.2.15-SNAPSHOT.pom
[JENKINS] Archiving <https://builds.apache.org/job/ws-axiom-trunk/ws/axiom/modules/axiom-testutils/target/axiom-testutils-1.2.15-SNAPSHOT.jar>
to /home/hudson/hudson/jobs/ws-axiom-trunk/modules/org.apache.ws.commons.axiom$axiom-testutils/builds/2013-05-10_17-53-39/archive/org.apache.ws.commons.axiom/axiom-testutils/1.2.15-20130510.175526-212/axiom-testutils-1.2.15-20130510.175526-212.jar
[JENKINS] Archiving <https://builds.apache.org/job/ws-axiom-trunk/ws/axiom/modules/axiom-testutils/target/jacoco.exec>
to /home/hudson/hudson/jobs/ws-axiom-trunk/modules/org.apache.ws.commons.axiom$axiom-testutils/builds/2013-05-10_17-53-39/archive/org.apache.ws.commons.axiom/axiom-testutils/1.2.15-20130510.175526-212/axiom-testutils-1.2.15-20130510.175526-212-jacoco.exec
[JENKINS] Archiving <https://builds.apache.org/job/ws-axiom-trunk/ws/axiom/modules/axiom-testutils/target/axiom-testutils-1.2.15-SNAPSHOT-sources.jar>
to /home/hudson/hudson/jobs/ws-axiom-trunk/modules/org.apache.ws.commons.axiom$axiom-testutils/builds/2013-05-10_17-53-39/archive/org.apache.ws.commons.axiom/axiom-testutils/1.2.15-20130510.175526-212/axiom-testutils-1.2.15-20130510.175526-212-sources.jar
[JENKINS] Archiving <https://builds.apache.org/job/ws-axiom-trunk/ws/axiom/modules/axiom-testutils/target/axiom-testutils-1.2.15-SNAPSHOT-javadoc.jar>
to /home/hudson/hudson/jobs/ws-axiom-trunk/modules/org.apache.ws.commons.axiom$axiom-testutils/builds/2013-05-10_17-53-39/archive/org.apache.ws.commons.axiom/axiom-testutils/1.2.15-20130510.175526-212/axiom-testutils-1.2.15-20130510.175526-212-javadoc.jar
[JENKINS] Archiving <https://builds.apache.org/job/ws-axiom-trunk/ws/axiom/modules/axiom-buildutils/pom.xml>
to /home/hudson/hudson/jobs/ws-axiom-trunk/modules/org.apache.ws.commons.axiom$axiom-buildutils/builds/2013-05-10_17-53-39/archive/org.apache.ws.commons.axiom/axiom-buildutils/1.2.15-SNAPSHOT/axiom-buildutils-1.2.15-SNAPSHOT.pom
[JENKINS] Archiving <https://builds.apache.org/job/ws-axiom-trunk/ws/axiom/modules/axiom-buildutils/target/axiom-buildutils-1.2.15-SNAPSHOT.jar>
to /home/hudson/hudson/jobs/ws-axiom-trunk/modules/org.apache.ws.commons.axiom$axiom-buildutils/builds/2013-05-10_17-53-39/archive/org.apache.ws.commons.axiom/axiom-buildutils/1.2.15-20130510.175513-212/axiom-buildutils-1.2.15-20130510.175513-212.jar
[JENKINS] Archiving <https://builds.apache.org/job/ws-axiom-trunk/ws/axiom/modules/axiom-buildutils/target/jacoco.exec>
to /home/hudson/hudson/jobs/ws-axiom-trunk/modules/org.apache.ws.commons.axiom$axiom-buildutils/builds/2013-05-10_17-53-39/archive/org.apache.ws.commons.axiom/axiom-buildutils/1.2.15-20130510.175513-212/axiom-buildutils-1.2.15-20130510.175513-212-jacoco.exec
[JENKINS] Archiving <https://builds.apache.org/job/ws-axiom-trunk/ws/axiom/modules/axiom-buildutils/target/axiom-buildutils-1.2.15-SNAPSHOT-sources.jar>
to /home/hudson/hudson/jobs/ws-axiom-trunk/modules/org.apache.ws.commons.axiom$axiom-buildutils/builds/2013-05-10_17-53-39/archive/org.apache.ws.commons.axiom/axiom-buildutils/1.2.15-20130510.175513-212/axiom-buildutils-1.2.15-20130510.175513-212-sources.jar
[JENKINS] Archiving <https://builds.apache.org/job/ws-axiom-trunk/ws/axiom/modules/axiom-buildutils/target/axiom-buildutils-1.2.15-SNAPSHOT-javadoc.jar>
to /home/hudson/hudson/jobs/ws-axiom-trunk/modules/org.apache.ws.commons.axiom$axiom-buildutils/builds/2013-05-10_17-53-39/archive/org.apache.ws.commons.axiom/axiom-buildutils/1.2.15-20130510.175513-212/axiom-buildutils-1.2.15-20130510.175513-212-javadoc.jar
[JENKINS] Archiving <https://builds.apache.org/job/ws-axiom-trunk/ws/axiom/modules/axiom-dom/pom.xml>
to /home/hudson/hudson/jobs/ws-axiom-trunk/modules/org.apache.ws.commons.axiom$axiom-dom/builds/2013-05-10_17-53-40/archive/org.apache.ws.commons.axiom/axiom-dom/1.2.15-SNAPSHOT/axiom-dom-1.2.15-SNAPSHOT.pom
[JENKINS] Archiving <https://builds.apache.org/job/ws-axiom-trunk/ws/axiom/modules/axiom-all/pom.xml>
to /home/hudson/hudson/jobs/ws-axiom-trunk/modules/org.apache.ws.commons.axiom$axiom-all/builds/2013-05-10_17-53-41/archive/org.apache.ws.commons.axiom/axiom-all/1.2.15-SNAPSHOT/axiom-all-1.2.15-SNAPSHOT.pom
[JENKINS] Archiving <https://builds.apache.org/job/ws-axiom-trunk/ws/axiom/modules/axiom-api/pom.xml>
to /home/hudson/hudson/jobs/ws-axiom-trunk/modules/org.apache.ws.commons.axiom$axiom-api/builds/2013-05-10_17-53-40/archive/org.apache.ws.commons.axiom/axiom-api/1.2.15-SNAPSHOT/axiom-api-1.2.15-SNAPSHOT.pom
[JENKINS] Archiving <https://builds.apache.org/job/ws-axiom-trunk/ws/axiom/apidocs/pom.xml>
to /home/hudson/hudson/jobs/ws-axiom-trunk/modules/org.apache.ws.commons.axiom$apidocs/builds/2013-05-10_17-53-42/archive/org.apache.ws.commons.axiom/apidocs/1.2.15-SNAPSHOT/apidocs-1.2.15-SNAPSHOT.pom
[JENKINS] Archiving <https://builds.apache.org/job/ws-axiom-trunk/ws/axiom/modules/axiom-jaxen-testsuite/pom.xml>
to /home/hudson/hudson/jobs/ws-axiom-trunk/modules/org.apache.ws.commons.axiom$axiom-jaxen-testsuite/builds/2013-05-10_17-53-39/archive/org.apache.ws.commons.axiom/axiom-jaxen-testsuite/1.2.15-SNAPSHOT/axiom-jaxen-testsuite-1.2.15-SNAPSHOT.pom
[JENKINS] Archiving <https://builds.apache.org/job/ws-axiom-trunk/ws/axiom/modules/axiom-jaxen-testsuite/target/axiom-jaxen-testsuite-1.2.15-SNAPSHOT.jar>
to /home/hudson/hudson/jobs/ws-axiom-trunk/modules/org.apache.ws.commons.axiom$axiom-jaxen-testsuite/builds/2013-05-10_17-53-39/archive/org.apache.ws.commons.axiom/axiom-jaxen-testsuite/1.2.15-20130510.175538-212/axiom-jaxen-testsuite-1.2.15-20130510.175538-212.jar
[JENKINS] Archiving <https://builds.apache.org/job/ws-axiom-trunk/ws/axiom/modules/axiom-jaxen-testsuite/target/jacoco.exec>
to /home/hudson/hudson/jobs/ws-axiom-trunk/modules/org.apache.ws.commons.axiom$axiom-jaxen-testsuite/builds/2013-05-10_17-53-39/archive/org.apache.ws.commons.axiom/axiom-jaxen-testsuite/1.2.15-20130510.175538-212/axiom-jaxen-testsuite-1.2.15-20130510.175538-212-jacoco.exec
[JENKINS] Archiving <https://builds.apache.org/job/ws-axiom-trunk/ws/axiom/modules/axiom-jaxen-testsuite/target/axiom-jaxen-testsuite-1.2.15-SNAPSHOT-sources.jar>
to /home/hudson/hudson/jobs/ws-axiom-trunk/modules/org.apache.ws.commons.axiom$axiom-jaxen-testsuite/builds/2013-05-10_17-53-39/archive/org.apache.ws.commons.axiom/axiom-jaxen-testsuite/1.2.15-20130510.175538-212/axiom-jaxen-testsuite-1.2.15-20130510.175538-212-sources.jar
[JENKINS] Archiving <https://builds.apache.org/job/ws-axiom-trunk/ws/axiom/modules/axiom-jaxen-testsuite/target/axiom-jaxen-testsuite-1.2.15-SNAPSHOT-javadoc.jar>
to /home/hudson/hudson/jobs/ws-axiom-trunk/modules/org.apache.ws.commons.axiom$axiom-jaxen-testsuite/builds/2013-05-10_17-53-39/archive/org.apache.ws.commons.axiom/axiom-jaxen-testsuite/1.2.15-20130510.175538-212/axiom-jaxen-testsuite-1.2.15-20130510.175538-212-javadoc.jar
[JENKINS] Archiving <https://builds.apache.org/job/ws-axiom-trunk/ws/axiom/modules/axiom-tests/pom.xml>
to /home/hudson/hudson/jobs/ws-axiom-trunk/modules/org.apache.ws.commons.axiom$axiom-tests/builds/2013-05-10_17-53-41/archive/org.apache.ws.commons.axiom/axiom-tests/1.2.15-SNAPSHOT/axiom-tests-1.2.15-SNAPSHOT.pom
[JENKINS] Archiving <https://builds.apache.org/job/ws-axiom-trunk/ws/axiom/systests/osgi-tests/pom.xml>
to /home/hudson/hudson/jobs/ws-axiom-trunk/modules/org.apache.ws.commons.axiom$osgi-tests/builds/2013-05-10_17-53-41/archive/org.apache.ws.commons.axiom/osgi-tests/1.2.15-SNAPSHOT/osgi-tests-1.2.15-SNAPSHOT.pom
[JENKINS] Archiving <https://builds.apache.org/job/ws-axiom-trunk/ws/axiom/modules/axiom-common-impl/pom.xml>
to /home/hudson/hudson/jobs/ws-axiom-trunk/modules/org.apache.ws.commons.axiom$axiom-common-impl/builds/2013-05-10_17-53-40/archive/org.apache.ws.commons.axiom/axiom-common-impl/1.2.15-SNAPSHOT/axiom-common-impl-1.2.15-SNAPSHOT.pom
[JENKINS] Archiving <https://builds.apache.org/job/ws-axiom-trunk/ws/axiom/pom.xml>
to /home/hudson/hudson/jobs/ws-axiom-trunk/modules/org.apache.ws.commons.axiom$axiom/builds/2013-05-10_17-53-39/archive/org.apache.ws.commons.axiom/axiom/1.2.15-SNAPSHOT/axiom-1.2.15-SNAPSHOT.pom
[JENKINS] Archiving <https://builds.apache.org/job/ws-axiom-trunk/ws/axiom/target/axiom-1.2.15-SNAPSHOT-source-release.zip>
to /home/hudson/hudson/jobs/ws-axiom-trunk/modules/org.apache.ws.commons.axiom$axiom/builds/2013-05-10_17-53-39/archive/org.apache.ws.commons.axiom/axiom/1.2.15-20130510.175459-212/axiom-1.2.15-20130510.175459-212-source-release.zip
[JENKINS] Archiving <https://builds.apache.org/job/ws-axiom-trunk/ws/axiom/modules/axiom-compat/pom.xml>
to /home/hudson/hudson/jobs/ws-axiom-trunk/modules/org.apache.ws.commons.axiom$axiom-compat/builds/2013-05-10_17-53-40/archive/org.apache.ws.commons.axiom/axiom-compat/1.2.15-SNAPSHOT/axiom-compat-1.2.15-SNAPSHOT.pom
[JENKINS] Archiving <https://builds.apache.org/job/ws-axiom-trunk/ws/axiom/systests/jboss-tests/pom.xml>
to /home/hudson/hudson/jobs/ws-axiom-trunk/modules/org.apache.ws.commons.axiom$jboss-tests/builds/2013-05-10_17-53-41/archive/org.apache.ws.commons.axiom/jboss-tests/1.2.15-SNAPSHOT/jboss-tests-1.2.15-SNAPSHOT.pom
[JENKINS] Archiving <https://builds.apache.org/job/ws-axiom-trunk/ws/axiom/modules/axiom-c14n/pom.xml>
to /home/hudson/hudson/jobs/ws-axiom-trunk/modules/org.apache.ws.commons.axiom$axiom-c14n/builds/2013-05-10_17-53-41/archive/org.apache.ws.commons.axiom/axiom-c14n/1.2.15-SNAPSHOT/axiom-c14n-1.2.15-SNAPSHOT.pom
[JENKINS] Archiving <https://builds.apache.org/job/ws-axiom-trunk/ws/axiom/devguide/pom.xml>
to /home/hudson/hudson/jobs/ws-axiom-trunk/modules/org.apache.ws.commons.axiom$devguide/builds/2013-05-10_17-53-42/archive/org.apache.ws.commons.axiom/devguide/1.2.15-SNAPSHOT/devguide-1.2.15-SNAPSHOT.pom
Waiting for Jenkins to finish collecting data
mavenExecutionResult exceptions not empty
message : Internal error: java.lang.reflect.UndeclaredThrowableException
cause : null
Stack trace : 
org.apache.maven.InternalErrorException: Internal error: java.lang.reflect.UndeclaredThrowableException
	at org.apache.maven.lifecycle.internal.BuilderCommon.handleBuildError(BuilderCommon.java:128)
	at org.apache.maven.lifecycle.internal.LifecycleModuleBuilder.buildProject(LifecycleModuleBuilder.java:95)
	at org.apache.maven.lifecycle.internal.LifecycleModuleBuilder.buildProject(LifecycleModuleBuilder.java:59)
	at org.apache.maven.lifecycle.internal.LifecycleStarter.singleThreadedBuild(LifecycleStarter.java:183)
	at org.apache.maven.lifecycle.internal.LifecycleStarter.execute(LifecycleStarter.java:161)
	at org.apache.maven.DefaultMaven.doExecute(DefaultMaven.java:320)
	at org.apache.maven.DefaultMaven.execute(DefaultMaven.java:156)
	at org.jvnet.hudson.maven3.launcher.Maven3Launcher.main(Maven3Launcher.java:79)
	at sun.reflect.NativeMethodAccessorImpl.invoke0(Native Method)
	at sun.reflect.NativeMethodAccessorImpl.invoke(NativeMethodAccessorImpl.java:39)
	at sun.reflect.DelegatingMethodAccessorImpl.invoke(DelegatingMethodAccessorImpl.java:25)
	at java.lang.reflect.Method.invoke(Method.java:597)
	at org.codehaus.plexus.classworlds.launcher.Launcher.launchStandard(Launcher.java:329)
	at org.codehaus.plexus.classworlds.launcher.Launcher.launch(Launcher.java:239)
	at org.jvnet.hudson.maven3.agent.Maven3Main.launch(Maven3Main.java:158)
	at hudson.maven.Maven3Builder.call(Maven3Builder.java:100)
	at hudson.maven.Maven3Builder.call(Maven3Builder.java:66)
	at hudson.remoting.UserRequest.perform(UserRequest.java:118)
	at hudson.remoting.UserRequest.perform(UserRequest.java:48)
	at hudson.remoting.Request$2.run(Request.java:326)
	at hudson.remoting.InterceptingExecutorService$1.call(InterceptingExecutorService.java:72)
	at java.util.concurrent.FutureTask$Sync.innerRun(FutureTask.java:303)
	at java.util.concurrent.FutureTask.run(FutureTask.java:138)
	at java.util.concurrent.ThreadPoolExecutor$Worker.runTask(ThreadPoolExecutor.java:895)
	at java.util.concurrent.ThreadPoolExecutor$Worker.run(ThreadPoolExecutor.java:918)
	at java.lang.Thread.run(Thread.java:662)
Caused by: java.lang.reflect.UndeclaredThrowableException
	at com.sun.proxy.$Proxy2.setExecutedMojos(Unknown Source)
	at hudson.maven.MavenBuildProxy$Filter.setExecutedMojos(MavenBuildProxy.java:243)
	at hudson.maven.Maven3Builder$MavenExecutionListener.recordMojoEnded(Maven3Builder.java:439)
	at hudson.maven.Maven3Builder$MavenExecutionListener.mojoSucceeded(Maven3Builder.java:425)
	at org.apache.maven.lifecycle.internal.DefaultExecutionEventCatapult.fire(DefaultExecutionEventCatapult.java:87)
	at org.apache.maven.lifecycle.internal.DefaultExecutionEventCatapult.fire(DefaultExecutionEventCatapult.java:42)
	at org.apache.maven.lifecycle.internal.MojoExecutor.execute(MojoExecutor.java:228)
	at org.apache.maven.lifecycle.internal.MojoExecutor.execute(MojoExecutor.java:153)
	at org.apache.maven.lifecycle.internal.MojoExecutor.execute(MojoExecutor.java:145)
	at org.apache.maven.lifecycle.internal.LifecycleModuleBuilder.buildProject(LifecycleModuleBuilder.java:84)
	... 24 more
Caused by: java.io.UTFDataFormatException
	at java.io.ObjectInputStream$BlockDataInputStream.readUTFSpan(ObjectInputStream.java:3105)
	at java.io.ObjectInputStream$BlockDataInputStream.readUTFBody(ObjectInputStream.java:3030)
	at java.io.ObjectInputStream$BlockDataInputStream.readUTF(ObjectInputStream.java:2843)
	at java.io.ObjectInputStream.readUTF(ObjectInputStream.java:1069)
	at java.io.ObjectStreamClass.readNonProxy(ObjectStreamClass.java:658)
	at java.io.ObjectInputStream.readClassDescriptor(ObjectInputStream.java:827)
	at java.io.ObjectInputStream.readNonProxyDesc(ObjectInputStream.java:1583)
	at java.io.ObjectInputStream.readClassDesc(ObjectInputStream.java:1514)
	at java.io.ObjectInputStream.readArray(ObjectInputStream.java:1642)
	at java.io.ObjectInputStream.readObject0(ObjectInputStream.java:1341)
	at java.io.ObjectInputStream.defaultReadFields(ObjectInputStream.java:1970)
	at java.io.ObjectInputStream.readSerialData(ObjectInputStream.java:1894)
	at java.io.ObjectInputStream.readOrdinaryObject(ObjectInputStream.java:1777)
	at java.io.ObjectInputStream.readObject0(ObjectInputStream.java:1347)
	at java.io.ObjectInputStream.readObject(ObjectInputStream.java:369)
	at hudson.remoting.UserRequest.deserialize(UserRequest.java:182)
	at hudson.remoting.UserRequest.perform(UserRequest.java:98)
	at hudson.remoting.UserRequest.perform(UserRequest.java:48)
	at hudson.remoting.Request$2.run(Request.java:326)
	at hudson.remoting.InterceptingExecutorService$1.call(InterceptingExecutorService.java:72)
	at java.util.concurrent.FutureTask$Sync.innerRun(FutureTask.java:334)
	at java.util.concurrent.FutureTask.run(FutureTask.java:166)
	at java.util.concurrent.ThreadPoolExecutor.runWorker(ThreadPoolExecutor.java:1145)
	at java.util.concurrent.ThreadPoolExecutor$Worker.run(ThreadPoolExecutor.java:615)
	at java.lang.Thread.run(Thread.java:722)
Sending e-mails to: dev@ws.apache.org
channel stopped

---------------------------------------------------------------------
To unsubscribe, e-mail: dev-unsubscribe@ws.apache.org
For additional commands, e-mail: dev-help@ws.apache.org


Mime
View raw message