ws-dev mailing list archives

Site index · List index
Message view « Date » · « Thread »
Top « Date » · « Thread »
From Apache Jenkins Server <jenk...@builds.apache.org>
Subject Build failed in Jenkins: wss4j-trunk #506
Date Mon, 20 May 2013 22:27:48 GMT
See <https://builds.apache.org/job/wss4j-trunk/506/changes>

Changes:

[giger] fix for WSS-443

------------------------------------------
[...truncated 1182 lines...]
Tests run: 15, Failures: 0, Errors: 0, Skipped: 0, Time elapsed: 0.054 sec
Running org.apache.wss4j.dom.message.UTSignatureTest
Tests run: 4, Failures: 0, Errors: 0, Skipped: 0, Time elapsed: 0.098 sec
Running org.apache.wss4j.dom.message.ReplayTest
Tests run: 8, Failures: 0, Errors: 0, Skipped: 0, Time elapsed: 0.141 sec
Running org.apache.wss4j.dom.message.SignatureEncryptionTest
Tests run: 7, Failures: 0, Errors: 0, Skipped: 0, Time elapsed: 0.157 sec
Running org.apache.wss4j.dom.message.SKISignatureTest
Tests run: 3, Failures: 0, Errors: 0, Skipped: 0, Time elapsed: 0.047 sec
Running org.apache.wss4j.dom.message.EncryptionGCMTest
Tests run: 3, Failures: 0, Errors: 0, Skipped: 0, Time elapsed: 0.042 sec
Running org.apache.wss4j.dom.message.token.BinarySecurityTokenTest
Tests run: 3, Failures: 0, Errors: 0, Skipped: 0, Time elapsed: 0.007 sec
Running org.apache.wss4j.dom.message.token.ReferenceTest
Tests run: 4, Failures: 0, Errors: 0, Skipped: 0, Time elapsed: 0.013 sec
Running org.apache.wss4j.dom.message.token.BSTKerberosTest
Tests run: 9, Failures: 0, Errors: 0, Skipped: 0, Time elapsed: 0.202 sec
Running org.apache.wss4j.dom.message.token.SecurityTokenReferenceTest
Tests run: 8, Failures: 0, Errors: 0, Skipped: 0, Time elapsed: 0.008 sec
Running org.apache.wss4j.dom.message.token.WCFUsernameTokenTest
Tests run: 2, Failures: 0, Errors: 0, Skipped: 0, Time elapsed: 0.008 sec
Running org.apache.wss4j.dom.message.token.DerivedKeyTokenTest
Tests run: 2, Failures: 0, Errors: 0, Skipped: 0, Time elapsed: 0.007 sec
Running org.apache.wss4j.dom.message.UTDerivedKeyTest
Tests run: 15, Failures: 0, Errors: 0, Skipped: 0, Time elapsed: 0.3 sec
Running org.apache.wss4j.dom.message.DerivedKeyTest
Tests run: 7, Failures: 0, Errors: 0, Skipped: 0, Time elapsed: 0.096 sec
Running org.apache.wss4j.dom.message.SignatureAlgorithmSuiteTest
Tests run: 5, Failures: 0, Errors: 0, Skipped: 0, Time elapsed: 0.101 sec
Running org.apache.wss4j.dom.message.SecurityContextTokenTest
Tests run: 7, Failures: 0, Errors: 0, Skipped: 0, Time elapsed: 0.058 sec
Running org.apache.wss4j.dom.message.ModifiedRequestTest
[Fatal Error] :1:244: Invalid byte 1 of 1-byte UTF-8 sequence.
Tests run: 10, Failures: 0, Errors: 0, Skipped: 0, Time elapsed: 0.223 sec
Running org.apache.wss4j.dom.message.SignaturePartsTest
Tests run: 7, Failures: 0, Errors: 0, Skipped: 0, Time elapsed: 0.143 sec
Running org.apache.wss4j.dom.message.SignatureCRLTest
Tests run: 3, Failures: 0, Errors: 0, Skipped: 0, Time elapsed: 0.046 sec
Running org.apache.wss4j.dom.message.NoSoapPrefixSignatureTest
Tests run: 1, Failures: 0, Errors: 0, Skipped: 0, Time elapsed: 0.015 sec
Running org.apache.wss4j.dom.message.SymmetricSignatureTest
Tests run: 4, Failures: 0, Errors: 0, Skipped: 0, Time elapsed: 0.049 sec
Running org.apache.wss4j.dom.message.UsernameTokenTest
Tests run: 29, Failures: 0, Errors: 0, Skipped: 0, Time elapsed: 0.18 sec
Running org.apache.wss4j.dom.message.EncryptionTest
Tests run: 12, Failures: 0, Errors: 0, Skipped: 0, Time elapsed: 0.123 sec
Running org.apache.wss4j.dom.message.EncryptionPartsTest
Tests run: 7, Failures: 0, Errors: 0, Skipped: 0, Time elapsed: 0.095 sec
Running org.apache.wss4j.dom.message.STRSignatureTest
Tests run: 4, Failures: 0, Errors: 0, Skipped: 0, Time elapsed: 0.06 sec
Running org.apache.wss4j.dom.message.SignatureCertTest
Tests run: 6, Failures: 0, Errors: 0, Skipped: 1, Time elapsed: 0.061 sec
Running org.apache.wss4j.dom.message.SignatureTest
Tests run: 21, Failures: 0, Errors: 0, Skipped: 0, Time elapsed: 0.433 sec
Running org.apache.wss4j.dom.message.CertErrorTest
Tests run: 2, Failures: 0, Errors: 0, Skipped: 0, Time elapsed: 0.023 sec
Running org.apache.wss4j.dom.message.RequireSignedEncryptedDataElementsTest
Tests run: 7, Failures: 0, Errors: 0, Skipped: 0, Time elapsed: 0.339 sec
Running org.apache.wss4j.dom.message.SignatureCertConstraintsTest
Tests run: 2, Failures: 0, Errors: 0, Skipped: 0, Time elapsed: 0.028 sec
Running org.apache.wss4j.dom.message.SignatureKeyValueTest
Tests run: 3, Failures: 0, Errors: 0, Skipped: 0, Time elapsed: 0.041 sec
Running org.apache.wss4j.dom.message.EncryptedDataInHeaderTest
Tests run: 1, Failures: 0, Errors: 0, Skipped: 0, Time elapsed: 0.018 sec
Running org.apache.wss4j.dom.message.PasswordTypeTest
Tests run: 3, Failures: 0, Errors: 0, Skipped: 0, Time elapsed: 0.032 sec
Running org.apache.wss4j.dom.message.EncryptionAlgorithmSuiteTest
Tests run: 4, Failures: 0, Errors: 0, Skipped: 0, Time elapsed: 0.049 sec
Running org.apache.wss4j.dom.message.EncryptionCRLTest
Tests run: 2, Failures: 0, Errors: 0, Skipped: 0, Time elapsed: 0.015 sec
Running org.apache.wss4j.dom.misc.FaultCodeTest
Tests run: 6, Failures: 0, Errors: 0, Skipped: 0, Time elapsed: 0.014 sec
Running org.apache.wss4j.dom.misc.SecurityHeaderTest
Tests run: 3, Failures: 0, Errors: 0, Skipped: 0, Time elapsed: 0.005 sec
Running org.apache.wss4j.dom.misc.PrincipalTest
Tests run: 6, Failures: 0, Errors: 0, Skipped: 0, Time elapsed: 0.035 sec
Running org.apache.wss4j.dom.processor.ReferenceListDataRefTest
Tests run: 1, Failures: 0, Errors: 0, Skipped: 0, Time elapsed: 0.01 sec
Running org.apache.wss4j.dom.processor.EncryptedKeyDataRefTest
Tests run: 1, Failures: 0, Errors: 0, Skipped: 0, Time elapsed: 0.01 sec
Running org.apache.wss4j.dom.validate.ValidatorTest
Tests run: 5, Failures: 0, Errors: 0, Skipped: 0, Time elapsed: 0.051 sec

Results :

Tests run: 357, Failures: 0, Errors: 0, Skipped: 1

[JENKINS] Recording test results
[INFO] [bundle:bundle {execution: default-bundle}]
[WARNING] Warning building bundle org.apache.wss4j:wss4j-ws-security-dom:bundle:2.0-SNAPSHOT
: Did not find matching referal for !org.apache.wss4j.dom.*
[WARNING] Warning building bundle org.apache.wss4j:wss4j-ws-security-dom:bundle:2.0-SNAPSHOT
: Did not find matching referal for org.apache.jcp.xml.dsig.internal.*
[WARNING] Warning building bundle org.apache.wss4j:wss4j-ws-security-dom:bundle:2.0-SNAPSHOT
: Did not find matching referal for org.bouncycastle.*
[INFO] Preparing source:jar
[WARNING] Removing: jar from forked lifecycle, to prevent recursive invocation.
[WARNING] Removing: check from forked lifecycle, to prevent recursive invocation.
[INFO] No goals needed for project - skipping
[INFO] [source:jar {execution: default}]
[INFO] Building jar: <https://builds.apache.org/job/wss4j-trunk/ws/wss4j/ws-security-dom/target/wss4j-ws-security-dom-2.0-SNAPSHOT-sources.jar>
[INFO] [jar:test-jar {execution: default}]
[INFO] Building jar: <https://builds.apache.org/job/wss4j-trunk/ws/wss4j/ws-security-dom/target/wss4j-ws-security-dom-2.0-SNAPSHOT-tests.jar>
[INFO] [install:install {execution: default-install}]
[INFO] Installing <https://builds.apache.org/job/wss4j-trunk/ws/wss4j/ws-security-dom/target/wss4j-ws-security-dom-2.0-SNAPSHOT.jar>
to /home/jenkins/jenkins-slave/maven-repositories/1/org/apache/wss4j/wss4j-ws-security-dom/2.0-SNAPSHOT/wss4j-ws-security-dom-2.0-SNAPSHOT.jar
[INFO] Installing <https://builds.apache.org/job/wss4j-trunk/ws/wss4j/ws-security-dom/target/wss4j-ws-security-dom-2.0-SNAPSHOT-sources.jar>
to /home/jenkins/jenkins-slave/maven-repositories/1/org/apache/wss4j/wss4j-ws-security-dom/2.0-SNAPSHOT/wss4j-ws-security-dom-2.0-SNAPSHOT-sources.jar
[INFO] Installing <https://builds.apache.org/job/wss4j-trunk/ws/wss4j/ws-security-dom/target/wss4j-ws-security-dom-2.0-SNAPSHOT-tests.jar>
to /home/jenkins/jenkins-slave/maven-repositories/1/org/apache/wss4j/wss4j-ws-security-dom/2.0-SNAPSHOT/wss4j-ws-security-dom-2.0-SNAPSHOT-tests.jar
[INFO] [bundle:install {execution: default-install}]
[INFO] Installing org/apache/wss4j/wss4j-ws-security-dom/2.0-SNAPSHOT/wss4j-ws-security-dom-2.0-SNAPSHOT.jar
[INFO] Writing OBR metadata
[INFO] Preparing pmd:check
[JENKINS] Archiving <https://builds.apache.org/job/wss4j-trunk/ws/wss4j/ws-security-dom/target/wss4j-ws-security-dom-2.0-SNAPSHOT.jar>
to /home/hudson/hudson/jobs/wss4j-trunk/modules/org.apache.wss4j$wss4j-ws-security-dom/builds/2013-05-20_22-18-26/archive/org.apache.wss4j/wss4j-ws-security-dom/2.0-SNAPSHOT/wss4j-ws-security-dom-2.0-SNAPSHOT.jar
[JENKINS] Archiving <https://builds.apache.org/job/wss4j-trunk/ws/wss4j/ws-security-dom/target/wss4j-ws-security-dom-2.0-SNAPSHOT-sources.jar>
to /home/hudson/hudson/jobs/wss4j-trunk/modules/org.apache.wss4j$wss4j-ws-security-dom/builds/2013-05-20_22-18-26/archive/org.apache.wss4j/wss4j-ws-security-dom/2.0-SNAPSHOT/wss4j-ws-security-dom-2.0-SNAPSHOT-sources.jar
[JENKINS] Archiving <https://builds.apache.org/job/wss4j-trunk/ws/wss4j/ws-security-dom/target/wss4j-ws-security-dom-2.0-SNAPSHOT-tests.jar>
to /home/hudson/hudson/jobs/wss4j-trunk/modules/org.apache.wss4j$wss4j-ws-security-dom/builds/2013-05-20_22-18-26/archive/org.apache.wss4j/wss4j-ws-security-dom/2.0-SNAPSHOT/wss4j-ws-security-dom-2.0-SNAPSHOT-tests.jar
[INFO] [pmd:pmd {execution: pmd}]
[INFO] [pmd:check {execution: validate}]
[INFO] 
[WARNING] The parameter expression: 'project.build.resources' used in mojo: 'process' has
been deprecated. Use 'project.resources' instead.
[INFO] [remote-resources:process {execution: default}]
[debug] execute contextualize
[INFO] [resources:resources {execution: default-resources}]
[INFO] Using 'UTF-8' encoding to copy filtered resources.
[INFO] Copying 0 resource
[INFO] Copying 1 resource
[INFO] Copying 3 resources
[INFO] Copying 3 resources
[INFO] [compiler:compile {execution: default-compile}]
[INFO] Nothing to compile - all classes are up to date
[debug] execute contextualize
[INFO] [resources:testResources {execution: default-testResources}]
[INFO] Using 'UTF-8' encoding to copy filtered resources.
[INFO] Copying 0 resource
[INFO] Copying 64 resources
[INFO] Copying 3 resources
[INFO] Copying 3 resources
[INFO] [compiler:testCompile {execution: default-testCompile}]
[INFO] Nothing to compile - all classes are up to date
[INFO] [surefire:test {execution: default-test}]
[INFO] Skipping execution of surefire because it has already been run for this configuration
[JENKINS] Recording test results[INFO] [bundle:bundle {execution: default-bundle}]

[WARNING] Warning building bundle org.apache.wss4j:wss4j-ws-security-dom:bundle:2.0-SNAPSHOT
: Did not find matching referal for !org.apache.wss4j.dom.*
[WARNING] Warning building bundle org.apache.wss4j:wss4j-ws-security-dom:bundle:2.0-SNAPSHOT
: Did not find matching referal for org.apache.jcp.xml.dsig.internal.*
[WARNING] Warning building bundle org.apache.wss4j:wss4j-ws-security-dom:bundle:2.0-SNAPSHOT
: Did not find matching referal for org.bouncycastle.*
[INFO] Preparing source:jar
[WARNING] Removing: jar from forked lifecycle, to prevent recursive invocation.
[WARNING] Removing: check from forked lifecycle, to prevent recursive invocation.
[INFO] No goals needed for project - skipping
[INFO] [source:jar {execution: default}]
[INFO] Building jar: <https://builds.apache.org/job/wss4j-trunk/ws/wss4j/ws-security-dom/target/wss4j-ws-security-dom-2.0-SNAPSHOT-sources.jar>
[INFO] [jar:test-jar {execution: default}]
[INFO] Building jar: <https://builds.apache.org/job/wss4j-trunk/ws/wss4j/ws-security-dom/target/wss4j-ws-security-dom-2.0-SNAPSHOT-tests.jar>
[INFO] [install:install {execution: default-install}]
[INFO] Installing <https://builds.apache.org/job/wss4j-trunk/ws/wss4j/ws-security-dom/target/wss4j-ws-security-dom-2.0-SNAPSHOT.jar>
to /home/jenkins/jenkins-slave/maven-repositories/1/org/apache/wss4j/wss4j-ws-security-dom/2.0-SNAPSHOT/wss4j-ws-security-dom-2.0-SNAPSHOT.jar
[INFO] Installing <https://builds.apache.org/job/wss4j-trunk/ws/wss4j/ws-security-dom/target/wss4j-ws-security-dom-2.0-SNAPSHOT-sources.jar>
to /home/jenkins/jenkins-slave/maven-repositories/1/org/apache/wss4j/wss4j-ws-security-dom/2.0-SNAPSHOT/wss4j-ws-security-dom-2.0-SNAPSHOT-sources.jar
[INFO] Installing <https://builds.apache.org/job/wss4j-trunk/ws/wss4j/ws-security-dom/target/wss4j-ws-security-dom-2.0-SNAPSHOT-tests.jar>
to /home/jenkins/jenkins-slave/maven-repositories/1/org/apache/wss4j/wss4j-ws-security-dom/2.0-SNAPSHOT/wss4j-ws-security-dom-2.0-SNAPSHOT-tests.jar
[INFO] Installing <https://builds.apache.org/job/wss4j-trunk/ws/wss4j/ws-security-dom/target/wss4j-ws-security-dom-2.0-SNAPSHOT-sources.jar>
to /home/jenkins/jenkins-slave/maven-repositories/1/org/apache/wss4j/wss4j-ws-security-dom/2.0-SNAPSHOT/wss4j-ws-security-dom-2.0-SNAPSHOT-sources.jar
[INFO] Installing <https://builds.apache.org/job/wss4j-trunk/ws/wss4j/ws-security-dom/target/wss4j-ws-security-dom-2.0-SNAPSHOT-tests.jar>
to /home/jenkins/jenkins-slave/maven-repositories/1/org/apache/wss4j/wss4j-ws-security-dom/2.0-SNAPSHOT/wss4j-ws-security-dom-2.0-SNAPSHOT-tests.jar
[INFO] [bundle:install {execution: default-install}]
[INFO] Installing org/apache/wss4j/wss4j-ws-security-dom/2.0-SNAPSHOT/wss4j-ws-security-dom-2.0-SNAPSHOT.jar
[INFO] Writing OBR metadata
[INFO] [deploy:deploy {execution: default-deploy}]
[INFO] Retrieving previous build number from apache.snapshots.https
[WARNING] *** CHECKSUM FAILED - Checksum failed on download: local = 'bdddec1c2c17e4585f2ae58dd74f75b52445b7f2';
remote = '4e35d4dd56c589695e838afa5af303150eceb8f2' - RETRYING
[WARNING] *** CHECKSUM FAILED - Checksum failed on download: local = 'bdddec1c2c17e4585f2ae58dd74f75b52445b7f2';
remote = '4e35d4dd56c589695e838afa5af303150eceb8f2' - IGNORING
Uploading: https://repository.apache.org/content/repositories/snapshots/org/apache/wss4j/wss4j-ws-security-dom/2.0-SNAPSHOT/wss4j-ws-security-dom-2.0-20130520.221925-70.jar
296K uploaded  (wss4j-ws-security-dom-2.0-20130520.221925-70.jar)
[INFO] Uploading project information for wss4j-ws-security-dom 2.0-20130520.221925-70
[INFO] Retrieving previous metadata from apache.snapshots.https
[INFO] Uploading repository metadata for: 'artifact org.apache.wss4j:wss4j-ws-security-dom'
[INFO] Retrieving previous metadata from apache.snapshots.https
[WARNING] *** CHECKSUM FAILED - Checksum failed on download: local = 'bdddec1c2c17e4585f2ae58dd74f75b52445b7f2';
remote = '4e35d4dd56c589695e838afa5af303150eceb8f2' - RETRYING
[WARNING] *** CHECKSUM FAILED - Checksum failed on download: local = 'bdddec1c2c17e4585f2ae58dd74f75b52445b7f2';
remote = '4e35d4dd56c589695e838afa5af303150eceb8f2' - IGNORING
[INFO] Uploading repository metadata for: 'snapshot org.apache.wss4j:wss4j-ws-security-dom:2.0-SNAPSHOT'
[INFO] Retrieving previous build number from apache.snapshots.https
Uploading: https://repository.apache.org/content/repositories/snapshots/org/apache/wss4j/wss4j-ws-security-dom/2.0-SNAPSHOT/wss4j-ws-security-dom-2.0-20130520.221925-70-sources.jar
248K uploaded  (wss4j-ws-security-dom-2.0-20130520.221925-70-sources.jar)
[INFO] Retrieving previous build number from apache.snapshots.https
Uploading: https://repository.apache.org/content/repositories/snapshots/org/apache/wss4j/wss4j-ws-security-dom/2.0-SNAPSHOT/wss4j-ws-security-dom-2.0-20130520.221925-70-tests.jar
375K uploaded  (wss4j-ws-security-dom-2.0-20130520.221925-70-tests.jar)
[INFO] Retrieving previous build number from apache.snapshots.https
Uploading: https://repository.apache.org/content/repositories/snapshots/org/apache/wss4j/wss4j-ws-security-dom/2.0-SNAPSHOT/wss4j-ws-security-dom-2.0-20130520.221925-70-sources.jar
248K uploaded  (wss4j-ws-security-dom-2.0-20130520.221925-70-sources.jar)
[INFO] Retrieving previous build number from apache.snapshots.https
Uploading: https://repository.apache.org/content/repositories/snapshots/org/apache/wss4j/wss4j-ws-security-dom/2.0-SNAPSHOT/wss4j-ws-security-dom-2.0-20130520.221925-70-tests.jar
375K uploaded  (wss4j-ws-security-dom-2.0-20130520.221925-70-tests.jar)
[INFO] [bundle:deploy {execution: default-deploy}]
[INFO] Remote OBR update disabled (enable with -DremoteOBR)
[JENKINS] Archiving <https://builds.apache.org/job/wss4j-trunk/ws/wss4j/ws-security-dom/target/wss4j-ws-security-dom-2.0-SNAPSHOT.jar>
to /home/hudson/hudson/jobs/wss4j-trunk/modules/org.apache.wss4j$wss4j-ws-security-dom/builds/2013-05-20_22-18-26/archive/org.apache.wss4j/wss4j-ws-security-dom/2.0-20130520.221925-70/wss4j-ws-security-dom-2.0-20130520.221925-70.jar
[JENKINS] Archiving <https://builds.apache.org/job/wss4j-trunk/ws/wss4j/ws-security-dom/target/wss4j-ws-security-dom-2.0-SNAPSHOT-sources.jar>
to /home/hudson/hudson/jobs/wss4j-trunk/modules/org.apache.wss4j$wss4j-ws-security-dom/builds/2013-05-20_22-18-26/archive/org.apache.wss4j/wss4j-ws-security-dom/2.0-20130520.221925-70/wss4j-ws-security-dom-2.0-20130520.221925-70-sources.jar
[JENKINS] Archiving <https://builds.apache.org/job/wss4j-trunk/ws/wss4j/ws-security-dom/target/wss4j-ws-security-dom-2.0-SNAPSHOT-tests.jar>
to /home/hudson/hudson/jobs/wss4j-trunk/modules/org.apache.wss4j$wss4j-ws-security-dom/builds/2013-05-20_22-18-26/archive/org.apache.wss4j/wss4j-ws-security-dom/2.0-20130520.221925-70/wss4j-ws-security-dom-2.0-20130520.221925-70-tests.jar
[INFO] ------------------------------------------------------------------------
[INFO] Building Apache WSS4J Streaming WS-Security
[INFO]    task-segment: [clean, install, deploy]
[INFO] ------------------------------------------------------------------------
[INFO] [clean:clean {execution: default-clean}]
[INFO] Deleting <https://builds.apache.org/job/wss4j-trunk/ws/wss4j/ws-security-stax/target>
[INFO] Preparing pmd:check
[JENKINS] Archiving <https://builds.apache.org/job/wss4j-trunk/ws/wss4j/ws-security-stax/pom.xml>
to /home/hudson/hudson/jobs/wss4j-trunk/modules/org.apache.wss4j$wss4j-ws-security-stax/builds/2013-05-20_22-18-26/archive/org.apache.wss4j/wss4j-ws-security-stax/2.0-SNAPSHOT/wss4j-ws-security-stax-2.0-SNAPSHOT.pom
[INFO] [pmd:pmd {execution: pmd}]
[INFO] [pmd:check {execution: validate}]
[INFO] 
[WARNING] The parameter expression: 'project.build.resources' used in mojo: 'process' has
been deprecated. Use 'project.resources' instead.
[INFO] [remote-resources:process {execution: default}]
[INFO] snapshot org.apache.wss4j:wss4j-ws-security-dom:2.0-SNAPSHOT: checking for updates
from apache.snapshots
[debug] execute contextualize
[INFO] [resources:resources {execution: default-resources}]
[INFO] Using 'UTF-8' encoding to copy filtered resources.
[INFO] Copying 0 resource
[INFO] Copying 3 resources
[INFO] skip non existing resourceDirectory <https://builds.apache.org/job/wss4j-trunk/ws/wss4j/ws-security-stax/src/main/resources-filtered>
[INFO] skip non existing resourceDirectory <https://builds.apache.org/job/wss4j-trunk/ws/wss4j/ws-security-stax/target/generated/src/main/resources>
[INFO] Copying 3 resources
[INFO] [compiler:compile {execution: default-compile}]
[INFO] Changes detected - recompiling the module!
[INFO] Compiling 116 source files to <https://builds.apache.org/job/wss4j-trunk/ws/wss4j/ws-security-stax/target/classes>
[INFO] -------------------------------------------------------------
[ERROR] COMPILATION ERROR : 
[INFO] -------------------------------------------------------------
[ERROR] <https://builds.apache.org/job/wss4j-trunk/ws/wss4j/ws-security-stax/src/main/java/org/apache/wss4j/stax/impl/processor/output/WSSSignatureEndingOutputProcessor.java>:[230,14]
cannot find symbol
symbol  : method flushBufferAndCallbackAfterHeader(org.apache.xml.security.stax.ext.OutputProcessorChain,java.util.Deque<org.apache.xml.security.stax.ext.stax.XMLSecEvent>)
location: class org.apache.xml.security.stax.impl.processor.output.AbstractSignatureEndingOutputProcessor
[ERROR] <https://builds.apache.org/job/wss4j-trunk/ws/wss4j/ws-security-stax/src/main/java/org/apache/wss4j/stax/impl/processor/output/WSSSignatureEndingOutputProcessor.java>:[191,5]
method does not override or implement a method from a supertype
[ERROR] <https://builds.apache.org/job/wss4j-trunk/ws/wss4j/ws-security-stax/src/main/java/org/apache/wss4j/stax/impl/processor/output/EncryptEndingOutputProcessor.java>:[93,14]
cannot find symbol
symbol  : method flushBufferAndCallbackAfterHeader(org.apache.xml.security.stax.ext.OutputProcessorChain,java.util.Deque<org.apache.xml.security.stax.ext.stax.XMLSecEvent>)
location: class org.apache.xml.security.stax.impl.processor.output.AbstractEncryptEndingOutputProcessor
[ERROR] <https://builds.apache.org/job/wss4j-trunk/ws/wss4j/ws-security-stax/src/main/java/org/apache/wss4j/stax/impl/processor/output/EncryptEndingOutputProcessor.java>:[53,5]
method does not override or implement a method from a supertype
[INFO] 4 errors 
[INFO] -------------------------------------------------------------
[INFO] ------------------------------------------------------------------------
[ERROR] BUILD FAILURE
[INFO] ------------------------------------------------------------------------
[INFO] Compilation failure

<https://builds.apache.org/job/wss4j-trunk/ws/wss4j/ws-security-stax/src/main/java/org/apache/wss4j/stax/impl/processor/output/WSSSignatureEndingOutputProcessor.java>:[230,14]
cannot find symbol
symbol  : method flushBufferAndCallbackAfterHeader(org.apache.xml.security.stax.ext.OutputProcessorChain,java.util.Deque<org.apache.xml.security.stax.ext.stax.XMLSecEvent>)
location: class org.apache.xml.security.stax.impl.processor.output.AbstractSignatureEndingOutputProcessor
<https://builds.apache.org/job/wss4j-trunk/ws/wss4j/ws-security-stax/src/main/java/org/apache/wss4j/stax/impl/processor/output/WSSSignatureEndingOutputProcessor.java>:[191,5]
method does not override or implement a method from a supertype
<https://builds.apache.org/job/wss4j-trunk/ws/wss4j/ws-security-stax/src/main/java/org/apache/wss4j/stax/impl/processor/output/EncryptEndingOutputProcessor.java>:[93,14]
cannot find symbol
symbol  : method flushBufferAndCallbackAfterHeader(org.apache.xml.security.stax.ext.OutputProcessorChain,java.util.Deque<org.apache.xml.security.stax.ext.stax.XMLSecEvent>)
location: class org.apache.xml.security.stax.impl.processor.output.AbstractEncryptEndingOutputProcessor
<https://builds.apache.org/job/wss4j-trunk/ws/wss4j/ws-security-stax/src/main/java/org/apache/wss4j/stax/impl/processor/output/EncryptEndingOutputProcessor.java>:[53,5]
method does not override or implement a method from a supertype

[INFO] ------------------------------------------------------------------------
[INFO] For more information, run Maven with the -e switch
[INFO] ------------------------------------------------------------------------
[INFO] Total time: 7 minutes 7 seconds
[INFO] Finished at: Mon May 20 22:26:08 UTC 2013
[INFO] Final Memory: 118M/453M
[INFO] ------------------------------------------------------------------------
Sending e-mails to: dev@ws.apache.org gigerstyle@gmx.ch
channel stopped

---------------------------------------------------------------------
To unsubscribe, e-mail: dev-unsubscribe@ws.apache.org
For additional commands, e-mail: dev-help@ws.apache.org


Mime
View raw message