ws-dev mailing list archives

Site index · List index
Message view « Date » · « Thread »
Top « Date » · « Thread »
From Apache Jenkins Server <jenk...@builds.apache.org>
Subject Build failed in Jenkins: ws-axiom-trunk #1525
Date Tue, 14 May 2013 11:38:00 GMT
See <https://builds.apache.org/job/ws-axiom-trunk/1525/>

------------------------------------------
[...truncated 2836 lines...]
Generating <https://builds.apache.org/job/ws-axiom-trunk/ws/axiom/modules/axiom-dom-testsuite/target/apidocs/org/apache/axiom/ts/dom/attr//class-use/TestGetFirstChild.html...>
Generating <https://builds.apache.org/job/ws-axiom-trunk/ws/axiom/modules/axiom-dom-testsuite/target/apidocs/org/apache/axiom/ts/dom/attr//class-use/TestLookupNamespaceURIWithoutOwnerElement.html...>
Generating <https://builds.apache.org/job/ws-axiom-trunk/ws/axiom/modules/axiom-dom-testsuite/target/apidocs/org/apache/axiom/ts/dom/attr//class-use/TestSetPrefixNotNullWithNamespace.html...>
Generating <https://builds.apache.org/job/ws-axiom-trunk/ws/axiom/modules/axiom-dom-testsuite/target/apidocs/org/apache/axiom/ts/dom/attr//class-use/TestSetPrefixNotNullWithoutNamespace.html...>
Generating <https://builds.apache.org/job/ws-axiom-trunk/ws/axiom/modules/axiom-dom-testsuite/target/apidocs/org/apache/axiom/ts/dom/attr//class-use/TestCloneNode.html...>
Generating <https://builds.apache.org/job/ws-axiom-trunk/ws/axiom/modules/axiom-dom-testsuite/target/apidocs/org/apache/axiom/ts/dom/attr//class-use/TestLookupNamespaceURI.html...>
Generating <https://builds.apache.org/job/ws-axiom-trunk/ws/axiom/modules/axiom-dom-testsuite/target/apidocs/org/apache/axiom/ts/dom//package-use.html...>
Generating <https://builds.apache.org/job/ws-axiom-trunk/ws/axiom/modules/axiom-dom-testsuite/target/apidocs/org/apache/axiom/ts/dom/attr//package-use.html...>
Generating <https://builds.apache.org/job/ws-axiom-trunk/ws/axiom/modules/axiom-dom-testsuite/target/apidocs/org/apache/axiom/ts/dom/builder//package-use.html...>
Generating <https://builds.apache.org/job/ws-axiom-trunk/ws/axiom/modules/axiom-dom-testsuite/target/apidocs/org/apache/axiom/ts/dom/document//package-use.html...>
Generating <https://builds.apache.org/job/ws-axiom-trunk/ws/axiom/modules/axiom-dom-testsuite/target/apidocs/org/apache/axiom/ts/dom/documentfragment//package-use.html...>
Generating <https://builds.apache.org/job/ws-axiom-trunk/ws/axiom/modules/axiom-dom-testsuite/target/apidocs/org/apache/axiom/ts/dom/documenttype//package-use.html...>
Generating <https://builds.apache.org/job/ws-axiom-trunk/ws/axiom/modules/axiom-dom-testsuite/target/apidocs/org/apache/axiom/ts/dom/element//package-use.html...>
Generating <https://builds.apache.org/job/ws-axiom-trunk/ws/axiom/modules/axiom-dom-testsuite/target/apidocs/org/apache/axiom/ts/dom/element/attributes//package-use.html...>
Generating <https://builds.apache.org/job/ws-axiom-trunk/ws/axiom/modules/axiom-dom-testsuite/target/apidocs/org/apache/axiom/ts/dom/text//package-use.html...>
Building index for all the packages and classes...
Generating <https://builds.apache.org/job/ws-axiom-trunk/ws/axiom/modules/axiom-dom-testsuite/target/apidocs/overview-tree.html...>
Generating <https://builds.apache.org/job/ws-axiom-trunk/ws/axiom/modules/axiom-dom-testsuite/target/apidocs/index-all.html...>
Generating <https://builds.apache.org/job/ws-axiom-trunk/ws/axiom/modules/axiom-dom-testsuite/target/apidocs/deprecated-list.html...>
Building index for all classes...
Generating <https://builds.apache.org/job/ws-axiom-trunk/ws/axiom/modules/axiom-dom-testsuite/target/apidocs/allclasses-frame.html...>
Generating <https://builds.apache.org/job/ws-axiom-trunk/ws/axiom/modules/axiom-dom-testsuite/target/apidocs/allclasses-noframe.html...>
Generating <https://builds.apache.org/job/ws-axiom-trunk/ws/axiom/modules/axiom-dom-testsuite/target/apidocs/index.html...>
Generating <https://builds.apache.org/job/ws-axiom-trunk/ws/axiom/modules/axiom-dom-testsuite/target/apidocs/overview-summary.html...>
Generating <https://builds.apache.org/job/ws-axiom-trunk/ws/axiom/modules/axiom-dom-testsuite/target/apidocs/help-doc.html...>
Generating <https://builds.apache.org/job/ws-axiom-trunk/ws/axiom/modules/axiom-dom-testsuite/target/apidocs/stylesheet.css...>
[INFO] Building jar: <https://builds.apache.org/job/ws-axiom-trunk/ws/axiom/modules/axiom-dom-testsuite/target/axiom-dom-testsuite-1.2.15-SNAPSHOT-javadoc.jar>
[INFO] [INFO] Checking unresolved references to org.codehaus.mojo.signature:java15:1.0

[INFO] --- animal-sniffer-maven-plugin:1.8:check (default) @ axiom-dom-testsuite ---
[INFO] 
[INFO] --- maven-gpg-plugin:1.1:sign (default) @ axiom-dom-testsuite ---
[INFO] [INFO] Exclude: src/main/resources/**

[INFO] --- apache-rat-plugin:0.8:check (default) @ axiom-dom-testsuite ---
[INFO] [INFO] Installing <https://builds.apache.org/job/ws-axiom-trunk/ws/axiom/modules/axiom-dom-testsuite/target/axiom-dom-testsuite-1.2.15-SNAPSHOT.jar>
to <https://builds.apache.org/job/ws-axiom-trunk/ws/.repository/org/apache/ws/commons/axiom/axiom-dom-testsuite/1.2.15-SNAPSHOT/axiom-dom-testsuite-1.2.15-SNAPSHOT.jar>
[INFO] Installing <https://builds.apache.org/job/ws-axiom-trunk/ws/axiom/modules/axiom-dom-testsuite/pom.xml>
to <https://builds.apache.org/job/ws-axiom-trunk/ws/.repository/org/apache/ws/commons/axiom/axiom-dom-testsuite/1.2.15-SNAPSHOT/axiom-dom-testsuite-1.2.15-SNAPSHOT.pom>
[INFO] Installing <https://builds.apache.org/job/ws-axiom-trunk/ws/axiom/modules/axiom-dom-testsuite/target/jacoco.exec>
to <https://builds.apache.org/job/ws-axiom-trunk/ws/.repository/org/apache/ws/commons/axiom/axiom-dom-testsuite/1.2.15-SNAPSHOT/axiom-dom-testsuite-1.2.15-SNAPSHOT-jacoco.exec>

[INFO] Installing <https://builds.apache.org/job/ws-axiom-trunk/ws/axiom/modules/axiom-dom-testsuite/target/axiom-dom-testsuite-1.2.15-SNAPSHOT-sources.jar>
to <https://builds.apache.org/job/ws-axiom-trunk/ws/.repository/org/apache/ws/commons/axiom/axiom-dom-testsuite/1.2.15-SNAPSHOT/axiom-dom-testsuite-1.2.15-SNAPSHOT-sources.jar>
[INFO] --- maven-install-plugin:2.3.1:install (default-install) @ axiom-dom-testsuite ---[INFO]
Installing <https://builds.apache.org/job/ws-axiom-trunk/ws/axiom/modules/axiom-dom-testsuite/target/axiom-dom-testsuite-1.2.15-SNAPSHOT-javadoc.jar>
to <https://builds.apache.org/job/ws-axiom-trunk/ws/.repository/org/apache/ws/commons/axiom/axiom-dom-testsuite/1.2.15-SNAPSHOT/axiom-dom-testsuite-1.2.15-SNAPSHOT-javadoc.jar>

[INFO] Downloading: https://repository.apache.org/content/repositories/snapshots/org/apache/ws/commons/axiom/axiom-dom-testsuite/1.2.15-SNAPSHOT/maven-metadata.xml

[INFO] --- maven-deploy-plugin:2.5:deploy (default-deploy) @ axiom-dom-testsuite ---
Downloaded: https://repository.apache.org/content/repositories/snapshots/org/apache/ws/commons/axiom/axiom-dom-testsuite/1.2.15-SNAPSHOT/maven-metadata.xml
(2 KB at 2.1 KB/sec)
Uploading: https://repository.apache.org/content/repositories/snapshots/org/apache/ws/commons/axiom/axiom-dom-testsuite/1.2.15-SNAPSHOT/axiom-dom-testsuite-1.2.15-20130514.113626-227.jar
Uploaded: https://repository.apache.org/content/repositories/snapshots/org/apache/ws/commons/axiom/axiom-dom-testsuite/1.2.15-SNAPSHOT/axiom-dom-testsuite-1.2.15-20130514.113626-227.jar
(124 KB at 608.4 KB/sec)
Uploading: https://repository.apache.org/content/repositories/snapshots/org/apache/ws/commons/axiom/axiom-dom-testsuite/1.2.15-SNAPSHOT/axiom-dom-testsuite-1.2.15-20130514.113626-227.pom
Uploaded: https://repository.apache.org/content/repositories/snapshots/org/apache/ws/commons/axiom/axiom-dom-testsuite/1.2.15-SNAPSHOT/axiom-dom-testsuite-1.2.15-20130514.113626-227.pom
(6 KB at 101.8 KB/sec)
Downloading: https://repository.apache.org/content/repositories/snapshots/org/apache/ws/commons/axiom/axiom-dom-testsuite/maven-metadata.xml
Downloaded: https://repository.apache.org/content/repositories/snapshots/org/apache/ws/commons/axiom/axiom-dom-testsuite/maven-metadata.xml
(368 B at 3.8 KB/sec)
Uploading: https://repository.apache.org/content/repositories/snapshots/org/apache/ws/commons/axiom/axiom-dom-testsuite/1.2.15-SNAPSHOT/maven-metadata.xml
Uploaded: https://repository.apache.org/content/repositories/snapshots/org/apache/ws/commons/axiom/axiom-dom-testsuite/1.2.15-SNAPSHOT/maven-metadata.xml
(2 KB at 11.7 KB/sec)
Uploading: https://repository.apache.org/content/repositories/snapshots/org/apache/ws/commons/axiom/axiom-dom-testsuite/maven-metadata.xml
Uploaded: https://repository.apache.org/content/repositories/snapshots/org/apache/ws/commons/axiom/axiom-dom-testsuite/maven-metadata.xml
(368 B at 4.1 KB/sec)
Uploading: https://repository.apache.org/content/repositories/snapshots/org/apache/ws/commons/axiom/axiom-dom-testsuite/1.2.15-SNAPSHOT/axiom-dom-testsuite-1.2.15-20130514.113626-227-jacoco.exec
Uploaded: https://repository.apache.org/content/repositories/snapshots/org/apache/ws/commons/axiom/axiom-dom-testsuite/1.2.15-SNAPSHOT/axiom-dom-testsuite-1.2.15-20130514.113626-227-jacoco.exec
(39 KB at 658.2 KB/sec)
Uploading: https://repository.apache.org/content/repositories/snapshots/org/apache/ws/commons/axiom/axiom-dom-testsuite/1.2.15-SNAPSHOT/maven-metadata.xml
Uploaded: https://repository.apache.org/content/repositories/snapshots/org/apache/ws/commons/axiom/axiom-dom-testsuite/1.2.15-SNAPSHOT/maven-metadata.xml
(2 KB at 27.3 KB/sec)
Uploading: https://repository.apache.org/content/repositories/snapshots/org/apache/ws/commons/axiom/axiom-dom-testsuite/1.2.15-SNAPSHOT/axiom-dom-testsuite-1.2.15-20130514.113626-227-sources.jar
Uploaded: https://repository.apache.org/content/repositories/snapshots/org/apache/ws/commons/axiom/axiom-dom-testsuite/1.2.15-SNAPSHOT/axiom-dom-testsuite-1.2.15-20130514.113626-227-sources.jar
(122 KB at 1990.5 KB/sec)
Uploading: https://repository.apache.org/content/repositories/snapshots/org/apache/ws/commons/axiom/axiom-dom-testsuite/1.2.15-SNAPSHOT/maven-metadata.xml
Uploaded: https://repository.apache.org/content/repositories/snapshots/org/apache/ws/commons/axiom/axiom-dom-testsuite/1.2.15-SNAPSHOT/maven-metadata.xml
(2 KB at 7.6 KB/sec)
Uploading: https://repository.apache.org/content/repositories/snapshots/org/apache/ws/commons/axiom/axiom-dom-testsuite/1.2.15-SNAPSHOT/axiom-dom-testsuite-1.2.15-20130514.113626-227-javadoc.jar
Uploaded: https://repository.apache.org/content/repositories/snapshots/org/apache/ws/commons/axiom/axiom-dom-testsuite/1.2.15-SNAPSHOT/axiom-dom-testsuite-1.2.15-20130514.113626-227-javadoc.jar
(558 KB at 5464.2 KB/sec)
Uploading: https://repository.apache.org/content/repositories/snapshots/org/apache/ws/commons/axiom/axiom-dom-testsuite/1.2.15-SNAPSHOT/maven-metadata.xml
Uploaded: https://repository.apache.org/content/repositories/snapshots/org/apache/ws/commons/axiom/axiom-dom-testsuite/1.2.15-SNAPSHOT/maven-metadata.xml
(2 KB at 19.5 KB/sec)
[INFO]                                                                         
[INFO] ------------------------------------------------------------------------
[INFO] Building Axiom API 1.2.15-SNAPSHOT
[INFO] ------------------------------------------------------------------------
Downloading: http://repo.maven.apache.org/maven2/org/apache/geronimo/specs/geronimo-javamail_1.4_spec/1.7.1/geronimo-javamail_1.4_spec-1.7.1.pom
Downloaded: http://repo.maven.apache.org/maven2/org/apache/geronimo/specs/geronimo-javamail_1.4_spec/1.7.1/geronimo-javamail_1.4_spec-1.7.1.pom
(7 KB at 263.6 KB/sec)
Downloading: http://repository.apache.org/snapshots/org/apache/james/apache-mime4j-core/0.8.0-SNAPSHOT/maven-metadata.xml
Downloaded: http://repository.apache.org/snapshots/org/apache/james/apache-mime4j-core/0.8.0-SNAPSHOT/maven-metadata.xml
(2 KB at 2.3 KB/sec)
Downloading: http://repository.apache.org/snapshots/org/apache/james/apache-mime4j-core/0.8.0-SNAPSHOT/apache-mime4j-core-0.8.0-20130514.111436-49.pom
Downloaded: http://repository.apache.org/snapshots/org/apache/james/apache-mime4j-core/0.8.0-SNAPSHOT/apache-mime4j-core-0.8.0-20130514.111436-49.pom
(3 KB at 8.7 KB/sec)
Downloading: http://repository.apache.org/snapshots/org/apache/james/apache-mime4j-project/0.8.0-SNAPSHOT/maven-metadata.xml
Downloaded: http://repository.apache.org/snapshots/org/apache/james/apache-mime4j-project/0.8.0-SNAPSHOT/maven-metadata.xml
(2 KB at 3.9 KB/sec)
Downloading: http://repository.apache.org/snapshots/org/apache/james/apache-mime4j-project/0.8.0-SNAPSHOT/apache-mime4j-project-0.8.0-20130514.111417-51.pom
Downloaded: http://repository.apache.org/snapshots/org/apache/james/apache-mime4j-project/0.8.0-SNAPSHOT/apache-mime4j-project-0.8.0-20130514.111417-51.pom
(8 KB at 74.4 KB/sec)
Downloading: http://repo.maven.apache.org/maven2/org/apache/james/james-project/1.8.2/james-project-1.8.2.pom
Downloaded: http://repo.maven.apache.org/maven2/org/apache/james/james-project/1.8.2/james-project-1.8.2.pom
(58 KB at 163.1 KB/sec)
Downloading: http://repo.maven.apache.org/maven2/org/apache/apache/12/apache-12.pom
Downloaded: http://repo.maven.apache.org/maven2/org/apache/apache/12/apache-12.pom (16 KB
at 265.9 KB/sec)
Downloading: http://repo.maven.apache.org/maven2/org/osgi/org.osgi.compendium/4.2.0/org.osgi.compendium-4.2.0.pom
Downloaded: http://repo.maven.apache.org/maven2/org/osgi/org.osgi.compendium/4.2.0/org.osgi.compendium-4.2.0.pom
(463 B at 10.5 KB/sec)
Downloading: http://repo.maven.apache.org/maven2/org/apache/geronimo/specs/geronimo-javamail_1.4_spec/1.7.1/geronimo-javamail_1.4_spec-1.7.1.jar
Downloading: http://repo.maven.apache.org/maven2/org/osgi/org.osgi.compendium/4.2.0/org.osgi.compendium-4.2.0.jar
Downloaded: http://repo.maven.apache.org/maven2/org/osgi/org.osgi.compendium/4.2.0/org.osgi.compendium-4.2.0.jar
(600 KB at 5880.0 KB/sec)
Downloaded: http://repo.maven.apache.org/maven2/org/apache/geronimo/specs/geronimo-javamail_1.4_spec/1.7.1/geronimo-javamail_1.4_spec-1.7.1.jar
(219 KB at 982.3 KB/sec)
Downloading: http://repository.apache.org/snapshots/org/apache/james/apache-mime4j-core/0.8.0-SNAPSHOT/apache-mime4j-core-0.8.0-20130514.111436-49.jar
Downloaded: http://repository.apache.org/snapshots/org/apache/james/apache-mime4j-core/0.8.0-SNAPSHOT/apache-mime4j-core-0.8.0-20130514.111436-49.jar
(101 KB at 634.6 KB/sec)
[INFO] 
[INFO] --- maven-clean-plugin:2.4.1:clean (default-clean) @ axiom-api ---
[INFO] Deleting <https://builds.apache.org/job/ws-axiom-trunk/ws/axiom/modules/axiom-api/target>
[INFO] 
[INFO] --- maven-enforcer-plugin:1.1:enforce (default) @ axiom-api ---
[INFO] 
[INFO] --- gmaven-plugin:1.2:execute (initialize) @ axiom-api ---
[INFO] 
[INFO] --- jacoco-maven-plugin:0.6.1.201212231917:prepare-agent (prepare-agent-for-surefire)
@ axiom-api ---
[INFO] jacoco.surefireArgLine set to -javaagent:<https://builds.apache.org/job/ws-axiom-trunk/ws/.repository/org/jacoco/org.jacoco.agent/0.6.1.201212231917/org.jacoco.agent-0.6.1.201212231917-runtime.jar=destfile=/home/jenkins/jenkins-slave/workspace/ws-axiom-trunk/axiom/modules/axiom-api/target/jacoco.exec,sessionid=mvn>:org.apache.ws.commons.axiom:axiom-api:1.2.15-SNAPSHOT:surefire
[INFO] 
[INFO] --- maven-remote-resources-plugin:1.1:process (default) @ axiom-api ---
[INFO] Setting property: classpath.resource.loader.class => 'org.codehaus.plexus.velocity.ContextClassLoaderResourceLoader'.
[INFO] Setting property: velocimacro.messages.on => 'false'.
[INFO] Setting property: resource.loader => 'classpath'.
[INFO] Setting property: resource.manager.logwhenfound => 'false'.
[WARNING] org.apache.velocity.runtime.exception.ReferenceException: reference : template =
META-INF/DEPENDENCIES.vm [line 40,column 14] : $license.name is not a valid reference.
[INFO] 
[INFO] --- maven-resources-plugin:2.4.3:resources (default-resources) @ axiom-api ---
[INFO] Using 'UTF-8' encoding to copy filtered resources.
[INFO] Copying 0 resource
[INFO] Copying 3 resources
[INFO] 
[INFO] --- maven-compiler-plugin:2.3.2:compile (default-compile) @ axiom-api ---
[INFO] Compiling 290 source files to <https://builds.apache.org/job/ws-axiom-trunk/ws/axiom/modules/axiom-api/target/classes>
[INFO] -------------------------------------------------------------
[ERROR] COMPILATION ERROR : 
[INFO] -------------------------------------------------------------
[ERROR] <https://builds.apache.org/job/ws-axiom-trunk/ws/axiom/modules/axiom-api/src/main/java/org/apache/axiom/attachments/MIMEMessage.java>:[127,28]
MimeConfig(boolean,int,int,int,long,boolean,java.lang.String,boolean) in org.apache.james.mime4j.stream.MimeConfig
cannot be applied to ()
[ERROR] <https://builds.apache.org/job/ws-axiom-trunk/ws/axiom/modules/axiom-api/src/main/java/org/apache/axiom/attachments/MIMEMessage.java>:[128,14]
cannot find symbol
symbol  : method setStrictParsing(boolean)
location: class org.apache.james.mime4j.stream.MimeConfig
[INFO] 2 errors 
[INFO] -------------------------------------------------------------
[INFO] ------------------------------------------------------------------------
[INFO] Reactor Summary:
[INFO] 
[INFO] Axiom ............................................. SUCCESS [51.837s]
[INFO] Axiom Build Utilities ............................. SUCCESS [9.355s]
[INFO] Axiom Test Utilities .............................. SUCCESS [6.939s]
[INFO] Axiom Jaxen Test Suite ............................ SUCCESS [5.942s]
[INFO] Axiom DOM Test Suite .............................. SUCCESS [14.936s]
[INFO] Axiom API ......................................... FAILURE [7.209s]
[INFO] Axiom Implementation Test Suite ................... SKIPPED
[INFO] Axiom Common Implementation Classes ............... SKIPPED
[INFO] Axiom Impl ........................................ SKIPPED
[INFO] Axiom DOM ......................................... SKIPPED
[INFO] Axiom Compatibility Classes ....................... SKIPPED
[INFO] Axiom JAXB Integration ............................ SKIPPED
[INFO] Axiom C14N ........................................ SKIPPED
[INFO] Axiom Test Suite .................................. SKIPPED
[INFO] Axiom Integration Test Suite ...................... SKIPPED
[INFO] Axiom Uber-JAR .................................... SKIPPED
[INFO] Axiom Samples ..................................... SKIPPED
[INFO] System Tests ...................................... SKIPPED
[INFO] JBoss Tests ....................................... SKIPPED
[INFO] Axiom OSGi Tests .................................. SKIPPED
[INFO] Spring WS Tests ................................... SKIPPED
[INFO] Developer Guide ................................... SKIPPED
[INFO] User Guide ........................................ SKIPPED
[INFO] Javadoc ........................................... SKIPPED
[INFO] Distribution ...................................... SKIPPED
[INFO] Code Coverage Report .............................. SKIPPED
[INFO] ------------------------------------------------------------------------
[INFO] BUILD FAILURE
[INFO] ------------------------------------------------------------------------
[INFO] Total time: 1:41.594s
[INFO] Finished at: Tue May 14 11:36:35 UTC 2013
[INFO] Final Memory: 57M/147M
[INFO] ------------------------------------------------------------------------
[JENKINS] Archiving <https://builds.apache.org/job/ws-axiom-trunk/ws/axiom/userguide/pom.xml>
to /home/hudson/hudson/jobs/ws-axiom-trunk/modules/org.apache.ws.commons.axiom$userguide/builds/2013-05-14_11-34-48/archive/org.apache.ws.commons.axiom/userguide/1.2.15-SNAPSHOT/userguide-1.2.15-SNAPSHOT.pom
[JENKINS] Archiving <https://builds.apache.org/job/ws-axiom-trunk/ws/axiom/modules/axiom-dom-testsuite/pom.xml>
to /home/hudson/hudson/jobs/ws-axiom-trunk/modules/org.apache.ws.commons.axiom$axiom-dom-testsuite/builds/2013-05-14_11-34-48/archive/org.apache.ws.commons.axiom/axiom-dom-testsuite/1.2.15-SNAPSHOT/axiom-dom-testsuite-1.2.15-SNAPSHOT.pom
[JENKINS] Archiving <https://builds.apache.org/job/ws-axiom-trunk/ws/axiom/modules/axiom-dom-testsuite/target/axiom-dom-testsuite-1.2.15-SNAPSHOT.jar>
to /home/hudson/hudson/jobs/ws-axiom-trunk/modules/org.apache.ws.commons.axiom$axiom-dom-testsuite/builds/2013-05-14_11-34-48/archive/org.apache.ws.commons.axiom/axiom-dom-testsuite/1.2.15-20130514.113626-227/axiom-dom-testsuite-1.2.15-20130514.113626-227.jar
[JENKINS] Archiving <https://builds.apache.org/job/ws-axiom-trunk/ws/axiom/modules/axiom-dom-testsuite/target/jacoco.exec>
to /home/hudson/hudson/jobs/ws-axiom-trunk/modules/org.apache.ws.commons.axiom$axiom-dom-testsuite/builds/2013-05-14_11-34-48/archive/org.apache.ws.commons.axiom/axiom-dom-testsuite/1.2.15-20130514.113626-227/axiom-dom-testsuite-1.2.15-20130514.113626-227-jacoco.exec
[JENKINS] Archiving <https://builds.apache.org/job/ws-axiom-trunk/ws/axiom/modules/axiom-dom-testsuite/target/axiom-dom-testsuite-1.2.15-SNAPSHOT-sources.jar>
to /home/hudson/hudson/jobs/ws-axiom-trunk/modules/org.apache.ws.commons.axiom$axiom-dom-testsuite/builds/2013-05-14_11-34-48/archive/org.apache.ws.commons.axiom/axiom-dom-testsuite/1.2.15-20130514.113626-227/axiom-dom-testsuite-1.2.15-20130514.113626-227-sources.jar
[JENKINS] Archiving <https://builds.apache.org/job/ws-axiom-trunk/ws/axiom/modules/axiom-dom-testsuite/target/axiom-dom-testsuite-1.2.15-SNAPSHOT-javadoc.jar>
to /home/hudson/hudson/jobs/ws-axiom-trunk/modules/org.apache.ws.commons.axiom$axiom-dom-testsuite/builds/2013-05-14_11-34-48/archive/org.apache.ws.commons.axiom/axiom-dom-testsuite/1.2.15-20130514.113626-227/axiom-dom-testsuite-1.2.15-20130514.113626-227-javadoc.jar
[JENKINS] Archiving <https://builds.apache.org/job/ws-axiom-trunk/ws/axiom/modules/axiom-impl/pom.xml>
to /home/hudson/hudson/jobs/ws-axiom-trunk/modules/org.apache.ws.commons.axiom$axiom-impl/builds/2013-05-14_11-34-48/archive/org.apache.ws.commons.axiom/axiom-impl/1.2.15-SNAPSHOT/axiom-impl-1.2.15-SNAPSHOT.pom
[JENKINS] Archiving <https://builds.apache.org/job/ws-axiom-trunk/ws/axiom/distribution/pom.xml>
to /home/hudson/hudson/jobs/ws-axiom-trunk/modules/org.apache.ws.commons.axiom$distribution/builds/2013-05-14_11-34-48/archive/org.apache.ws.commons.axiom/distribution/1.2.15-SNAPSHOT/distribution-1.2.15-SNAPSHOT.pom
[JENKINS] Archiving <https://builds.apache.org/job/ws-axiom-trunk/ws/axiom/code-coverage/pom.xml>
to /home/hudson/hudson/jobs/ws-axiom-trunk/modules/org.apache.ws.commons.axiom$code-coverage/builds/2013-05-14_11-34-48/archive/org.apache.ws.commons.axiom/code-coverage/1.2.15-SNAPSHOT/code-coverage-1.2.15-SNAPSHOT.pom
[JENKINS] Archiving <https://builds.apache.org/job/ws-axiom-trunk/ws/axiom/systests/pom.xml>
to /home/hudson/hudson/jobs/ws-axiom-trunk/modules/org.apache.ws.commons.axiom$systests/builds/2013-05-14_11-34-48/archive/org.apache.ws.commons.axiom/systests/1.2.15-SNAPSHOT/systests-1.2.15-SNAPSHOT.pom
[JENKINS] Archiving <https://builds.apache.org/job/ws-axiom-trunk/ws/axiom/modules/axiom-samples/pom.xml>
to /home/hudson/hudson/jobs/ws-axiom-trunk/modules/org.apache.ws.commons.axiom$axiom-samples/builds/2013-05-14_11-34-48/archive/org.apache.ws.commons.axiom/axiom-samples/1.2.15-SNAPSHOT/axiom-samples-1.2.15-SNAPSHOT.pom
[JENKINS] Archiving <https://builds.apache.org/job/ws-axiom-trunk/ws/axiom/systests/spring-ws-tests/pom.xml>
to /home/hudson/hudson/jobs/ws-axiom-trunk/modules/org.apache.ws.commons.axiom$spring-ws-tests/builds/2013-05-14_11-34-48/archive/org.apache.ws.commons.axiom/spring-ws-tests/1.2.15-SNAPSHOT/spring-ws-tests-1.2.15-SNAPSHOT.pom
[JENKINS] Archiving <https://builds.apache.org/job/ws-axiom-trunk/ws/axiom/modules/axiom-integration/pom.xml>
to /home/hudson/hudson/jobs/ws-axiom-trunk/modules/org.apache.ws.commons.axiom$axiom-integration/builds/2013-05-14_11-34-48/archive/org.apache.ws.commons.axiom/axiom-integration/1.2.15-SNAPSHOT/axiom-integration-1.2.15-SNAPSHOT.pom
[JENKINS] Archiving <https://builds.apache.org/job/ws-axiom-trunk/ws/axiom/modules/axiom-testsuite/pom.xml>
to /home/hudson/hudson/jobs/ws-axiom-trunk/modules/org.apache.ws.commons.axiom$axiom-testsuite/builds/2013-05-14_11-34-48/archive/org.apache.ws.commons.axiom/axiom-testsuite/1.2.15-SNAPSHOT/axiom-testsuite-1.2.15-SNAPSHOT.pom
[JENKINS] Archiving <https://builds.apache.org/job/ws-axiom-trunk/ws/axiom/modules/axiom-jaxb/pom.xml>
to /home/hudson/hudson/jobs/ws-axiom-trunk/modules/org.apache.ws.commons.axiom$axiom-jaxb/builds/2013-05-14_11-34-48/archive/org.apache.ws.commons.axiom/axiom-jaxb/1.2.15-SNAPSHOT/axiom-jaxb-1.2.15-SNAPSHOT.pom
[JENKINS] Archiving <https://builds.apache.org/job/ws-axiom-trunk/ws/axiom/modules/axiom-testutils/pom.xml>
to /home/hudson/hudson/jobs/ws-axiom-trunk/modules/org.apache.ws.commons.axiom$axiom-testutils/builds/2013-05-14_11-34-48/archive/org.apache.ws.commons.axiom/axiom-testutils/1.2.15-SNAPSHOT/axiom-testutils-1.2.15-SNAPSHOT.pom
[JENKINS] Archiving <https://builds.apache.org/job/ws-axiom-trunk/ws/axiom/modules/axiom-testutils/target/axiom-testutils-1.2.15-SNAPSHOT.jar>
to /home/hudson/hudson/jobs/ws-axiom-trunk/modules/org.apache.ws.commons.axiom$axiom-testutils/builds/2013-05-14_11-34-48/archive/org.apache.ws.commons.axiom/axiom-testutils/1.2.15-20130514.113605-227/axiom-testutils-1.2.15-20130514.113605-227.jar
[JENKINS] Archiving <https://builds.apache.org/job/ws-axiom-trunk/ws/axiom/modules/axiom-testutils/target/jacoco.exec>
to /home/hudson/hudson/jobs/ws-axiom-trunk/modules/org.apache.ws.commons.axiom$axiom-testutils/builds/2013-05-14_11-34-48/archive/org.apache.ws.commons.axiom/axiom-testutils/1.2.15-20130514.113605-227/axiom-testutils-1.2.15-20130514.113605-227-jacoco.exec
[JENKINS] Archiving <https://builds.apache.org/job/ws-axiom-trunk/ws/axiom/modules/axiom-testutils/target/axiom-testutils-1.2.15-SNAPSHOT-sources.jar>
to /home/hudson/hudson/jobs/ws-axiom-trunk/modules/org.apache.ws.commons.axiom$axiom-testutils/builds/2013-05-14_11-34-48/archive/org.apache.ws.commons.axiom/axiom-testutils/1.2.15-20130514.113605-227/axiom-testutils-1.2.15-20130514.113605-227-sources.jar
[JENKINS] Archiving <https://builds.apache.org/job/ws-axiom-trunk/ws/axiom/modules/axiom-testutils/target/axiom-testutils-1.2.15-SNAPSHOT-javadoc.jar>
to /home/hudson/hudson/jobs/ws-axiom-trunk/modules/org.apache.ws.commons.axiom$axiom-testutils/builds/2013-05-14_11-34-48/archive/org.apache.ws.commons.axiom/axiom-testutils/1.2.15-20130514.113605-227/axiom-testutils-1.2.15-20130514.113605-227-javadoc.jar
[JENKINS] Archiving <https://builds.apache.org/job/ws-axiom-trunk/ws/axiom/modules/axiom-buildutils/pom.xml>
to /home/hudson/hudson/jobs/ws-axiom-trunk/modules/org.apache.ws.commons.axiom$axiom-buildutils/builds/2013-05-14_11-34-48/archive/org.apache.ws.commons.axiom/axiom-buildutils/1.2.15-SNAPSHOT/axiom-buildutils-1.2.15-SNAPSHOT.pom
[JENKINS] Archiving <https://builds.apache.org/job/ws-axiom-trunk/ws/axiom/modules/axiom-buildutils/target/axiom-buildutils-1.2.15-SNAPSHOT.jar>
to /home/hudson/hudson/jobs/ws-axiom-trunk/modules/org.apache.ws.commons.axiom$axiom-buildutils/builds/2013-05-14_11-34-48/archive/org.apache.ws.commons.axiom/axiom-buildutils/1.2.15-20130514.113558-227/axiom-buildutils-1.2.15-20130514.113558-227.jar
[JENKINS] Archiving <https://builds.apache.org/job/ws-axiom-trunk/ws/axiom/modules/axiom-buildutils/target/jacoco.exec>
to /home/hudson/hudson/jobs/ws-axiom-trunk/modules/org.apache.ws.commons.axiom$axiom-buildutils/builds/2013-05-14_11-34-48/archive/org.apache.ws.commons.axiom/axiom-buildutils/1.2.15-20130514.113558-227/axiom-buildutils-1.2.15-20130514.113558-227-jacoco.exec
[JENKINS] Archiving <https://builds.apache.org/job/ws-axiom-trunk/ws/axiom/modules/axiom-buildutils/target/axiom-buildutils-1.2.15-SNAPSHOT-sources.jar>
to /home/hudson/hudson/jobs/ws-axiom-trunk/modules/org.apache.ws.commons.axiom$axiom-buildutils/builds/2013-05-14_11-34-48/archive/org.apache.ws.commons.axiom/axiom-buildutils/1.2.15-20130514.113558-227/axiom-buildutils-1.2.15-20130514.113558-227-sources.jar
[JENKINS] Archiving <https://builds.apache.org/job/ws-axiom-trunk/ws/axiom/modules/axiom-buildutils/target/axiom-buildutils-1.2.15-SNAPSHOT-javadoc.jar>
to /home/hudson/hudson/jobs/ws-axiom-trunk/modules/org.apache.ws.commons.axiom$axiom-buildutils/builds/2013-05-14_11-34-48/archive/org.apache.ws.commons.axiom/axiom-buildutils/1.2.15-20130514.113558-227/axiom-buildutils-1.2.15-20130514.113558-227-javadoc.jar
[JENKINS] Archiving <https://builds.apache.org/job/ws-axiom-trunk/ws/axiom/modules/axiom-dom/pom.xml>
to /home/hudson/hudson/jobs/ws-axiom-trunk/modules/org.apache.ws.commons.axiom$axiom-dom/builds/2013-05-14_11-34-48/archive/org.apache.ws.commons.axiom/axiom-dom/1.2.15-SNAPSHOT/axiom-dom-1.2.15-SNAPSHOT.pom
[JENKINS] Archiving <https://builds.apache.org/job/ws-axiom-trunk/ws/axiom/modules/axiom-all/pom.xml>
to /home/hudson/hudson/jobs/ws-axiom-trunk/modules/org.apache.ws.commons.axiom$axiom-all/builds/2013-05-14_11-34-48/archive/org.apache.ws.commons.axiom/axiom-all/1.2.15-SNAPSHOT/axiom-all-1.2.15-SNAPSHOT.pom
[JENKINS] Archiving <https://builds.apache.org/job/ws-axiom-trunk/ws/axiom/modules/axiom-api/pom.xml>
to /home/hudson/hudson/jobs/ws-axiom-trunk/modules/org.apache.ws.commons.axiom$axiom-api/builds/2013-05-14_11-34-48/archive/org.apache.ws.commons.axiom/axiom-api/1.2.15-SNAPSHOT/axiom-api-1.2.15-SNAPSHOT.pom
[JENKINS] Archiving <https://builds.apache.org/job/ws-axiom-trunk/ws/axiom/apidocs/pom.xml>
to /home/hudson/hudson/jobs/ws-axiom-trunk/modules/org.apache.ws.commons.axiom$apidocs/builds/2013-05-14_11-34-48/archive/org.apache.ws.commons.axiom/apidocs/1.2.15-SNAPSHOT/apidocs-1.2.15-SNAPSHOT.pom
[JENKINS] Archiving <https://builds.apache.org/job/ws-axiom-trunk/ws/axiom/modules/axiom-jaxen-testsuite/pom.xml>
to /home/hudson/hudson/jobs/ws-axiom-trunk/modules/org.apache.ws.commons.axiom$axiom-jaxen-testsuite/builds/2013-05-14_11-34-48/archive/org.apache.ws.commons.axiom/axiom-jaxen-testsuite/1.2.15-SNAPSHOT/axiom-jaxen-testsuite-1.2.15-SNAPSHOT.pom
[JENKINS] Archiving <https://builds.apache.org/job/ws-axiom-trunk/ws/axiom/modules/axiom-jaxen-testsuite/target/axiom-jaxen-testsuite-1.2.15-SNAPSHOT.jar>
to /home/hudson/hudson/jobs/ws-axiom-trunk/modules/org.apache.ws.commons.axiom$axiom-jaxen-testsuite/builds/2013-05-14_11-34-48/archive/org.apache.ws.commons.axiom/axiom-jaxen-testsuite/1.2.15-20130514.113611-227/axiom-jaxen-testsuite-1.2.15-20130514.113611-227.jar
[JENKINS] Archiving <https://builds.apache.org/job/ws-axiom-trunk/ws/axiom/modules/axiom-jaxen-testsuite/target/jacoco.exec>
to /home/hudson/hudson/jobs/ws-axiom-trunk/modules/org.apache.ws.commons.axiom$axiom-jaxen-testsuite/builds/2013-05-14_11-34-48/archive/org.apache.ws.commons.axiom/axiom-jaxen-testsuite/1.2.15-20130514.113611-227/axiom-jaxen-testsuite-1.2.15-20130514.113611-227-jacoco.exec
[JENKINS] Archiving <https://builds.apache.org/job/ws-axiom-trunk/ws/axiom/modules/axiom-jaxen-testsuite/target/axiom-jaxen-testsuite-1.2.15-SNAPSHOT-sources.jar>
to /home/hudson/hudson/jobs/ws-axiom-trunk/modules/org.apache.ws.commons.axiom$axiom-jaxen-testsuite/builds/2013-05-14_11-34-48/archive/org.apache.ws.commons.axiom/axiom-jaxen-testsuite/1.2.15-20130514.113611-227/axiom-jaxen-testsuite-1.2.15-20130514.113611-227-sources.jar
[JENKINS] Archiving <https://builds.apache.org/job/ws-axiom-trunk/ws/axiom/modules/axiom-jaxen-testsuite/target/axiom-jaxen-testsuite-1.2.15-SNAPSHOT-javadoc.jar>
to /home/hudson/hudson/jobs/ws-axiom-trunk/modules/org.apache.ws.commons.axiom$axiom-jaxen-testsuite/builds/2013-05-14_11-34-48/archive/org.apache.ws.commons.axiom/axiom-jaxen-testsuite/1.2.15-20130514.113611-227/axiom-jaxen-testsuite-1.2.15-20130514.113611-227-javadoc.jar
[JENKINS] Archiving <https://builds.apache.org/job/ws-axiom-trunk/ws/axiom/modules/axiom-tests/pom.xml>
to /home/hudson/hudson/jobs/ws-axiom-trunk/modules/org.apache.ws.commons.axiom$axiom-tests/builds/2013-05-14_11-34-48/archive/org.apache.ws.commons.axiom/axiom-tests/1.2.15-SNAPSHOT/axiom-tests-1.2.15-SNAPSHOT.pom
[JENKINS] Archiving <https://builds.apache.org/job/ws-axiom-trunk/ws/axiom/systests/osgi-tests/pom.xml>
to /home/hudson/hudson/jobs/ws-axiom-trunk/modules/org.apache.ws.commons.axiom$osgi-tests/builds/2013-05-14_11-34-48/archive/org.apache.ws.commons.axiom/osgi-tests/1.2.15-SNAPSHOT/osgi-tests-1.2.15-SNAPSHOT.pom
[JENKINS] Archiving <https://builds.apache.org/job/ws-axiom-trunk/ws/axiom/modules/axiom-common-impl/pom.xml>
to /home/hudson/hudson/jobs/ws-axiom-trunk/modules/org.apache.ws.commons.axiom$axiom-common-impl/builds/2013-05-14_11-34-48/archive/org.apache.ws.commons.axiom/axiom-common-impl/1.2.15-SNAPSHOT/axiom-common-impl-1.2.15-SNAPSHOT.pom
[JENKINS] Archiving <https://builds.apache.org/job/ws-axiom-trunk/ws/axiom/pom.xml>
to /home/hudson/hudson/jobs/ws-axiom-trunk/modules/org.apache.ws.commons.axiom$axiom/builds/2013-05-14_11-34-48/archive/org.apache.ws.commons.axiom/axiom/1.2.15-SNAPSHOT/axiom-1.2.15-SNAPSHOT.pom
[JENKINS] Archiving <https://builds.apache.org/job/ws-axiom-trunk/ws/axiom/target/axiom-1.2.15-SNAPSHOT-source-release.zip>
to /home/hudson/hudson/jobs/ws-axiom-trunk/modules/org.apache.ws.commons.axiom$axiom/builds/2013-05-14_11-34-48/archive/org.apache.ws.commons.axiom/axiom/1.2.15-20130514.113549-227/axiom-1.2.15-20130514.113549-227-source-release.zip
[JENKINS] Archiving <https://builds.apache.org/job/ws-axiom-trunk/ws/axiom/modules/axiom-compat/pom.xml>
to /home/hudson/hudson/jobs/ws-axiom-trunk/modules/org.apache.ws.commons.axiom$axiom-compat/builds/2013-05-14_11-34-48/archive/org.apache.ws.commons.axiom/axiom-compat/1.2.15-SNAPSHOT/axiom-compat-1.2.15-SNAPSHOT.pom
[JENKINS] Archiving <https://builds.apache.org/job/ws-axiom-trunk/ws/axiom/systests/jboss-tests/pom.xml>
to /home/hudson/hudson/jobs/ws-axiom-trunk/modules/org.apache.ws.commons.axiom$jboss-tests/builds/2013-05-14_11-34-48/archive/org.apache.ws.commons.axiom/jboss-tests/1.2.15-SNAPSHOT/jboss-tests-1.2.15-SNAPSHOT.pom
[JENKINS] Archiving <https://builds.apache.org/job/ws-axiom-trunk/ws/axiom/modules/axiom-c14n/pom.xml>
to /home/hudson/hudson/jobs/ws-axiom-trunk/modules/org.apache.ws.commons.axiom$axiom-c14n/builds/2013-05-14_11-34-48/archive/org.apache.ws.commons.axiom/axiom-c14n/1.2.15-SNAPSHOT/axiom-c14n-1.2.15-SNAPSHOT.pom
[JENKINS] Archiving <https://builds.apache.org/job/ws-axiom-trunk/ws/axiom/devguide/pom.xml>
to /home/hudson/hudson/jobs/ws-axiom-trunk/modules/org.apache.ws.commons.axiom$devguide/builds/2013-05-14_11-34-48/archive/org.apache.ws.commons.axiom/devguide/1.2.15-SNAPSHOT/devguide-1.2.15-SNAPSHOT.pom
Waiting for Jenkins to finish collecting data
mavenExecutionResult exceptions not empty
message : Failed to execute goal org.apache.maven.plugins:maven-compiler-plugin:2.3.2:compile
(default-compile) on project axiom-api: Compilation failure
cause : Compilation failure
Stack trace : 
org.apache.maven.lifecycle.LifecycleExecutionException: Failed to execute goal org.apache.maven.plugins:maven-compiler-plugin:2.3.2:compile
(default-compile) on project axiom-api: Compilation failure
	at org.apache.maven.lifecycle.internal.MojoExecutor.execute(MojoExecutor.java:213)
	at org.apache.maven.lifecycle.internal.MojoExecutor.execute(MojoExecutor.java:153)
	at org.apache.maven.lifecycle.internal.MojoExecutor.execute(MojoExecutor.java:145)
	at org.apache.maven.lifecycle.internal.LifecycleModuleBuilder.buildProject(LifecycleModuleBuilder.java:84)
	at org.apache.maven.lifecycle.internal.LifecycleModuleBuilder.buildProject(LifecycleModuleBuilder.java:59)
	at org.apache.maven.lifecycle.internal.LifecycleStarter.singleThreadedBuild(LifecycleStarter.java:183)
	at org.apache.maven.lifecycle.internal.LifecycleStarter.execute(LifecycleStarter.java:161)
	at org.apache.maven.DefaultMaven.doExecute(DefaultMaven.java:320)
	at org.apache.maven.DefaultMaven.execute(DefaultMaven.java:156)
	at org.jvnet.hudson.maven3.launcher.Maven3Launcher.main(Maven3Launcher.java:79)
	at sun.reflect.NativeMethodAccessorImpl.invoke0(Native Method)
	at sun.reflect.NativeMethodAccessorImpl.invoke(NativeMethodAccessorImpl.java:39)
	at sun.reflect.DelegatingMethodAccessorImpl.invoke(DelegatingMethodAccessorImpl.java:25)
	at java.lang.reflect.Method.invoke(Method.java:597)
	at org.codehaus.plexus.classworlds.launcher.Launcher.launchStandard(Launcher.java:329)
	at org.codehaus.plexus.classworlds.launcher.Launcher.launch(Launcher.java:239)
	at org.jvnet.hudson.maven3.agent.Maven3Main.launch(Maven3Main.java:158)
	at hudson.maven.Maven3Builder.call(Maven3Builder.java:100)
	at hudson.maven.Maven3Builder.call(Maven3Builder.java:66)
	at hudson.remoting.UserRequest.perform(UserRequest.java:118)
	at hudson.remoting.UserRequest.perform(UserRequest.java:48)
	at hudson.remoting.Request$2.run(Request.java:326)
	at hudson.remoting.InterceptingExecutorService$1.call(InterceptingExecutorService.java:72)
	at java.util.concurrent.FutureTask$Sync.innerRun(FutureTask.java:303)
	at java.util.concurrent.FutureTask.run(FutureTask.java:138)
	at java.util.concurrent.ThreadPoolExecutor$Worker.runTask(ThreadPoolExecutor.java:895)
	at java.util.concurrent.ThreadPoolExecutor$Worker.run(ThreadPoolExecutor.java:918)
	at java.lang.Thread.run(Thread.java:662)
Caused by: org.apache.maven.plugin.CompilationFailureException: Compilation failure
	at org.apache.maven.plugin.AbstractCompilerMojo.execute(AbstractCompilerMojo.java:656)
	at org.apache.maven.plugin.CompilerMojo.execute(CompilerMojo.java:128)
	at org.apache.maven.plugin.DefaultBuildPluginManager.executeMojo(DefaultBuildPluginManager.java:101)
	at org.apache.maven.lifecycle.internal.MojoExecutor.execute(MojoExecutor.java:209)
	... 27 more
Sending e-mails to: dev@ws.apache.org
channel stopped

---------------------------------------------------------------------
To unsubscribe, e-mail: dev-unsubscribe@ws.apache.org
For additional commands, e-mail: dev-help@ws.apache.org


Mime
View raw message