ws-dev mailing list archives

Site index · List index
Message view « Date » · « Thread »
Top « Date » · « Thread »
From Apache Jenkins Server <jenk...@builds.apache.org>
Subject Build failed in Jenkins: ws-axiom-trunk #1518
Date Sun, 12 May 2013 11:33:58 GMT
See <https://builds.apache.org/job/ws-axiom-trunk/1518/changes>

Changes:

[veithen] Reorganized some OMElement test cases.

------------------------------------------
[...truncated 3424 lines...]
Generating <https://builds.apache.org/job/ws-axiom-trunk/ws/axiom/modules/axiom-testsuite/target/apidocs/org/apache/axiom/ts/om/attribute//class-use/TestGetNamespaceURIWithNamespace.html...>
Generating <https://builds.apache.org/job/ws-axiom-trunk/ws/axiom/modules/axiom-testsuite/target/apidocs/org/apache/axiom/ts/om/node//class-use/TestGetNextOMSiblingAfterDiscard.html...>
Generating <https://builds.apache.org/job/ws-axiom-trunk/ws/axiom/modules/axiom-testsuite/target/apidocs/org/apache/axiom/ts/om/node//class-use/TestInsertSiblingAfterOnOrphan.html...>
Generating <https://builds.apache.org/job/ws-axiom-trunk/ws/axiom/modules/axiom-testsuite/target/apidocs/org/apache/axiom/ts/om/node//class-use/TestInsertSiblingAfter.html...>
Generating <https://builds.apache.org/job/ws-axiom-trunk/ws/axiom/modules/axiom-testsuite/target/apidocs/org/apache/axiom/ts/om/node//class-use/TestInsertSiblingBeforeOnOrphan.html...>
Generating <https://builds.apache.org/job/ws-axiom-trunk/ws/axiom/modules/axiom-testsuite/target/apidocs/org/apache/axiom/ts/om/node//class-use/TestInsertSiblingAfterSameParent.html...>
Generating <https://builds.apache.org/job/ws-axiom-trunk/ws/axiom/modules/axiom-testsuite/target/apidocs/org/apache/axiom/ts/om/node//class-use/TestInsertSiblingAfterOnChild.html...>
Generating <https://builds.apache.org/job/ws-axiom-trunk/ws/axiom/modules/axiom-testsuite/target/apidocs/org/apache/axiom/ts/om/node//class-use/TestDetach.html...>
Generating <https://builds.apache.org/job/ws-axiom-trunk/ws/axiom/modules/axiom-testsuite/target/apidocs/org/apache/axiom/ts/om/node//class-use/TestInsertSiblingBeforeOnChild.html...>
Generating <https://builds.apache.org/job/ws-axiom-trunk/ws/axiom/modules/axiom-testsuite/target/apidocs/org/apache/axiom/ts/om/node//class-use/TestDetachAfterBuilderClose.html...>
Generating <https://builds.apache.org/job/ws-axiom-trunk/ws/axiom/modules/axiom-testsuite/target/apidocs/org/apache/axiom/ts/om/node//class-use/TestInsertSiblingAfterLastChild.html...>
Generating <https://builds.apache.org/job/ws-axiom-trunk/ws/axiom/modules/axiom-testsuite/target/apidocs/org/apache/axiom/ts/om/node//class-use/TestInsertSiblingBefore.html...>
Generating <https://builds.apache.org/job/ws-axiom-trunk/ws/axiom/modules/axiom-testsuite/target/apidocs/org/apache/axiom/ts/om/node//class-use/TestDetachFirstChild.html...>
Generating <https://builds.apache.org/job/ws-axiom-trunk/ws/axiom/modules/axiom-testsuite/target/apidocs/org/apache/axiom/ts/om/node//class-use/TestInsertSiblingBeforeOnSelf.html...>
Generating <https://builds.apache.org/job/ws-axiom-trunk/ws/axiom/modules/axiom-testsuite/target/apidocs/org/apache/axiom/ts/om/node//class-use/TestInsertSiblingBeforeSameParent.html...>
Generating <https://builds.apache.org/job/ws-axiom-trunk/ws/axiom/modules/axiom-testsuite/target/apidocs/org/apache/axiom/ts/om/node//class-use/TestInsertSiblingAfterOnSelf.html...>
Generating <https://builds.apache.org/job/ws-axiom-trunk/ws/axiom/modules/axiom-testsuite/target/apidocs/org/apache/axiom/ts/dimension/serialization//class-use/SerializeToOutputStream.html...>
Generating <https://builds.apache.org/job/ws-axiom-trunk/ws/axiom/modules/axiom-testsuite/target/apidocs/org/apache/axiom/ts/dimension/serialization//class-use/SerializationStrategy.html...>
Generating <https://builds.apache.org/job/ws-axiom-trunk/ws/axiom/modules/axiom-testsuite/target/apidocs/org/apache/axiom/ts/dimension/serialization//class-use/SerializeToWriter.html...>
Generating <https://builds.apache.org/job/ws-axiom-trunk/ws/axiom/modules/axiom-testsuite/target/apidocs/org/apache/axiom/ts/dimension/serialization//class-use/XML.html...>
Generating <https://builds.apache.org/job/ws-axiom-trunk/ws/axiom/modules/axiom-testsuite/target/apidocs/org/apache/axiom/ts/dimension/serialization//class-use/SerializeFromSAXSource.html...>
Generating <https://builds.apache.org/job/ws-axiom-trunk/ws/axiom/modules/axiom-testsuite/target/apidocs/org/apache/axiom/ts/dimension/serialization//class-use/SerializeFromXMLStreamReader.html...>
Generating <https://builds.apache.org/job/ws-axiom-trunk/ws/axiom/modules/axiom-testsuite/target/apidocs/org/apache/axiom/ts/dimension/serialization//class-use/SerializeToXMLStreamWriter.html...>
Generating <https://builds.apache.org/job/ws-axiom-trunk/ws/axiom/modules/axiom-testsuite/target/apidocs/org/apache/axiom/ts/dimension//class-use/ElementContext.html...>
Generating <https://builds.apache.org/job/ws-axiom-trunk/ws/axiom/modules/axiom-testsuite/target/apidocs/org/apache/axiom/ts/dimension//class-use/ExpansionStrategy.html...>
Generating <https://builds.apache.org/job/ws-axiom-trunk/ws/axiom/modules/axiom-testsuite/target/apidocs/org/apache/axiom/ts/dimension//class-use/Strategies.html...>
Generating <https://builds.apache.org/job/ws-axiom-trunk/ws/axiom/modules/axiom-testsuite/target/apidocs/org/apache/axiom/ts/dimension//class-use/BuilderFactory.html...>
Generating <https://builds.apache.org/job/ws-axiom-trunk/ws/axiom/modules/axiom-testsuite/target/apidocs/org/apache/axiom/ts//package-use.html...>
Generating <https://builds.apache.org/job/ws-axiom-trunk/ws/axiom/modules/axiom-testsuite/target/apidocs/org/apache/axiom/ts/dimension//package-use.html...>
Generating <https://builds.apache.org/job/ws-axiom-trunk/ws/axiom/modules/axiom-testsuite/target/apidocs/org/apache/axiom/ts/dimension/serialization//package-use.html...>
Generating <https://builds.apache.org/job/ws-axiom-trunk/ws/axiom/modules/axiom-testsuite/target/apidocs/org/apache/axiom/ts/om//package-use.html...>
Generating <https://builds.apache.org/job/ws-axiom-trunk/ws/axiom/modules/axiom-testsuite/target/apidocs/org/apache/axiom/ts/om/attribute//package-use.html...>
Generating <https://builds.apache.org/job/ws-axiom-trunk/ws/axiom/modules/axiom-testsuite/target/apidocs/org/apache/axiom/ts/om/builder//package-use.html...>
Generating <https://builds.apache.org/job/ws-axiom-trunk/ws/axiom/modules/axiom-testsuite/target/apidocs/org/apache/axiom/ts/om/container//package-use.html...>
Generating <https://builds.apache.org/job/ws-axiom-trunk/ws/axiom/modules/axiom-testsuite/target/apidocs/org/apache/axiom/ts/om/document//package-use.html...>
Generating <https://builds.apache.org/job/ws-axiom-trunk/ws/axiom/modules/axiom-testsuite/target/apidocs/org/apache/axiom/ts/om/element//package-use.html...>
Generating <https://builds.apache.org/job/ws-axiom-trunk/ws/axiom/modules/axiom-testsuite/target/apidocs/org/apache/axiom/ts/om/element/sr//package-use.html...>
Generating <https://builds.apache.org/job/ws-axiom-trunk/ws/axiom/modules/axiom-testsuite/target/apidocs/org/apache/axiom/ts/om/factory//package-use.html...>
Generating <https://builds.apache.org/job/ws-axiom-trunk/ws/axiom/modules/axiom-testsuite/target/apidocs/org/apache/axiom/ts/om/misc//package-use.html...>
Generating <https://builds.apache.org/job/ws-axiom-trunk/ws/axiom/modules/axiom-testsuite/target/apidocs/org/apache/axiom/ts/om/namespace//package-use.html...>
Generating <https://builds.apache.org/job/ws-axiom-trunk/ws/axiom/modules/axiom-testsuite/target/apidocs/org/apache/axiom/ts/om/node//package-use.html...>
Generating <https://builds.apache.org/job/ws-axiom-trunk/ws/axiom/modules/axiom-testsuite/target/apidocs/org/apache/axiom/ts/om/pi//package-use.html...>
Generating <https://builds.apache.org/job/ws-axiom-trunk/ws/axiom/modules/axiom-testsuite/target/apidocs/org/apache/axiom/ts/om/sourcedelement//package-use.html...>
Generating <https://builds.apache.org/job/ws-axiom-trunk/ws/axiom/modules/axiom-testsuite/target/apidocs/org/apache/axiom/ts/om/sourcedelement/push//package-use.html...>
Generating <https://builds.apache.org/job/ws-axiom-trunk/ws/axiom/modules/axiom-testsuite/target/apidocs/org/apache/axiom/ts/om/text//package-use.html...>
Generating <https://builds.apache.org/job/ws-axiom-trunk/ws/axiom/modules/axiom-testsuite/target/apidocs/org/apache/axiom/ts/om/xop//package-use.html...>
Generating <https://builds.apache.org/job/ws-axiom-trunk/ws/axiom/modules/axiom-testsuite/target/apidocs/org/apache/axiom/ts/om/xpath//package-use.html...>
Generating <https://builds.apache.org/job/ws-axiom-trunk/ws/axiom/modules/axiom-testsuite/target/apidocs/org/apache/axiom/ts/omdom//package-use.html...>
Generating <https://builds.apache.org/job/ws-axiom-trunk/ws/axiom/modules/axiom-testsuite/target/apidocs/org/apache/axiom/ts/omdom/attr//package-use.html...>
Generating <https://builds.apache.org/job/ws-axiom-trunk/ws/axiom/modules/axiom-testsuite/target/apidocs/org/apache/axiom/ts/omdom/document//package-use.html...>
Generating <https://builds.apache.org/job/ws-axiom-trunk/ws/axiom/modules/axiom-testsuite/target/apidocs/org/apache/axiom/ts/omdom/element//package-use.html...>
Generating <https://builds.apache.org/job/ws-axiom-trunk/ws/axiom/modules/axiom-testsuite/target/apidocs/org/apache/axiom/ts/omdom/factory//package-use.html...>
Generating <https://builds.apache.org/job/ws-axiom-trunk/ws/axiom/modules/axiom-testsuite/target/apidocs/org/apache/axiom/ts/omdom/node//package-use.html...>
Generating <https://builds.apache.org/job/ws-axiom-trunk/ws/axiom/modules/axiom-testsuite/target/apidocs/org/apache/axiom/ts/soap//package-use.html...>
Generating <https://builds.apache.org/job/ws-axiom-trunk/ws/axiom/modules/axiom-testsuite/target/apidocs/org/apache/axiom/ts/soap/body//package-use.html...>
Generating <https://builds.apache.org/job/ws-axiom-trunk/ws/axiom/modules/axiom-testsuite/target/apidocs/org/apache/axiom/ts/soap/builder//package-use.html...>
Generating <https://builds.apache.org/job/ws-axiom-trunk/ws/axiom/modules/axiom-testsuite/target/apidocs/org/apache/axiom/ts/soap/envelope//package-use.html...>
Generating <https://builds.apache.org/job/ws-axiom-trunk/ws/axiom/modules/axiom-testsuite/target/apidocs/org/apache/axiom/ts/soap/factory//package-use.html...>
Generating <https://builds.apache.org/job/ws-axiom-trunk/ws/axiom/modules/axiom-testsuite/target/apidocs/org/apache/axiom/ts/soap/fault//package-use.html...>
Generating <https://builds.apache.org/job/ws-axiom-trunk/ws/axiom/modules/axiom-testsuite/target/apidocs/org/apache/axiom/ts/soap/faultcode//package-use.html...>
Generating <https://builds.apache.org/job/ws-axiom-trunk/ws/axiom/modules/axiom-testsuite/target/apidocs/org/apache/axiom/ts/soap/faultdetail//package-use.html...>
Generating <https://builds.apache.org/job/ws-axiom-trunk/ws/axiom/modules/axiom-testsuite/target/apidocs/org/apache/axiom/ts/soap/faulttext//package-use.html...>
Generating <https://builds.apache.org/job/ws-axiom-trunk/ws/axiom/modules/axiom-testsuite/target/apidocs/org/apache/axiom/ts/soap/header//package-use.html...>
Generating <https://builds.apache.org/job/ws-axiom-trunk/ws/axiom/modules/axiom-testsuite/target/apidocs/org/apache/axiom/ts/soap/headerblock//package-use.html...>
Generating <https://builds.apache.org/job/ws-axiom-trunk/ws/axiom/modules/axiom-testsuite/target/apidocs/org/apache/axiom/ts/soap/message//package-use.html...>
Generating <https://builds.apache.org/job/ws-axiom-trunk/ws/axiom/modules/axiom-testsuite/target/apidocs/org/apache/axiom/ts/soap/xpath//package-use.html...>
Generating <https://builds.apache.org/job/ws-axiom-trunk/ws/axiom/modules/axiom-testsuite/target/apidocs/org/apache/axiom/ts/soap11/builder//package-use.html...>
Generating <https://builds.apache.org/job/ws-axiom-trunk/ws/axiom/modules/axiom-testsuite/target/apidocs/org/apache/axiom/ts/soap11/envelope//package-use.html...>
Generating <https://builds.apache.org/job/ws-axiom-trunk/ws/axiom/modules/axiom-testsuite/target/apidocs/org/apache/axiom/ts/soap11/fault//package-use.html...>
Generating <https://builds.apache.org/job/ws-axiom-trunk/ws/axiom/modules/axiom-testsuite/target/apidocs/org/apache/axiom/ts/soap11/faultcode//package-use.html...>
Generating <https://builds.apache.org/job/ws-axiom-trunk/ws/axiom/modules/axiom-testsuite/target/apidocs/org/apache/axiom/ts/soap11/faultreason//package-use.html...>
Generating <https://builds.apache.org/job/ws-axiom-trunk/ws/axiom/modules/axiom-testsuite/target/apidocs/org/apache/axiom/ts/soap11/header//package-use.html...>
Generating <https://builds.apache.org/job/ws-axiom-trunk/ws/axiom/modules/axiom-testsuite/target/apidocs/org/apache/axiom/ts/soap12/builder//package-use.html...>
Generating <https://builds.apache.org/job/ws-axiom-trunk/ws/axiom/modules/axiom-testsuite/target/apidocs/org/apache/axiom/ts/soap12/envelope//package-use.html...>
Generating <https://builds.apache.org/job/ws-axiom-trunk/ws/axiom/modules/axiom-testsuite/target/apidocs/org/apache/axiom/ts/soap12/factory//package-use.html...>
Generating <https://builds.apache.org/job/ws-axiom-trunk/ws/axiom/modules/axiom-testsuite/target/apidocs/org/apache/axiom/ts/soap12/fault//package-use.html...>
Generating <https://builds.apache.org/job/ws-axiom-trunk/ws/axiom/modules/axiom-testsuite/target/apidocs/org/apache/axiom/ts/soap12/faultcode//package-use.html...>
Generating <https://builds.apache.org/job/ws-axiom-trunk/ws/axiom/modules/axiom-testsuite/target/apidocs/org/apache/axiom/ts/soap12/faultreason//package-use.html...>
Generating <https://builds.apache.org/job/ws-axiom-trunk/ws/axiom/modules/axiom-testsuite/target/apidocs/org/apache/axiom/ts/soap12/faultsubcode//package-use.html...>
Generating <https://builds.apache.org/job/ws-axiom-trunk/ws/axiom/modules/axiom-testsuite/target/apidocs/org/apache/axiom/ts/soap12/faulttext//package-use.html...>
Generating <https://builds.apache.org/job/ws-axiom-trunk/ws/axiom/modules/axiom-testsuite/target/apidocs/org/apache/axiom/ts/soap12/header//package-use.html...>
Generating <https://builds.apache.org/job/ws-axiom-trunk/ws/axiom/modules/axiom-testsuite/target/apidocs/org/apache/axiom/ts/soap12/mtom//package-use.html...>
Building index for all the packages and classes...
Generating <https://builds.apache.org/job/ws-axiom-trunk/ws/axiom/modules/axiom-testsuite/target/apidocs/overview-tree.html...>
Generating <https://builds.apache.org/job/ws-axiom-trunk/ws/axiom/modules/axiom-testsuite/target/apidocs/index-all.html...>
Generating <https://builds.apache.org/job/ws-axiom-trunk/ws/axiom/modules/axiom-testsuite/target/apidocs/deprecated-list.html...>
Building index for all classes...
Generating <https://builds.apache.org/job/ws-axiom-trunk/ws/axiom/modules/axiom-testsuite/target/apidocs/allclasses-frame.html...>
Generating <https://builds.apache.org/job/ws-axiom-trunk/ws/axiom/modules/axiom-testsuite/target/apidocs/allclasses-noframe.html...>
Generating <https://builds.apache.org/job/ws-axiom-trunk/ws/axiom/modules/axiom-testsuite/target/apidocs/index.html...>
Generating <https://builds.apache.org/job/ws-axiom-trunk/ws/axiom/modules/axiom-testsuite/target/apidocs/overview-summary.html...>
Generating <https://builds.apache.org/job/ws-axiom-trunk/ws/axiom/modules/axiom-testsuite/target/apidocs/help-doc.html...>
Generating <https://builds.apache.org/job/ws-axiom-trunk/ws/axiom/modules/axiom-testsuite/target/apidocs/stylesheet.css...>
3 warnings
[WARNING] Javadoc Warnings
[WARNING] <https://builds.apache.org/job/ws-axiom-trunk/ws/axiom/modules/axiom-testsuite/src/main/java/org/apache/axiom/ts/om/factory/TestCreateOMAttributeInterfaces.java>:38:
warning - Tag @link: reference not found: OMNode
[WARNING] <https://builds.apache.org/job/ws-axiom-trunk/ws/axiom/modules/axiom-testsuite/src/main/java/org/apache/axiom/ts/om/factory/TestCreateOMAttributeInterfaces.java>:38:
warning - Tag @link: reference not found: OMContainer
[WARNING] <https://builds.apache.org/job/ws-axiom-trunk/ws/axiom/modules/axiom-testsuite/src/main/java/org/apache/axiom/ts/dimension/ExpansionStrategy.java>:118:
warning - @param argument "element" is not a parameter name.
[INFO] Building jar: <https://builds.apache.org/job/ws-axiom-trunk/ws/axiom/modules/axiom-testsuite/target/axiom-testsuite-1.2.15-SNAPSHOT-javadoc.jar>
[INFO] ------------------------------------------------------------------------
[INFO] Reactor Summary:
[INFO] 
[INFO] Axiom ............................................. SUCCESS [1:01.464s]
[INFO] Axiom Build Utilities ............................. SUCCESS [31.150s]
[INFO] Axiom Test Utilities .............................. SUCCESS [13.427s]
[INFO] Axiom Jaxen Test Suite ............................ SUCCESS [11.665s]
[INFO] Axiom DOM Test Suite .............................. SUCCESS [23.531s]
[INFO] Axiom API ......................................... SUCCESS [3:30.269s]
[INFO] Axiom Implementation Test Suite ................... FAILURE [20.375s]
[INFO] Axiom Common Implementation Classes ............... SKIPPED
[INFO] Axiom Impl ........................................ SKIPPED
[INFO] Axiom DOM ......................................... SKIPPED
[INFO] Axiom Compatibility Classes ....................... SKIPPED
[INFO] Axiom JAXB Integration ............................ SKIPPED
[INFO] Axiom C14N ........................................ SKIPPED
[INFO] Axiom Test Suite .................................. SKIPPED
[INFO] Axiom Integration Test Suite ...................... SKIPPED
[INFO] Axiom Uber-JAR .................................... SKIPPED
[INFO] Axiom Samples ..................................... SKIPPED
[INFO] System Tests ...................................... SKIPPED
[INFO] JBoss Tests ....................................... SKIPPED
[INFO] Axiom OSGi Tests .................................. SKIPPED
[INFO] Spring WS Tests ................................... SKIPPED
[INFO] Developer Guide ................................... SKIPPED
[INFO] User Guide ........................................ SKIPPED
[INFO] Javadoc ........................................... SKIPPED
[INFO] Distribution ...................................... SKIPPED
[INFO] Code Coverage Report .............................. SKIPPED
[INFO] ------------------------------------------------------------------------
[INFO] BUILD FAILURE
[INFO] ------------------------------------------------------------------------
[INFO] Total time: 6:19.154s
[INFO] Finished at: Sun May 12 11:29:51 UTC 2013
[INFO] Final Memory: 59M/167M
[INFO] ------------------------------------------------------------------------
[JENKINS] Archiving <https://builds.apache.org/job/ws-axiom-trunk/ws/axiom/userguide/pom.xml>
to /home/hudson/hudson/jobs/ws-axiom-trunk/modules/org.apache.ws.commons.axiom$userguide/builds/2013-05-12_11-23-20/archive/org.apache.ws.commons.axiom/userguide/1.2.15-SNAPSHOT/userguide-1.2.15-SNAPSHOT.pom
[JENKINS] Archiving <https://builds.apache.org/job/ws-axiom-trunk/ws/axiom/modules/axiom-dom-testsuite/pom.xml>
to /home/hudson/hudson/jobs/ws-axiom-trunk/modules/org.apache.ws.commons.axiom$axiom-dom-testsuite/builds/2013-05-12_11-23-18/archive/org.apache.ws.commons.axiom/axiom-dom-testsuite/1.2.15-SNAPSHOT/axiom-dom-testsuite-1.2.15-SNAPSHOT.pom
[JENKINS] Archiving <https://builds.apache.org/job/ws-axiom-trunk/ws/axiom/modules/axiom-dom-testsuite/target/axiom-dom-testsuite-1.2.15-SNAPSHOT.jar>
to /home/hudson/hudson/jobs/ws-axiom-trunk/modules/org.apache.ws.commons.axiom$axiom-dom-testsuite/builds/2013-05-12_11-23-18/archive/org.apache.ws.commons.axiom/axiom-dom-testsuite/1.2.15-20130512.112555-221/axiom-dom-testsuite-1.2.15-20130512.112555-221.jar
[JENKINS] Archiving <https://builds.apache.org/job/ws-axiom-trunk/ws/axiom/modules/axiom-dom-testsuite/target/jacoco.exec>
to /home/hudson/hudson/jobs/ws-axiom-trunk/modules/org.apache.ws.commons.axiom$axiom-dom-testsuite/builds/2013-05-12_11-23-18/archive/org.apache.ws.commons.axiom/axiom-dom-testsuite/1.2.15-20130512.112555-221/axiom-dom-testsuite-1.2.15-20130512.112555-221-jacoco.exec
[JENKINS] Archiving <https://builds.apache.org/job/ws-axiom-trunk/ws/axiom/modules/axiom-dom-testsuite/target/axiom-dom-testsuite-1.2.15-SNAPSHOT-sources.jar>
to /home/hudson/hudson/jobs/ws-axiom-trunk/modules/org.apache.ws.commons.axiom$axiom-dom-testsuite/builds/2013-05-12_11-23-18/archive/org.apache.ws.commons.axiom/axiom-dom-testsuite/1.2.15-20130512.112555-221/axiom-dom-testsuite-1.2.15-20130512.112555-221-sources.jar
[JENKINS] Archiving <https://builds.apache.org/job/ws-axiom-trunk/ws/axiom/modules/axiom-dom-testsuite/target/axiom-dom-testsuite-1.2.15-SNAPSHOT-javadoc.jar>
to /home/hudson/hudson/jobs/ws-axiom-trunk/modules/org.apache.ws.commons.axiom$axiom-dom-testsuite/builds/2013-05-12_11-23-18/archive/org.apache.ws.commons.axiom/axiom-dom-testsuite/1.2.15-20130512.112555-221/axiom-dom-testsuite-1.2.15-20130512.112555-221-javadoc.jar
[JENKINS] Archiving <https://builds.apache.org/job/ws-axiom-trunk/ws/axiom/modules/axiom-impl/pom.xml>
to /home/hudson/hudson/jobs/ws-axiom-trunk/modules/org.apache.ws.commons.axiom$axiom-impl/builds/2013-05-12_11-23-18/archive/org.apache.ws.commons.axiom/axiom-impl/1.2.15-SNAPSHOT/axiom-impl-1.2.15-SNAPSHOT.pom
[JENKINS] Archiving <https://builds.apache.org/job/ws-axiom-trunk/ws/axiom/distribution/pom.xml>
to /home/hudson/hudson/jobs/ws-axiom-trunk/modules/org.apache.ws.commons.axiom$distribution/builds/2013-05-12_11-23-20/archive/org.apache.ws.commons.axiom/distribution/1.2.15-SNAPSHOT/distribution-1.2.15-SNAPSHOT.pom
[JENKINS] Archiving <https://builds.apache.org/job/ws-axiom-trunk/ws/axiom/code-coverage/pom.xml>
to /home/hudson/hudson/jobs/ws-axiom-trunk/modules/org.apache.ws.commons.axiom$code-coverage/builds/2013-05-12_11-23-20/archive/org.apache.ws.commons.axiom/code-coverage/1.2.15-SNAPSHOT/code-coverage-1.2.15-SNAPSHOT.pom
[JENKINS] Archiving <https://builds.apache.org/job/ws-axiom-trunk/ws/axiom/systests/pom.xml>
to /home/hudson/hudson/jobs/ws-axiom-trunk/modules/org.apache.ws.commons.axiom$systests/builds/2013-05-12_11-23-19/archive/org.apache.ws.commons.axiom/systests/1.2.15-SNAPSHOT/systests-1.2.15-SNAPSHOT.pom
[JENKINS] Archiving <https://builds.apache.org/job/ws-axiom-trunk/ws/axiom/modules/axiom-samples/pom.xml>
to /home/hudson/hudson/jobs/ws-axiom-trunk/modules/org.apache.ws.commons.axiom$axiom-samples/builds/2013-05-12_11-23-19/archive/org.apache.ws.commons.axiom/axiom-samples/1.2.15-SNAPSHOT/axiom-samples-1.2.15-SNAPSHOT.pom
[JENKINS] Archiving <https://builds.apache.org/job/ws-axiom-trunk/ws/axiom/systests/spring-ws-tests/pom.xml>
to /home/hudson/hudson/jobs/ws-axiom-trunk/modules/org.apache.ws.commons.axiom$spring-ws-tests/builds/2013-05-12_11-23-20/archive/org.apache.ws.commons.axiom/spring-ws-tests/1.2.15-SNAPSHOT/spring-ws-tests-1.2.15-SNAPSHOT.pom
[JENKINS] Archiving <https://builds.apache.org/job/ws-axiom-trunk/ws/axiom/modules/axiom-integration/pom.xml>
to /home/hudson/hudson/jobs/ws-axiom-trunk/modules/org.apache.ws.commons.axiom$axiom-integration/builds/2013-05-12_11-23-19/archive/org.apache.ws.commons.axiom/axiom-integration/1.2.15-SNAPSHOT/axiom-integration-1.2.15-SNAPSHOT.pom
[JENKINS] Archiving <https://builds.apache.org/job/ws-axiom-trunk/ws/axiom/modules/axiom-testsuite/pom.xml>
to /home/hudson/hudson/jobs/ws-axiom-trunk/modules/org.apache.ws.commons.axiom$axiom-testsuite/builds/2013-05-12_11-23-18/archive/org.apache.ws.commons.axiom/axiom-testsuite/1.2.15-SNAPSHOT/axiom-testsuite-1.2.15-SNAPSHOT.pom
[JENKINS] Archiving <https://builds.apache.org/job/ws-axiom-trunk/ws/axiom/modules/axiom-testsuite/target/axiom-testsuite-1.2.15-SNAPSHOT.jar>
to /home/hudson/hudson/jobs/ws-axiom-trunk/modules/org.apache.ws.commons.axiom$axiom-testsuite/builds/2013-05-12_11-23-18/archive/org.apache.ws.commons.axiom/axiom-testsuite/1.2.15-SNAPSHOT/axiom-testsuite-1.2.15-SNAPSHOT.jar
[JENKINS] Archiving <https://builds.apache.org/job/ws-axiom-trunk/ws/axiom/modules/axiom-testsuite/target/jacoco.exec>
to /home/hudson/hudson/jobs/ws-axiom-trunk/modules/org.apache.ws.commons.axiom$axiom-testsuite/builds/2013-05-12_11-23-18/archive/org.apache.ws.commons.axiom/axiom-testsuite/1.2.15-SNAPSHOT/axiom-testsuite-1.2.15-SNAPSHOT-jacoco.exec
[JENKINS] Archiving <https://builds.apache.org/job/ws-axiom-trunk/ws/axiom/modules/axiom-testsuite/target/axiom-testsuite-1.2.15-SNAPSHOT-sources.jar>
to /home/hudson/hudson/jobs/ws-axiom-trunk/modules/org.apache.ws.commons.axiom$axiom-testsuite/builds/2013-05-12_11-23-18/archive/org.apache.ws.commons.axiom/axiom-testsuite/1.2.15-SNAPSHOT/axiom-testsuite-1.2.15-SNAPSHOT-sources.jar
[JENKINS] Archiving <https://builds.apache.org/job/ws-axiom-trunk/ws/axiom/modules/axiom-testsuite/target/axiom-testsuite-1.2.15-SNAPSHOT-javadoc.jar>
to /home/hudson/hudson/jobs/ws-axiom-trunk/modules/org.apache.ws.commons.axiom$axiom-testsuite/builds/2013-05-12_11-23-18/archive/org.apache.ws.commons.axiom/axiom-testsuite/1.2.15-SNAPSHOT/axiom-testsuite-1.2.15-SNAPSHOT-javadoc.jar
[JENKINS] Archiving <https://builds.apache.org/job/ws-axiom-trunk/ws/axiom/modules/axiom-jaxb/pom.xml>
to /home/hudson/hudson/jobs/ws-axiom-trunk/modules/org.apache.ws.commons.axiom$axiom-jaxb/builds/2013-05-12_11-23-19/archive/org.apache.ws.commons.axiom/axiom-jaxb/1.2.15-SNAPSHOT/axiom-jaxb-1.2.15-SNAPSHOT.pom
[JENKINS] Archiving <https://builds.apache.org/job/ws-axiom-trunk/ws/axiom/modules/axiom-testutils/pom.xml>
to /home/hudson/hudson/jobs/ws-axiom-trunk/modules/org.apache.ws.commons.axiom$axiom-testutils/builds/2013-05-12_11-23-17/archive/org.apache.ws.commons.axiom/axiom-testutils/1.2.15-SNAPSHOT/axiom-testutils-1.2.15-SNAPSHOT.pom
[JENKINS] Archiving <https://builds.apache.org/job/ws-axiom-trunk/ws/axiom/modules/axiom-testutils/target/axiom-testutils-1.2.15-SNAPSHOT.jar>
to /home/hudson/hudson/jobs/ws-axiom-trunk/modules/org.apache.ws.commons.axiom$axiom-testutils/builds/2013-05-12_11-23-17/archive/org.apache.ws.commons.axiom/axiom-testutils/1.2.15-20130512.112519-221/axiom-testutils-1.2.15-20130512.112519-221.jar
[JENKINS] Archiving <https://builds.apache.org/job/ws-axiom-trunk/ws/axiom/modules/axiom-testutils/target/jacoco.exec>
to /home/hudson/hudson/jobs/ws-axiom-trunk/modules/org.apache.ws.commons.axiom$axiom-testutils/builds/2013-05-12_11-23-17/archive/org.apache.ws.commons.axiom/axiom-testutils/1.2.15-20130512.112519-221/axiom-testutils-1.2.15-20130512.112519-221-jacoco.exec
[JENKINS] Archiving <https://builds.apache.org/job/ws-axiom-trunk/ws/axiom/modules/axiom-testutils/target/axiom-testutils-1.2.15-SNAPSHOT-sources.jar>
to /home/hudson/hudson/jobs/ws-axiom-trunk/modules/org.apache.ws.commons.axiom$axiom-testutils/builds/2013-05-12_11-23-17/archive/org.apache.ws.commons.axiom/axiom-testutils/1.2.15-20130512.112519-221/axiom-testutils-1.2.15-20130512.112519-221-sources.jar
[JENKINS] Archiving <https://builds.apache.org/job/ws-axiom-trunk/ws/axiom/modules/axiom-testutils/target/axiom-testutils-1.2.15-SNAPSHOT-javadoc.jar>
to /home/hudson/hudson/jobs/ws-axiom-trunk/modules/org.apache.ws.commons.axiom$axiom-testutils/builds/2013-05-12_11-23-17/archive/org.apache.ws.commons.axiom/axiom-testutils/1.2.15-20130512.112519-221/axiom-testutils-1.2.15-20130512.112519-221-javadoc.jar
[JENKINS] Archiving <https://builds.apache.org/job/ws-axiom-trunk/ws/axiom/modules/axiom-buildutils/pom.xml>
to /home/hudson/hudson/jobs/ws-axiom-trunk/modules/org.apache.ws.commons.axiom$axiom-buildutils/builds/2013-05-12_11-23-17/archive/org.apache.ws.commons.axiom/axiom-buildutils/1.2.15-SNAPSHOT/axiom-buildutils-1.2.15-SNAPSHOT.pom
[JENKINS] Archiving <https://builds.apache.org/job/ws-axiom-trunk/ws/axiom/modules/axiom-buildutils/target/axiom-buildutils-1.2.15-SNAPSHOT.jar>
to /home/hudson/hudson/jobs/ws-axiom-trunk/modules/org.apache.ws.commons.axiom$axiom-buildutils/builds/2013-05-12_11-23-17/archive/org.apache.ws.commons.axiom/axiom-buildutils/1.2.15-20130512.112505-221/axiom-buildutils-1.2.15-20130512.112505-221.jar
[JENKINS] Archiving <https://builds.apache.org/job/ws-axiom-trunk/ws/axiom/modules/axiom-buildutils/target/jacoco.exec>
to /home/hudson/hudson/jobs/ws-axiom-trunk/modules/org.apache.ws.commons.axiom$axiom-buildutils/builds/2013-05-12_11-23-17/archive/org.apache.ws.commons.axiom/axiom-buildutils/1.2.15-20130512.112505-221/axiom-buildutils-1.2.15-20130512.112505-221-jacoco.exec
[JENKINS] Archiving <https://builds.apache.org/job/ws-axiom-trunk/ws/axiom/modules/axiom-buildutils/target/axiom-buildutils-1.2.15-SNAPSHOT-sources.jar>
to /home/hudson/hudson/jobs/ws-axiom-trunk/modules/org.apache.ws.commons.axiom$axiom-buildutils/builds/2013-05-12_11-23-17/archive/org.apache.ws.commons.axiom/axiom-buildutils/1.2.15-20130512.112505-221/axiom-buildutils-1.2.15-20130512.112505-221-sources.jar
[JENKINS] Archiving <https://builds.apache.org/job/ws-axiom-trunk/ws/axiom/modules/axiom-buildutils/target/axiom-buildutils-1.2.15-SNAPSHOT-javadoc.jar>
to /home/hudson/hudson/jobs/ws-axiom-trunk/modules/org.apache.ws.commons.axiom$axiom-buildutils/builds/2013-05-12_11-23-17/archive/org.apache.ws.commons.axiom/axiom-buildutils/1.2.15-20130512.112505-221/axiom-buildutils-1.2.15-20130512.112505-221-javadoc.jar
[JENKINS] Archiving <https://builds.apache.org/job/ws-axiom-trunk/ws/axiom/modules/axiom-dom/pom.xml>
to /home/hudson/hudson/jobs/ws-axiom-trunk/modules/org.apache.ws.commons.axiom$axiom-dom/builds/2013-05-12_11-23-19/archive/org.apache.ws.commons.axiom/axiom-dom/1.2.15-SNAPSHOT/axiom-dom-1.2.15-SNAPSHOT.pom
[JENKINS] Archiving <https://builds.apache.org/job/ws-axiom-trunk/ws/axiom/modules/axiom-all/pom.xml>
to /home/hudson/hudson/jobs/ws-axiom-trunk/modules/org.apache.ws.commons.axiom$axiom-all/builds/2013-05-12_11-23-19/archive/org.apache.ws.commons.axiom/axiom-all/1.2.15-SNAPSHOT/axiom-all-1.2.15-SNAPSHOT.pom
[JENKINS] Archiving <https://builds.apache.org/job/ws-axiom-trunk/ws/axiom/modules/axiom-api/pom.xml>
to /home/hudson/hudson/jobs/ws-axiom-trunk/modules/org.apache.ws.commons.axiom$axiom-api/builds/2013-05-12_11-23-18/archive/org.apache.ws.commons.axiom/axiom-api/1.2.15-SNAPSHOT/axiom-api-1.2.15-SNAPSHOT.pom
[JENKINS] Archiving <https://builds.apache.org/job/ws-axiom-trunk/ws/axiom/modules/axiom-api/target/axiom-api-1.2.15-SNAPSHOT.jar>
to /home/hudson/hudson/jobs/ws-axiom-trunk/modules/org.apache.ws.commons.axiom$axiom-api/builds/2013-05-12_11-23-18/archive/org.apache.ws.commons.axiom/axiom-api/1.2.15-20130512.112924-218/axiom-api-1.2.15-20130512.112924-218.jar
[JENKINS] Archiving <https://builds.apache.org/job/ws-axiom-trunk/ws/axiom/modules/axiom-api/target/jacoco.exec>
to /home/hudson/hudson/jobs/ws-axiom-trunk/modules/org.apache.ws.commons.axiom$axiom-api/builds/2013-05-12_11-23-18/archive/org.apache.ws.commons.axiom/axiom-api/1.2.15-20130512.112924-218/axiom-api-1.2.15-20130512.112924-218-jacoco.exec
[JENKINS] Archiving <https://builds.apache.org/job/ws-axiom-trunk/ws/axiom/modules/axiom-api/target/axiom-api-1.2.15-SNAPSHOT-sources.jar>
to /home/hudson/hudson/jobs/ws-axiom-trunk/modules/org.apache.ws.commons.axiom$axiom-api/builds/2013-05-12_11-23-18/archive/org.apache.ws.commons.axiom/axiom-api/1.2.15-20130512.112924-218/axiom-api-1.2.15-20130512.112924-218-sources.jar
[JENKINS] Archiving <https://builds.apache.org/job/ws-axiom-trunk/ws/axiom/modules/axiom-api/target/axiom-api-1.2.15-SNAPSHOT-javadoc.jar>
to /home/hudson/hudson/jobs/ws-axiom-trunk/modules/org.apache.ws.commons.axiom$axiom-api/builds/2013-05-12_11-23-18/archive/org.apache.ws.commons.axiom/axiom-api/1.2.15-20130512.112924-218/axiom-api-1.2.15-20130512.112924-218-javadoc.jar
[JENKINS] Archiving <https://builds.apache.org/job/ws-axiom-trunk/ws/axiom/modules/axiom-api/target/axiom-api-1.2.15-SNAPSHOT-tests.jar>
to /home/hudson/hudson/jobs/ws-axiom-trunk/modules/org.apache.ws.commons.axiom$axiom-api/builds/2013-05-12_11-23-18/archive/org.apache.ws.commons.axiom/axiom-api/1.2.15-20130512.112924-218/axiom-api-1.2.15-20130512.112924-218-tests.jar
[JENKINS] Archiving <https://builds.apache.org/job/ws-axiom-trunk/ws/axiom/apidocs/pom.xml>
to /home/hudson/hudson/jobs/ws-axiom-trunk/modules/org.apache.ws.commons.axiom$apidocs/builds/2013-05-12_11-23-20/archive/org.apache.ws.commons.axiom/apidocs/1.2.15-SNAPSHOT/apidocs-1.2.15-SNAPSHOT.pom
[JENKINS] Archiving <https://builds.apache.org/job/ws-axiom-trunk/ws/axiom/modules/axiom-jaxen-testsuite/pom.xml>
to /home/hudson/hudson/jobs/ws-axiom-trunk/modules/org.apache.ws.commons.axiom$axiom-jaxen-testsuite/builds/2013-05-12_11-23-18/archive/org.apache.ws.commons.axiom/axiom-jaxen-testsuite/1.2.15-SNAPSHOT/axiom-jaxen-testsuite-1.2.15-SNAPSHOT.pom
[JENKINS] Archiving <https://builds.apache.org/job/ws-axiom-trunk/ws/axiom/modules/axiom-jaxen-testsuite/target/axiom-jaxen-testsuite-1.2.15-SNAPSHOT.jar>
to /home/hudson/hudson/jobs/ws-axiom-trunk/modules/org.apache.ws.commons.axiom$axiom-jaxen-testsuite/builds/2013-05-12_11-23-18/archive/org.apache.ws.commons.axiom/axiom-jaxen-testsuite/1.2.15-20130512.112532-221/axiom-jaxen-testsuite-1.2.15-20130512.112532-221.jar
[JENKINS] Archiving <https://builds.apache.org/job/ws-axiom-trunk/ws/axiom/modules/axiom-jaxen-testsuite/target/jacoco.exec>
to /home/hudson/hudson/jobs/ws-axiom-trunk/modules/org.apache.ws.commons.axiom$axiom-jaxen-testsuite/builds/2013-05-12_11-23-18/archive/org.apache.ws.commons.axiom/axiom-jaxen-testsuite/1.2.15-20130512.112532-221/axiom-jaxen-testsuite-1.2.15-20130512.112532-221-jacoco.exec
[JENKINS] Archiving <https://builds.apache.org/job/ws-axiom-trunk/ws/axiom/modules/axiom-jaxen-testsuite/target/axiom-jaxen-testsuite-1.2.15-SNAPSHOT-sources.jar>
to /home/hudson/hudson/jobs/ws-axiom-trunk/modules/org.apache.ws.commons.axiom$axiom-jaxen-testsuite/builds/2013-05-12_11-23-18/archive/org.apache.ws.commons.axiom/axiom-jaxen-testsuite/1.2.15-20130512.112532-221/axiom-jaxen-testsuite-1.2.15-20130512.112532-221-sources.jar
[JENKINS] Archiving <https://builds.apache.org/job/ws-axiom-trunk/ws/axiom/modules/axiom-jaxen-testsuite/target/axiom-jaxen-testsuite-1.2.15-SNAPSHOT-javadoc.jar>
to /home/hudson/hudson/jobs/ws-axiom-trunk/modules/org.apache.ws.commons.axiom$axiom-jaxen-testsuite/builds/2013-05-12_11-23-18/archive/org.apache.ws.commons.axiom/axiom-jaxen-testsuite/1.2.15-20130512.112532-221/axiom-jaxen-testsuite-1.2.15-20130512.112532-221-javadoc.jar
[JENKINS] Archiving <https://builds.apache.org/job/ws-axiom-trunk/ws/axiom/modules/axiom-tests/pom.xml>
to /home/hudson/hudson/jobs/ws-axiom-trunk/modules/org.apache.ws.commons.axiom$axiom-tests/builds/2013-05-12_11-23-19/archive/org.apache.ws.commons.axiom/axiom-tests/1.2.15-SNAPSHOT/axiom-tests-1.2.15-SNAPSHOT.pom
[JENKINS] Archiving <https://builds.apache.org/job/ws-axiom-trunk/ws/axiom/systests/osgi-tests/pom.xml>
to /home/hudson/hudson/jobs/ws-axiom-trunk/modules/org.apache.ws.commons.axiom$osgi-tests/builds/2013-05-12_11-23-20/archive/org.apache.ws.commons.axiom/osgi-tests/1.2.15-SNAPSHOT/osgi-tests-1.2.15-SNAPSHOT.pom
[JENKINS] Archiving <https://builds.apache.org/job/ws-axiom-trunk/ws/axiom/modules/axiom-common-impl/pom.xml>
to /home/hudson/hudson/jobs/ws-axiom-trunk/modules/org.apache.ws.commons.axiom$axiom-common-impl/builds/2013-05-12_11-23-18/archive/org.apache.ws.commons.axiom/axiom-common-impl/1.2.15-SNAPSHOT/axiom-common-impl-1.2.15-SNAPSHOT.pom
[JENKINS] Archiving <https://builds.apache.org/job/ws-axiom-trunk/ws/axiom/pom.xml>
to /home/hudson/hudson/jobs/ws-axiom-trunk/modules/org.apache.ws.commons.axiom$axiom/builds/2013-05-12_11-23-17/archive/org.apache.ws.commons.axiom/axiom/1.2.15-SNAPSHOT/axiom-1.2.15-SNAPSHOT.pom
[JENKINS] Archiving <https://builds.apache.org/job/ws-axiom-trunk/ws/axiom/target/axiom-1.2.15-SNAPSHOT-source-release.zip>
to /home/hudson/hudson/jobs/ws-axiom-trunk/modules/org.apache.ws.commons.axiom$axiom/builds/2013-05-12_11-23-17/archive/org.apache.ws.commons.axiom/axiom/1.2.15-20130512.112435-221/axiom-1.2.15-20130512.112435-221-source-release.zip
[JENKINS] Archiving <https://builds.apache.org/job/ws-axiom-trunk/ws/axiom/modules/axiom-compat/pom.xml>
to /home/hudson/hudson/jobs/ws-axiom-trunk/modules/org.apache.ws.commons.axiom$axiom-compat/builds/2013-05-12_11-23-19/archive/org.apache.ws.commons.axiom/axiom-compat/1.2.15-SNAPSHOT/axiom-compat-1.2.15-SNAPSHOT.pom
[JENKINS] Archiving <https://builds.apache.org/job/ws-axiom-trunk/ws/axiom/systests/jboss-tests/pom.xml>
to /home/hudson/hudson/jobs/ws-axiom-trunk/modules/org.apache.ws.commons.axiom$jboss-tests/builds/2013-05-12_11-23-20/archive/org.apache.ws.commons.axiom/jboss-tests/1.2.15-SNAPSHOT/jboss-tests-1.2.15-SNAPSHOT.pom
[JENKINS] Archiving <https://builds.apache.org/job/ws-axiom-trunk/ws/axiom/modules/axiom-c14n/pom.xml>
to /home/hudson/hudson/jobs/ws-axiom-trunk/modules/org.apache.ws.commons.axiom$axiom-c14n/builds/2013-05-12_11-23-19/archive/org.apache.ws.commons.axiom/axiom-c14n/1.2.15-SNAPSHOT/axiom-c14n-1.2.15-SNAPSHOT.pom
[JENKINS] Archiving <https://builds.apache.org/job/ws-axiom-trunk/ws/axiom/devguide/pom.xml>
to /home/hudson/hudson/jobs/ws-axiom-trunk/modules/org.apache.ws.commons.axiom$devguide/builds/2013-05-12_11-23-20/archive/org.apache.ws.commons.axiom/devguide/1.2.15-SNAPSHOT/devguide-1.2.15-SNAPSHOT.pom
Waiting for Jenkins to finish collecting data
mavenExecutionResult exceptions not empty
message : Internal error: java.lang.reflect.UndeclaredThrowableException
cause : null
Stack trace : 
org.apache.maven.InternalErrorException: Internal error: java.lang.reflect.UndeclaredThrowableException
	at org.apache.maven.lifecycle.internal.BuilderCommon.handleBuildError(BuilderCommon.java:128)
	at org.apache.maven.lifecycle.internal.LifecycleModuleBuilder.buildProject(LifecycleModuleBuilder.java:95)
	at org.apache.maven.lifecycle.internal.LifecycleModuleBuilder.buildProject(LifecycleModuleBuilder.java:59)
	at org.apache.maven.lifecycle.internal.LifecycleStarter.singleThreadedBuild(LifecycleStarter.java:183)
	at org.apache.maven.lifecycle.internal.LifecycleStarter.execute(LifecycleStarter.java:161)
	at org.apache.maven.DefaultMaven.doExecute(DefaultMaven.java:320)
	at org.apache.maven.DefaultMaven.execute(DefaultMaven.java:156)
	at org.jvnet.hudson.maven3.launcher.Maven3Launcher.main(Maven3Launcher.java:79)
	at sun.reflect.NativeMethodAccessorImpl.invoke0(Native Method)
	at sun.reflect.NativeMethodAccessorImpl.invoke(NativeMethodAccessorImpl.java:39)
	at sun.reflect.DelegatingMethodAccessorImpl.invoke(DelegatingMethodAccessorImpl.java:25)
	at java.lang.reflect.Method.invoke(Method.java:597)
	at org.codehaus.plexus.classworlds.launcher.Launcher.launchStandard(Launcher.java:329)
	at org.codehaus.plexus.classworlds.launcher.Launcher.launch(Launcher.java:239)
	at org.jvnet.hudson.maven3.agent.Maven3Main.launch(Maven3Main.java:158)
	at hudson.maven.Maven3Builder.call(Maven3Builder.java:100)
	at hudson.maven.Maven3Builder.call(Maven3Builder.java:66)
	at hudson.remoting.UserRequest.perform(UserRequest.java:118)
	at hudson.remoting.UserRequest.perform(UserRequest.java:48)
	at hudson.remoting.Request$2.run(Request.java:326)
	at hudson.remoting.InterceptingExecutorService$1.call(InterceptingExecutorService.java:72)
	at java.util.concurrent.FutureTask$Sync.innerRun(FutureTask.java:303)
	at java.util.concurrent.FutureTask.run(FutureTask.java:138)
	at java.util.concurrent.ThreadPoolExecutor$Worker.runTask(ThreadPoolExecutor.java:895)
	at java.util.concurrent.ThreadPoolExecutor$Worker.run(ThreadPoolExecutor.java:918)
	at java.lang.Thread.run(Thread.java:662)
Caused by: java.lang.reflect.UndeclaredThrowableException
	at com.sun.proxy.$Proxy2.setExecutedMojos(Unknown Source)
	at hudson.maven.MavenBuildProxy$Filter.setExecutedMojos(MavenBuildProxy.java:243)
	at hudson.maven.Maven3Builder$MavenExecutionListener.recordMojoEnded(Maven3Builder.java:439)
	at hudson.maven.Maven3Builder$MavenExecutionListener.mojoSucceeded(Maven3Builder.java:425)
	at org.apache.maven.lifecycle.internal.DefaultExecutionEventCatapult.fire(DefaultExecutionEventCatapult.java:87)
	at org.apache.maven.lifecycle.internal.DefaultExecutionEventCatapult.fire(DefaultExecutionEventCatapult.java:42)
	at org.apache.maven.lifecycle.internal.MojoExecutor.execute(MojoExecutor.java:228)
	at org.apache.maven.lifecycle.internal.MojoExecutor.execute(MojoExecutor.java:153)
	at org.apache.maven.lifecycle.internal.MojoExecutor.execute(MojoExecutor.java:145)
	at org.apache.maven.lifecycle.internal.LifecycleModuleBuilder.buildProject(LifecycleModuleBuilder.java:84)
	... 24 more
Caused by: java.io.IOException: Remote call on channel failed
	at hudson.remoting.Channel.call(Channel.java:681)
	at hudson.remoting.RemoteInvocationHandler.invoke(RemoteInvocationHandler.java:158)
	... 34 more
Caused by: java.lang.Error: Failed to deserialize the Callable object.
	at hudson.remoting.UserRequest.perform(UserRequest.java:104)
	at hudson.remoting.UserRequest.perform(UserRequest.java:48)
	at hudson.remoting.Request$2.run(Request.java:326)
	at hudson.remoting.InterceptingExecutorService$1.call(InterceptingExecutorService.java:72)
	at java.util.concurrent.FutureTask$Sync.innerRun(FutureTask.java:334)
	at java.util.concurrent.FutureTask.run(FutureTask.java:166)
	at java.util.concurrent.ThreadPoolExecutor.runWorker(ThreadPoolExecutor.java:1145)
	at java.util.concurrent.ThreadPoolExecutor$Worker.run(ThreadPoolExecutor.java:615)
	at java.lang.Thread.run(Thread.java:722)
Caused by: java.lang.ArrayIndexOutOfBoundsException
	at .(Unknown Source)
Sending e-mails to: dev@ws.apache.org andreas.veithen@gmail.com
channel stopped

---------------------------------------------------------------------
To unsubscribe, e-mail: dev-unsubscribe@ws.apache.org
For additional commands, e-mail: dev-help@ws.apache.org


Mime
View raw message