ws-dev mailing list archives

Site index · List index
Message view « Date » · « Thread »
Top « Date » · « Thread »
From Apache Jenkins Server <jenk...@builds.apache.org>
Subject Build failed in Jenkins: wss4j-trunk #431
Date Wed, 27 Feb 2013 03:56:39 GMT
See <https://builds.apache.org/job/wss4j-trunk/431/changes>

Changes:

[coheigea] Adding a JAAS UsernameToken Validator in the StaX code

[coheigea] [WSS-426] - Support future TTL in the StaX code for Timestamps

------------------------------------------
[...truncated 2718 lines...]
[WARNING] Warning building bundle org.apache.wss4j:wss4j-ws-security-dom:bundle:2.0-SNAPSHOT
: Did not find matching referal for org.bouncycastle.*
[INFO] 
[INFO] --- maven-site-plugin:3.1:attach-descriptor (attach-descriptor) @ wss4j-ws-security-dom
---
[INFO] 
[INFO] --- maven-pmd-plugin:2.5:pmd (pmd) @ wss4j-ws-security-dom ---
[INFO] 
[INFO] 
[INFO] --- maven-pmd-plugin:2.5:check (validate) @ wss4j-ws-security-dom ---
Feb 27, 2013 3:54:53 AM hudson.maven.ExecutedMojo <init>
WARNING: Failed to getClass for org.apache.maven.plugin.source.SourceJarMojo
[INFO] 
[INFO] --- maven-source-plugin:2.2.1:jar (default) @ wss4j-ws-security-dom ---
[INFO] Building jar: <https://builds.apache.org/job/wss4j-trunk/ws/wss4j/ws-security-dom/target/wss4j-ws-security-dom-2.0-SNAPSHOT-sources.jar>
[INFO] 
[INFO] --- maven-jar-plugin:2.3.1:test-jar (default) @ wss4j-ws-security-dom ---
[INFO] Building jar: <https://builds.apache.org/job/wss4j-trunk/ws/wss4j/ws-security-dom/target/wss4j-ws-security-dom-2.0-SNAPSHOT-tests.jar>
[INFO] [INFO] Installing <https://builds.apache.org/job/wss4j-trunk/ws/wss4j/ws-security-dom/target/wss4j-ws-security-dom-2.0-SNAPSHOT.jar>
to /home/hudson/hudson-slave/maven-repositories/0/org/apache/wss4j/wss4j-ws-security-dom/2.0-SNAPSHOT/wss4j-ws-security-dom-2.0-SNAPSHOT.jar
[INFO] Installing <https://builds.apache.org/job/wss4j-trunk/ws/wss4j/ws-security-dom/pom.xml>
to /home/hudson/hudson-slave/maven-repositories/0/org/apache/wss4j/wss4j-ws-security-dom/2.0-SNAPSHOT/wss4j-ws-security-dom-2.0-SNAPSHOT.pom
[INFO] Installing <https://builds.apache.org/job/wss4j-trunk/ws/wss4j/ws-security-dom/target/wss4j-ws-security-dom-2.0-SNAPSHOT-sources.jar>
to /home/hudson/hudson-slave/maven-repositories/0/org/apache/wss4j/wss4j-ws-security-dom/2.0-SNAPSHOT/wss4j-ws-security-dom-2.0-SNAPSHOT-sources.jar
[INFO] Installing <https://builds.apache.org/job/wss4j-trunk/ws/wss4j/ws-security-dom/target/wss4j-ws-security-dom-2.0-SNAPSHOT-tests.jar>
to /home/hudson/hudson-slave/maven-repositories/0/org/apache/wss4j/wss4j-ws-security-dom/2.0-SNAPSHOT/wss4j-ws-security-dom-2.0-SNAPSHOT-tests.jar

[INFO] --- maven-install-plugin:2.3.1:install (default-install) @ wss4j-ws-security-dom ---
[INFO] 
[INFO] --- maven-bundle-plugin:2.3.4:install (default-install) @ wss4j-ws-security-dom ---
[INFO] Installing org/apache/wss4j/wss4j-ws-security-dom/2.0-SNAPSHOT/wss4j-ws-security-dom-2.0-SNAPSHOT.jar
[INFO] Writing OBR metadata
[INFO] 
[INFO] --- maven-pmd-plugin:2.5:pmd (pmd) @ wss4j-ws-security-dom ---
[INFO] [INFO] 

[INFO] --- maven-pmd-plugin:2.5:check (validate) @ wss4j-ws-security-dom ---
[INFO] 
[INFO] --- maven-remote-resources-plugin:1.3:process (default) @ wss4j-ws-security-dom ---
[INFO] [debug] execute contextualize
[INFO] Using 'UTF-8' encoding to copy filtered resources.
[INFO] Copying 0 resource
[INFO] Copying 1 resource
[INFO] Copying 3 resources
[INFO] Copying 3 resources

[INFO] --- maven-resources-plugin:2.5:resources (default-resources) @ wss4j-ws-security-dom
---
[INFO] 
[INFO] --- maven-compiler-plugin:2.5.1:compile (default-compile) @ wss4j-ws-security-dom ---
[INFO] Nothing to compile - all classes are up to date
[INFO] [debug] execute contextualize
[INFO] Using 'UTF-8' encoding to copy filtered resources.
[INFO] Copying 0 resource

[INFO] --- maven-resources-plugin:2.5:testResources (default-testResources) @ wss4j-ws-security-dom
---
[INFO] Copying 64 resources
[INFO] Copying 3 resources
[INFO] Copying 3 resources
[INFO] 
[INFO] --- maven-compiler-plugin:2.5.1:testCompile (default-testCompile) @ wss4j-ws-security-dom
---
[INFO] Nothing to compile - all classes are up to date
[INFO] [INFO] Skipping execution of surefire because it has already been run for this configuration

[INFO] --- maven-surefire-plugin:2.12:test (default-test) @ wss4j-ws-security-dom ---
[JENKINS] Recording test results
[INFO] 
[INFO] --- maven-bundle-plugin:2.3.4:bundle (default-bundle) @ wss4j-ws-security-dom ---
[WARNING] Warning building bundle org.apache.wss4j:wss4j-ws-security-dom:bundle:2.0-SNAPSHOT
: Did not find matching referal for !org.apache.wss4j.dom.*
[WARNING] Warning building bundle org.apache.wss4j:wss4j-ws-security-dom:bundle:2.0-SNAPSHOT
: Did not find matching referal for org.apache.jcp.xml.dsig.internal.*
[WARNING] Warning building bundle org.apache.wss4j:wss4j-ws-security-dom:bundle:2.0-SNAPSHOT
: Did not find matching referal for org.bouncycastle.*
[INFO] 
[INFO] --- maven-site-plugin:3.1:attach-descriptor (attach-descriptor) @ wss4j-ws-security-dom
---
[INFO] 
[INFO] --- maven-pmd-plugin:2.5:pmd (pmd) @ wss4j-ws-security-dom ---
[INFO] [INFO] 

[INFO] --- maven-pmd-plugin:2.5:check (validate) @ wss4j-ws-security-dom ---
Feb 27, 2013 3:55:29 AM hudson.maven.ExecutedMojo <init>
WARNING: Failed to getClass for org.apache.maven.plugin.source.SourceJarMojo
[INFO] 
[INFO] --- maven-source-plugin:2.2.1:jar (default) @ wss4j-ws-security-dom ---
[INFO] Building jar: <https://builds.apache.org/job/wss4j-trunk/ws/wss4j/ws-security-dom/target/wss4j-ws-security-dom-2.0-SNAPSHOT-sources.jar>
[WARNING] Artifact org.apache.wss4j:wss4j-ws-security-dom:java-source:sources:2.0-SNAPSHOT
already attached to project, ignoring duplicate
[INFO] 
[INFO] --- maven-jar-plugin:2.3.1:test-jar (default) @ wss4j-ws-security-dom ---
[INFO] Building jar: <https://builds.apache.org/job/wss4j-trunk/ws/wss4j/ws-security-dom/target/wss4j-ws-security-dom-2.0-SNAPSHOT-tests.jar>
[WARNING] Artifact org.apache.wss4j:wss4j-ws-security-dom:test-jar:tests:2.0-SNAPSHOT already
attached to project, ignoring duplicate
[INFO] [INFO] Installing <https://builds.apache.org/job/wss4j-trunk/ws/wss4j/ws-security-dom/target/wss4j-ws-security-dom-2.0-SNAPSHOT.jar>
to /home/hudson/hudson-slave/maven-repositories/0/org/apache/wss4j/wss4j-ws-security-dom/2.0-SNAPSHOT/wss4j-ws-security-dom-2.0-SNAPSHOT.jar
[INFO] Installing <https://builds.apache.org/job/wss4j-trunk/ws/wss4j/ws-security-dom/pom.xml>
to /home/hudson/hudson-slave/maven-repositories/0/org/apache/wss4j/wss4j-ws-security-dom/2.0-SNAPSHOT/wss4j-ws-security-dom-2.0-SNAPSHOT.pom
[INFO] Installing <https://builds.apache.org/job/wss4j-trunk/ws/wss4j/ws-security-dom/target/wss4j-ws-security-dom-2.0-SNAPSHOT-sources.jar>
to /home/hudson/hudson-slave/maven-repositories/0/org/apache/wss4j/wss4j-ws-security-dom/2.0-SNAPSHOT/wss4j-ws-security-dom-2.0-SNAPSHOT-sources.jar
[INFO] Installing <https://builds.apache.org/job/wss4j-trunk/ws/wss4j/ws-security-dom/target/wss4j-ws-security-dom-2.0-SNAPSHOT-tests.jar>
to /home/hudson/hudson-slave/maven-repositories/0/org/apache/wss4j/wss4j-ws-security-dom/2.0-SNAPSHOT/wss4j-ws-security-dom-2.0-SNAPSHOT-tests.jar

[INFO] --- maven-install-plugin:2.3.1:install (default-install) @ wss4j-ws-security-dom ---
[INFO] 
[INFO] --- maven-bundle-plugin:2.3.4:install (default-install) @ wss4j-ws-security-dom ---
[INFO] Installing org/apache/wss4j/wss4j-ws-security-dom/2.0-SNAPSHOT/wss4j-ws-security-dom-2.0-SNAPSHOT.jar
[INFO] Writing OBR metadata
[INFO] Downloading: https://repository.apache.org/content/repositories/snapshots/org/apache/wss4j/wss4j-ws-security-dom/2.0-SNAPSHOT/maven-metadata.xml

[INFO] --- maven-deploy-plugin:2.7:deploy (default-deploy) @ wss4j-ws-security-dom ---
Downloaded: https://repository.apache.org/content/repositories/snapshots/org/apache/wss4j/wss4j-ws-security-dom/2.0-SNAPSHOT/maven-metadata.xml
(2 KB at 5.0 KB/sec)
Uploading: https://repository.apache.org/content/repositories/snapshots/org/apache/wss4j/wss4j-ws-security-dom/2.0-SNAPSHOT/wss4j-ws-security-dom-2.0-20130227.035533-2.jar
Uploaded: https://repository.apache.org/content/repositories/snapshots/org/apache/wss4j/wss4j-ws-security-dom/2.0-SNAPSHOT/wss4j-ws-security-dom-2.0-20130227.035533-2.jar
(307 KB at 549.6 KB/sec)
Uploading: https://repository.apache.org/content/repositories/snapshots/org/apache/wss4j/wss4j-ws-security-dom/2.0-SNAPSHOT/wss4j-ws-security-dom-2.0-20130227.035533-2.pom
Uploaded: https://repository.apache.org/content/repositories/snapshots/org/apache/wss4j/wss4j-ws-security-dom/2.0-SNAPSHOT/wss4j-ws-security-dom-2.0-20130227.035533-2.pom
(11 KB at 29.1 KB/sec)
Downloading: https://repository.apache.org/content/repositories/snapshots/org/apache/wss4j/wss4j-ws-security-dom/maven-metadata.xml
Downloaded: https://repository.apache.org/content/repositories/snapshots/org/apache/wss4j/wss4j-ws-security-dom/maven-metadata.xml
(295 B at 1.2 KB/sec)
Uploading: https://repository.apache.org/content/repositories/snapshots/org/apache/wss4j/wss4j-ws-security-dom/2.0-SNAPSHOT/maven-metadata.xml
Uploaded: https://repository.apache.org/content/repositories/snapshots/org/apache/wss4j/wss4j-ws-security-dom/2.0-SNAPSHOT/maven-metadata.xml
(2 KB at 4.0 KB/sec)
Uploading: https://repository.apache.org/content/repositories/snapshots/org/apache/wss4j/wss4j-ws-security-dom/maven-metadata.xml
Uploaded: https://repository.apache.org/content/repositories/snapshots/org/apache/wss4j/wss4j-ws-security-dom/maven-metadata.xml
(295 B at 0.8 KB/sec)
Uploading: https://repository.apache.org/content/repositories/snapshots/org/apache/wss4j/wss4j-ws-security-dom/2.0-SNAPSHOT/wss4j-ws-security-dom-2.0-20130227.035533-2-sources.jar
Uploaded: https://repository.apache.org/content/repositories/snapshots/org/apache/wss4j/wss4j-ws-security-dom/2.0-SNAPSHOT/wss4j-ws-security-dom-2.0-20130227.035533-2-sources.jar
(263 KB at 465.3 KB/sec)
Uploading: https://repository.apache.org/content/repositories/snapshots/org/apache/wss4j/wss4j-ws-security-dom/2.0-SNAPSHOT/maven-metadata.xml
Uploaded: https://repository.apache.org/content/repositories/snapshots/org/apache/wss4j/wss4j-ws-security-dom/2.0-SNAPSHOT/maven-metadata.xml
(2 KB at 3.5 KB/sec)
Uploading: https://repository.apache.org/content/repositories/snapshots/org/apache/wss4j/wss4j-ws-security-dom/2.0-SNAPSHOT/wss4j-ws-security-dom-2.0-20130227.035533-2-tests.jar
Uploaded: https://repository.apache.org/content/repositories/snapshots/org/apache/wss4j/wss4j-ws-security-dom/2.0-SNAPSHOT/wss4j-ws-security-dom-2.0-20130227.035533-2-tests.jar
(378 KB at 576.6 KB/sec)
Uploading: https://repository.apache.org/content/repositories/snapshots/org/apache/wss4j/wss4j-ws-security-dom/2.0-SNAPSHOT/maven-metadata.xml
Uploaded: https://repository.apache.org/content/repositories/snapshots/org/apache/wss4j/wss4j-ws-security-dom/2.0-SNAPSHOT/maven-metadata.xml
(2 KB at 3.5 KB/sec)
[INFO] [INFO] Remote OBR update disabled (enable with -DremoteOBR)

[INFO] --- maven-bundle-plugin:2.3.4:deploy (default-deploy) @ wss4j-ws-security-dom ---
[INFO]                                                                         
[INFO] ------------------------------------------------------------------------
[INFO] Building Apache WSS4J Streaming WS-Security 2.0-SNAPSHOT
[INFO] ------------------------------------------------------------------------
[INFO] 
[INFO] --- maven-clean-plugin:2.5:clean (default-clean) @ wss4j-ws-security-stax ---
[INFO] 
[INFO] --- maven-pmd-plugin:2.5:pmd (pmd) @ wss4j-ws-security-stax ---
[INFO] [INFO] 

[INFO] --- maven-pmd-plugin:2.5:check (validate) @ wss4j-ws-security-stax ---
[INFO] 
[INFO] --- maven-remote-resources-plugin:1.3:process (default) @ wss4j-ws-security-stax ---
[debug] execute contextualize
[INFO] [INFO] Using 'UTF-8' encoding to copy filtered resources.
[INFO] Copying 0 resource
[INFO] Copying 3 resources
[INFO] skip non existing resourceDirectory <https://builds.apache.org/job/wss4j-trunk/ws/wss4j/ws-security-stax/src/main/resources-filtered>
[INFO] skip non existing resourceDirectory <https://builds.apache.org/job/wss4j-trunk/ws/wss4j/ws-security-stax/target/generated/src/main/resources>
[INFO] Copying 3 resources

[INFO] --- maven-resources-plugin:2.5:resources (default-resources) @ wss4j-ws-security-stax
---
[INFO] [INFO] Compiling 92 source files to <https://builds.apache.org/job/wss4j-trunk/ws/wss4j/ws-security-stax/target/classes>

[INFO] --- maven-compiler-plugin:2.5.1:compile (default-compile) @ wss4j-ws-security-stax
---
[INFO] -------------------------------------------------------------
[ERROR] COMPILATION ERROR : 
[INFO] -------------------------------------------------------------
[ERROR] <https://builds.apache.org/job/wss4j-trunk/ws/wss4j/ws-security-stax/src/main/java/org/apache/wss4j/stax/validate/JAASUsernameTokenValidator.java>:[30,30]
cannot find symbol
symbol  : class NamePasswordCallbackHandler
location: package org.apache.wss4j.common
[ERROR] <https://builds.apache.org/job/wss4j-trunk/ws/wss4j/ws-security-stax/src/main/java/org/apache/wss4j/stax/validate/JAASUsernameTokenValidator.java>:[109,19]
cannot find symbol
symbol  : class NamePasswordCallbackHandler
location: class org.apache.wss4j.stax.validate.JAASUsernameTokenValidator
[INFO] 2 errors 
[INFO] -------------------------------------------------------------
[INFO] ------------------------------------------------------------------------
[INFO] Reactor Summary:
[INFO] 
[INFO] Apache WSS4J ...................................... SUCCESS [36.135s]
[INFO] Apache WSS4J parent ............................... SUCCESS [6.273s]
[INFO] Apache WSS4J WSU 1.0 Binding ...................... SUCCESS [19.594s]
[INFO] Apache WSS4J WS-Security 1.0 Binding .............. SUCCESS [15.706s]
[INFO] Apache WSS4J WS-Security 1.1 Binding .............. SUCCESS [14.677s]
[INFO] Apache WSS4J WS-SecureConversation binding ........ SUCCESS [14.718s]
[INFO] Apache WSS4J Bindings ............................. SUCCESS [5.791s]
[INFO] Apache WSS4J WS-SecurityPolicy model .............. SUCCESS [1:02.004s]
[INFO] Apache WSS4J WS-Security Common ................... SUCCESS [45.660s]
[INFO] Apache WSS4J DOM WS-Security ...................... SUCCESS [1:37.320s]
[INFO] Apache WSS4J Streaming WS-Security ................ FAILURE [21.959s]
[INFO] Apache WSS4J WS-Security Integration .............. SKIPPED
[INFO] Apache WSS4J Streaming WS-SecurityPolicy .......... SKIPPED
[INFO] Streaming WS Security CXF Integration ............. SKIPPED
[INFO] ------------------------------------------------------------------------
[INFO] BUILD FAILURE
[INFO] ------------------------------------------------------------------------
[INFO] Total time: 5:45.376s
[INFO] Finished at: Wed Feb 27 03:55:59 UTC 2013
[INFO] Final Memory: 43M/347M
[INFO] ------------------------------------------------------------------------
[JENKINS] Archiving <https://builds.apache.org/job/wss4j-trunk/ws/wss4j/bindings/wsu10-binding/pom.xml>
to /home/hudson/hudson/jobs/wss4j-trunk/modules/org.apache.wss4j$wss4j-bindings-wsu10/builds/2013-02-27_03-49-51/archive/org.apache.wss4j/wss4j-bindings-wsu10/2.0-SNAPSHOT/wss4j-bindings-wsu10-2.0-SNAPSHOT.pom
[JENKINS] Archiving <https://builds.apache.org/job/wss4j-trunk/ws/wss4j/bindings/wsu10-binding/target/wss4j-bindings-wsu10-2.0-SNAPSHOT.jar>
to /home/hudson/hudson/jobs/wss4j-trunk/modules/org.apache.wss4j$wss4j-bindings-wsu10/builds/2013-02-27_03-49-51/archive/org.apache.wss4j/wss4j-bindings-wsu10/2.0-20130227.035117-2/wss4j-bindings-wsu10-2.0-20130227.035117-2.jar
[JENKINS] Archiving <https://builds.apache.org/job/wss4j-trunk/ws/wss4j/bindings/wsu10-binding/target/wss4j-bindings-wsu10-2.0-SNAPSHOT-sources.jar>
to /home/hudson/hudson/jobs/wss4j-trunk/modules/org.apache.wss4j$wss4j-bindings-wsu10/builds/2013-02-27_03-49-51/archive/org.apache.wss4j/wss4j-bindings-wsu10/2.0-20130227.035117-2/wss4j-bindings-wsu10-2.0-20130227.035117-2-sources.jar
[JENKINS] Archiving <https://builds.apache.org/job/wss4j-trunk/ws/wss4j/parent/pom.xml>
to /home/hudson/hudson/jobs/wss4j-trunk/modules/org.apache.wss4j$wss4j-parent/builds/2013-02-27_03-49-51/archive/org.apache.wss4j/wss4j-parent/2.0-SNAPSHOT/wss4j-parent-2.0-SNAPSHOT.pom
[JENKINS] Archiving <https://builds.apache.org/job/wss4j-trunk/ws/wss4j/bindings/wssc-binding/pom.xml>
to /home/hudson/hudson/jobs/wss4j-trunk/modules/org.apache.wss4j$wss4j-bindings-wssc/builds/2013-02-27_03-49-51/archive/org.apache.wss4j/wss4j-bindings-wssc/2.0-SNAPSHOT/wss4j-bindings-wssc-2.0-SNAPSHOT.pom
[JENKINS] Archiving <https://builds.apache.org/job/wss4j-trunk/ws/wss4j/bindings/wssc-binding/target/wss4j-bindings-wssc-2.0-SNAPSHOT.jar>
to /home/hudson/hudson/jobs/wss4j-trunk/modules/org.apache.wss4j$wss4j-bindings-wssc/builds/2013-02-27_03-49-51/archive/org.apache.wss4j/wss4j-bindings-wssc/2.0-20130227.035203-2/wss4j-bindings-wssc-2.0-20130227.035203-2.jar
[JENKINS] Archiving <https://builds.apache.org/job/wss4j-trunk/ws/wss4j/bindings/wssc-binding/target/wss4j-bindings-wssc-2.0-SNAPSHOT-sources.jar>
to /home/hudson/hudson/jobs/wss4j-trunk/modules/org.apache.wss4j$wss4j-bindings-wssc/builds/2013-02-27_03-49-51/archive/org.apache.wss4j/wss4j-bindings-wssc/2.0-20130227.035203-2/wss4j-bindings-wssc-2.0-20130227.035203-2-sources.jar
[JENKINS] Archiving <https://builds.apache.org/job/wss4j-trunk/ws/wss4j/ws-security-common/pom.xml>
to /home/hudson/hudson/jobs/wss4j-trunk/modules/org.apache.wss4j$wss4j-ws-security-common/builds/2013-02-27_03-49-51/archive/org.apache.wss4j/wss4j-ws-security-common/2.0-SNAPSHOT/wss4j-ws-security-common-2.0-SNAPSHOT.pom
[JENKINS] Archiving <https://builds.apache.org/job/wss4j-trunk/ws/wss4j/ws-security-common/target/wss4j-ws-security-common-2.0-SNAPSHOT.jar>
to /home/hudson/hudson/jobs/wss4j-trunk/modules/org.apache.wss4j$wss4j-ws-security-common/builds/2013-02-27_03-49-51/archive/org.apache.wss4j/wss4j-ws-security-common/2.0-20130227.035356-2/wss4j-ws-security-common-2.0-20130227.035356-2.jar
[JENKINS] Archiving <https://builds.apache.org/job/wss4j-trunk/ws/wss4j/ws-security-common/target/wss4j-ws-security-common-2.0-SNAPSHOT-sources.jar>
to /home/hudson/hudson/jobs/wss4j-trunk/modules/org.apache.wss4j$wss4j-ws-security-common/builds/2013-02-27_03-49-51/archive/org.apache.wss4j/wss4j-ws-security-common/2.0-20130227.035356-2/wss4j-ws-security-common-2.0-20130227.035356-2-sources.jar
[JENKINS] Archiving <https://builds.apache.org/job/wss4j-trunk/ws/wss4j/ws-security-common/target/wss4j-ws-security-common-2.0-SNAPSHOT-tests.jar>
to /home/hudson/hudson/jobs/wss4j-trunk/modules/org.apache.wss4j$wss4j-ws-security-common/builds/2013-02-27_03-49-51/archive/org.apache.wss4j/wss4j-ws-security-common/2.0-20130227.035356-2/wss4j-ws-security-common-2.0-20130227.035356-2-tests.jar
[JENKINS] Archiving <https://builds.apache.org/job/wss4j-trunk/ws/wss4j/ws-security-policy-stax/pom.xml>
to /home/hudson/hudson/jobs/wss4j-trunk/modules/org.apache.wss4j$wss4j-ws-security-policy-stax/builds/2013-02-27_03-49-51/archive/org.apache.wss4j/wss4j-ws-security-policy-stax/2.0-SNAPSHOT/wss4j-ws-security-policy-stax-2.0-SNAPSHOT.pom
[JENKINS] Archiving <https://builds.apache.org/job/wss4j-trunk/ws/wss4j/ws-security-stax/pom.xml>
to /home/hudson/hudson/jobs/wss4j-trunk/modules/org.apache.wss4j$wss4j-ws-security-stax/builds/2013-02-27_03-49-51/archive/org.apache.wss4j/wss4j-ws-security-stax/2.0-SNAPSHOT/wss4j-ws-security-stax-2.0-SNAPSHOT.pom
[JENKINS] Archiving <https://builds.apache.org/job/wss4j-trunk/ws/wss4j/pom.xml> to
/home/hudson/hudson/jobs/wss4j-trunk/modules/org.apache.wss4j$wss4j/builds/2013-02-27_03-49-50/archive/org.apache.wss4j/wss4j/2.0-SNAPSHOT/wss4j-2.0-SNAPSHOT.pom
[JENKINS] Archiving <https://builds.apache.org/job/wss4j-trunk/ws/wss4j/policy/pom.xml>
to /home/hudson/hudson/jobs/wss4j-trunk/modules/org.apache.wss4j$wss4j-policy/builds/2013-02-27_03-49-51/archive/org.apache.wss4j/wss4j-policy/2.0-SNAPSHOT/wss4j-policy-2.0-SNAPSHOT.pom
[JENKINS] Archiving <https://builds.apache.org/job/wss4j-trunk/ws/wss4j/policy/target/wss4j-policy-2.0-SNAPSHOT.jar>
to /home/hudson/hudson/jobs/wss4j-trunk/modules/org.apache.wss4j$wss4j-policy/builds/2013-02-27_03-49-51/archive/org.apache.wss4j/wss4j-policy/2.0-20130227.035311-2/wss4j-policy-2.0-20130227.035311-2.jar
[JENKINS] Archiving <https://builds.apache.org/job/wss4j-trunk/ws/wss4j/policy/target/wss4j-policy-2.0-SNAPSHOT-sources.jar>
to /home/hudson/hudson/jobs/wss4j-trunk/modules/org.apache.wss4j$wss4j-policy/builds/2013-02-27_03-49-51/archive/org.apache.wss4j/wss4j-policy/2.0-20130227.035311-2/wss4j-policy-2.0-20130227.035311-2-sources.jar
[JENKINS] Archiving <https://builds.apache.org/job/wss4j-trunk/ws/wss4j/integration/pom.xml>
to /home/hudson/hudson/jobs/wss4j-trunk/modules/org.apache.wss4j$integration/builds/2013-02-27_03-49-51/archive/org.apache.wss4j/integration/2.0-SNAPSHOT/integration-2.0-SNAPSHOT.pom
[JENKINS] Archiving <https://builds.apache.org/job/wss4j-trunk/ws/wss4j/bindings/pom.xml>
to /home/hudson/hudson/jobs/wss4j-trunk/modules/org.apache.wss4j$wss4j-bindings/builds/2013-02-27_03-49-51/archive/org.apache.wss4j/wss4j-bindings/2.0-SNAPSHOT/wss4j-bindings-2.0-SNAPSHOT.pom
[JENKINS] Archiving <https://builds.apache.org/job/wss4j-trunk/ws/wss4j/bindings/wss10-binding/pom.xml>
to /home/hudson/hudson/jobs/wss4j-trunk/modules/org.apache.wss4j$wss4j-bindings-wss10/builds/2013-02-27_03-49-51/archive/org.apache.wss4j/wss4j-bindings-wss10/2.0-SNAPSHOT/wss4j-bindings-wss10-2.0-SNAPSHOT.pom
[JENKINS] Archiving <https://builds.apache.org/job/wss4j-trunk/ws/wss4j/bindings/wss10-binding/target/wss4j-bindings-wss10-2.0-SNAPSHOT.jar>
to /home/hudson/hudson/jobs/wss4j-trunk/modules/org.apache.wss4j$wss4j-bindings-wss10/builds/2013-02-27_03-49-51/archive/org.apache.wss4j/wss4j-bindings-wss10/2.0-20130227.035133-2/wss4j-bindings-wss10-2.0-20130227.035133-2.jar
[JENKINS] Archiving <https://builds.apache.org/job/wss4j-trunk/ws/wss4j/bindings/wss10-binding/target/wss4j-bindings-wss10-2.0-SNAPSHOT-sources.jar>
to /home/hudson/hudson/jobs/wss4j-trunk/modules/org.apache.wss4j$wss4j-bindings-wss10/builds/2013-02-27_03-49-51/archive/org.apache.wss4j/wss4j-bindings-wss10/2.0-20130227.035133-2/wss4j-bindings-wss10-2.0-20130227.035133-2-sources.jar
[JENKINS] Archiving <https://builds.apache.org/job/wss4j-trunk/ws/wss4j/ws-security-dom/pom.xml>
to /home/hudson/hudson/jobs/wss4j-trunk/modules/org.apache.wss4j$wss4j-ws-security-dom/builds/2013-02-27_03-49-51/archive/org.apache.wss4j/wss4j-ws-security-dom/2.0-SNAPSHOT/wss4j-ws-security-dom-2.0-SNAPSHOT.pom
[JENKINS] Archiving <https://builds.apache.org/job/wss4j-trunk/ws/wss4j/ws-security-dom/target/wss4j-ws-security-dom-2.0-SNAPSHOT.jar>
to /home/hudson/hudson/jobs/wss4j-trunk/modules/org.apache.wss4j$wss4j-ws-security-dom/builds/2013-02-27_03-49-51/archive/org.apache.wss4j/wss4j-ws-security-dom/2.0-20130227.035533-2/wss4j-ws-security-dom-2.0-20130227.035533-2.jar
[JENKINS] Archiving <https://builds.apache.org/job/wss4j-trunk/ws/wss4j/ws-security-dom/target/wss4j-ws-security-dom-2.0-SNAPSHOT-sources.jar>
to /home/hudson/hudson/jobs/wss4j-trunk/modules/org.apache.wss4j$wss4j-ws-security-dom/builds/2013-02-27_03-49-51/archive/org.apache.wss4j/wss4j-ws-security-dom/2.0-20130227.035533-2/wss4j-ws-security-dom-2.0-20130227.035533-2-sources.jar
[JENKINS] Archiving <https://builds.apache.org/job/wss4j-trunk/ws/wss4j/ws-security-dom/target/wss4j-ws-security-dom-2.0-SNAPSHOT-tests.jar>
to /home/hudson/hudson/jobs/wss4j-trunk/modules/org.apache.wss4j$wss4j-ws-security-dom/builds/2013-02-27_03-49-51/archive/org.apache.wss4j/wss4j-ws-security-dom/2.0-20130227.035533-2/wss4j-ws-security-dom-2.0-20130227.035533-2-tests.jar
[JENKINS] Archiving <https://builds.apache.org/job/wss4j-trunk/ws/wss4j/cxf-integration/pom.xml>
to /home/hudson/hudson/jobs/wss4j-trunk/modules/org.apache.wss4j$cxf-integration/builds/2013-02-27_03-49-51/archive/org.apache.wss4j/cxf-integration/2.0-SNAPSHOT/cxf-integration-2.0-SNAPSHOT.pom
[JENKINS] Archiving <https://builds.apache.org/job/wss4j-trunk/ws/wss4j/bindings/wss11-binding/pom.xml>
to /home/hudson/hudson/jobs/wss4j-trunk/modules/org.apache.wss4j$wss4j-bindings-wss11/builds/2013-02-27_03-49-51/archive/org.apache.wss4j/wss4j-bindings-wss11/2.0-SNAPSHOT/wss4j-bindings-wss11-2.0-SNAPSHOT.pom
[JENKINS] Archiving <https://builds.apache.org/job/wss4j-trunk/ws/wss4j/bindings/wss11-binding/target/wss4j-bindings-wss11-2.0-SNAPSHOT.jar>
to /home/hudson/hudson/jobs/wss4j-trunk/modules/org.apache.wss4j$wss4j-bindings-wss11/builds/2013-02-27_03-49-51/archive/org.apache.wss4j/wss4j-bindings-wss11/2.0-20130227.035147-2/wss4j-bindings-wss11-2.0-20130227.035147-2.jar
[JENKINS] Archiving <https://builds.apache.org/job/wss4j-trunk/ws/wss4j/bindings/wss11-binding/target/wss4j-bindings-wss11-2.0-SNAPSHOT-sources.jar>
to /home/hudson/hudson/jobs/wss4j-trunk/modules/org.apache.wss4j$wss4j-bindings-wss11/builds/2013-02-27_03-49-51/archive/org.apache.wss4j/wss4j-bindings-wss11/2.0-20130227.035147-2/wss4j-bindings-wss11-2.0-20130227.035147-2-sources.jar
[WARNING] The requested profile "deploy" could not be activated because it does not exist.
Waiting for Jenkins to finish collecting data
mavenExecutionResult exceptions not empty
message : Failed to execute goal org.apache.maven.plugins:maven-compiler-plugin:2.5.1:compile
(default-compile) on project wss4j-ws-security-stax: Compilation failure
cause : Compilation failure
Stack trace : 
org.apache.maven.lifecycle.LifecycleExecutionException: Failed to execute goal org.apache.maven.plugins:maven-compiler-plugin:2.5.1:compile
(default-compile) on project wss4j-ws-security-stax: Compilation failure
	at org.apache.maven.lifecycle.internal.MojoExecutor.execute(MojoExecutor.java:213)
	at org.apache.maven.lifecycle.internal.MojoExecutor.execute(MojoExecutor.java:153)
	at org.apache.maven.lifecycle.internal.MojoExecutor.execute(MojoExecutor.java:145)
	at org.apache.maven.lifecycle.internal.LifecycleModuleBuilder.buildProject(LifecycleModuleBuilder.java:84)
	at org.apache.maven.lifecycle.internal.LifecycleModuleBuilder.buildProject(LifecycleModuleBuilder.java:59)
	at org.apache.maven.lifecycle.internal.LifecycleStarter.singleThreadedBuild(LifecycleStarter.java:183)
	at org.apache.maven.lifecycle.internal.LifecycleStarter.execute(LifecycleStarter.java:161)
	at org.apache.maven.DefaultMaven.doExecute(DefaultMaven.java:320)
	at org.apache.maven.DefaultMaven.execute(DefaultMaven.java:156)
	at org.jvnet.hudson.maven3.launcher.Maven3Launcher.main(Maven3Launcher.java:79)
	at sun.reflect.NativeMethodAccessorImpl.invoke0(Native Method)
	at sun.reflect.NativeMethodAccessorImpl.invoke(NativeMethodAccessorImpl.java:39)
	at sun.reflect.DelegatingMethodAccessorImpl.invoke(DelegatingMethodAccessorImpl.java:25)
	at java.lang.reflect.Method.invoke(Method.java:597)
	at org.codehaus.plexus.classworlds.launcher.Launcher.launchStandard(Launcher.java:329)
	at org.codehaus.plexus.classworlds.launcher.Launcher.launch(Launcher.java:239)
	at org.jvnet.hudson.maven3.agent.Maven3Main.launch(Maven3Main.java:158)
	at hudson.maven.Maven3Builder.call(Maven3Builder.java:100)
	at hudson.maven.Maven3Builder.call(Maven3Builder.java:66)
	at hudson.remoting.UserRequest.perform(UserRequest.java:118)
	at hudson.remoting.UserRequest.perform(UserRequest.java:48)
	at hudson.remoting.Request$2.run(Request.java:326)
	at hudson.remoting.InterceptingExecutorService$1.call(InterceptingExecutorService.java:72)
	at java.util.concurrent.FutureTask$Sync.innerRun(FutureTask.java:303)
	at java.util.concurrent.FutureTask.run(FutureTask.java:138)
	at java.util.concurrent.ThreadPoolExecutor$Worker.runTask(ThreadPoolExecutor.java:886)
	at java.util.concurrent.ThreadPoolExecutor$Worker.run(ThreadPoolExecutor.java:908)
	at java.lang.Thread.run(Thread.java:619)
Caused by: org.apache.maven.plugin.CompilationFailureException: Compilation failure
	at org.apache.maven.plugin.AbstractCompilerMojo.execute(AbstractCompilerMojo.java:729)
	at org.apache.maven.plugin.CompilerMojo.execute(CompilerMojo.java:128)
	at org.apache.maven.plugin.DefaultBuildPluginManager.executeMojo(DefaultBuildPluginManager.java:101)
	at org.apache.maven.lifecycle.internal.MojoExecutor.execute(MojoExecutor.java:209)
	... 27 more
Sending e-mails to: dev@ws.apache.org
channel stopped

---------------------------------------------------------------------
To unsubscribe, e-mail: dev-unsubscribe@ws.apache.org
For additional commands, e-mail: dev-help@ws.apache.org


Mime
View raw message