ws-dev mailing list archives

Site index · List index
Message view « Date » · « Thread »
Top « Date » · « Thread »
From Apache Jenkins Server <jenk...@builds.apache.org>
Subject Build failed in Jenkins: woden-trunk #176
Date Fri, 08 Jul 2011 10:38:34 GMT
See <https://builds.apache.org/job/woden-trunk/176/>

------------------------------------------
[...truncated 107 lines...]
[INFO] Copying 16 resources
[INFO] Copying 3 resources
[INFO] 
[INFO] --- maven-compiler-plugin:2.0.2:compile (default-compile) @ woden-api ---
[INFO] Compiling 143 source files to <https://builds.apache.org/job/woden-trunk/ws/woden/woden-api/target/classes>
[INFO] 
[INFO] --- maven-bundle-plugin:1.4.0:manifest (bundle-manifest) @ woden-api ---
[INFO] [INFO] Using 'UTF-8' encoding to copy filtered resources.

[INFO] --- maven-resources-plugin:2.4:testResources (default-testResources) @ woden-api ---
[INFO] Copying 2 resources
[INFO] Copying 3 resources
[INFO] 
[INFO] --- maven-compiler-plugin:2.0.2:testCompile (default-testCompile) @ woden-api ---
[INFO] Compiling 3 source files to <https://builds.apache.org/job/woden-trunk/ws/woden/woden-api/target/test-classes>
[INFO] 
[INFO] --- maven-surefire-plugin:2.4.3:test (default-test) @ woden-api ---
[INFO] Surefire report directory: <https://builds.apache.org/job/woden-trunk/ws/woden/woden-api/target/surefire-reports>

-------------------------------------------------------
 T E S T S
-------------------------------------------------------
Running org.apache.woden.types.NCNameTest
Tests run: 6, Failures: 0, Errors: 0, Skipped: 0, Time elapsed: 0.056 sec
Running org.apache.woden.types.QNameTokenUnionTest
Tests run: 2, Failures: 0, Errors: 0, Skipped: 0, Time elapsed: 0.004 sec
Running org.apache.woden.xpointer.XPointerTest
Tests run: 1, Failures: 0, Errors: 0, Skipped: 0, Time elapsed: 0.008 sec

Results :

Tests run: 9, Failures: 0, Errors: 0, Skipped: 0

[JENKINS] Recording test results
[INFO] 
[INFO] --- maven-jar-plugin:2.3:jar (default-jar) @ woden-api ---
[INFO] Building jar: <https://builds.apache.org/job/woden-trunk/ws/woden/woden-api/target/woden-api-1.0-SNAPSHOT.jar>
[INFO] [INFO] Installing <https://builds.apache.org/job/woden-trunk/ws/woden/woden-api/target/woden-api-1.0-SNAPSHOT.jar>
to <https://builds.apache.org/job/woden-trunk/ws/.repository/org/apache/woden/woden-api/1.0-SNAPSHOT/woden-api-1.0-SNAPSHOT.jar>

[INFO] Installing <https://builds.apache.org/job/woden-trunk/ws/woden/woden-api/pom.xml>
to <https://builds.apache.org/job/woden-trunk/ws/.repository/org/apache/woden/woden-api/1.0-SNAPSHOT/woden-api-1.0-SNAPSHOT.pom>
[INFO] --- maven-install-plugin:2.3:install (default-install) @ woden-api ---
projectSucceeded org.apache.woden:woden-api:1.0-SNAPSHOT
[JENKINS] Archiving <https://builds.apache.org/job/woden-trunk/ws/woden/woden-api/pom.xml>
to /home/hudson/hudson/jobs/woden-trunk/modules/org.apache.woden$woden-api/builds/2011-07-08_10-38-09/archive/org.apache.woden/woden-api/1.0-SNAPSHOT/woden-api-1.0-SNAPSHOT.pom
[JENKINS] Archiving <https://builds.apache.org/job/woden-trunk/ws/woden/woden-api/target/woden-api-1.0-SNAPSHOT.jar>
to /home/hudson/hudson/jobs/woden-trunk/modules/org.apache.woden$woden-api/builds/2011-07-08_10-38-09/archive/org.apache.woden/woden-api/1.0-SNAPSHOT/woden-api-1.0-SNAPSHOT.jar
[INFO]                                                                         
[INFO] ------------------------------------------------------------------------
[INFO] Building Woden - Commons 1.0-SNAPSHOT
[INFO] [INFO] Deleting file set: <https://builds.apache.org/job/woden-trunk/ws/woden/woden-commons/target>
(included: [**], excluded: [])
------------------------------------------------------------------------
[INFO] 
[INFO] --- maven-clean-plugin:2.3:clean (default-clean) @ woden-impl-commons ---
[INFO] 
[INFO] --- maven-remote-resources-plugin:1.1:process (default) @ woden-impl-commons ---
[INFO] [INFO] Using 'UTF-8' encoding to copy filtered resources.

[INFO] --- maven-resources-plugin:2.4:resources (default-resources) @ woden-impl-commons ---
[INFO] Copying 1 resource
[INFO] Copying 3 resources to META-INF
[INFO] Copying 3 resources
[INFO] 
[INFO] --- maven-compiler-plugin:2.0.2:compile (default-compile) @ woden-impl-commons ---
[INFO] Compiling 94 source files to <https://builds.apache.org/job/woden-trunk/ws/woden/woden-commons/target/classes>
[INFO] 
[INFO] --- maven-bundle-plugin:1.4.0:manifest (bundle-manifest) @ woden-impl-commons ---
[INFO] [INFO] Using 'UTF-8' encoding to copy filtered resources.
[INFO] Copying 5 resources

[INFO] --- maven-resources-plugin:2.4:testResources (default-testResources) @ woden-impl-commons
---
[INFO] Copying 3 resources
[INFO] 
[INFO] --- maven-compiler-plugin:2.0.2:testCompile (default-testCompile) @ woden-impl-commons
---
[INFO] Compiling 1 source file to <https://builds.apache.org/job/woden-trunk/ws/woden/woden-commons/target/test-classes>
[INFO] 
[INFO] --- maven-surefire-plugin:2.4.3:test (default-test) @ woden-impl-commons ---
[INFO] Surefire report directory: <https://builds.apache.org/job/woden-trunk/ws/woden/woden-commons/target/surefire-reports>

-------------------------------------------------------
 T E S T S
-------------------------------------------------------
Running org.apache.woden.internal.ReaderFeaturesTest
Tests run: 4, Failures: 0, Errors: 0, Skipped: 0, Time elapsed: 0.034 sec

Results :

Tests run: 4, Failures: 0, Errors: 0, Skipped: 0

[JENKINS] Recording test results
[INFO] 
[INFO] --- maven-jar-plugin:2.3:jar (default-jar) @ woden-impl-commons ---
[INFO] Building jar: <https://builds.apache.org/job/woden-trunk/ws/woden/woden-commons/target/woden-impl-commons-1.0-SNAPSHOT.jar>
[INFO] [INFO] Installing <https://builds.apache.org/job/woden-trunk/ws/woden/woden-commons/target/woden-impl-commons-1.0-SNAPSHOT.jar>
to <https://builds.apache.org/job/woden-trunk/ws/.repository/org/apache/woden/woden-impl-commons/1.0-SNAPSHOT/woden-impl-commons-1.0-SNAPSHOT.jar>

[INFO] --- maven-install-plugin:2.3:install (default-install) @ woden-impl-commons ---[INFO]
Installing <https://builds.apache.org/job/woden-trunk/ws/woden/woden-commons/pom.xml>
to <https://builds.apache.org/job/woden-trunk/ws/.repository/org/apache/woden/woden-impl-commons/1.0-SNAPSHOT/woden-impl-commons-1.0-SNAPSHOT.pom>

projectSucceeded org.apache.woden:woden-impl-commons:1.0-SNAPSHOT
[JENKINS] Archiving <https://builds.apache.org/job/woden-trunk/ws/woden/woden-commons/pom.xml>
to /home/hudson/hudson/jobs/woden-trunk/modules/org.apache.woden$woden-impl-commons/builds/2011-07-08_10-38-09/archive/org.apache.woden/woden-impl-commons/1.0-SNAPSHOT/woden-impl-commons-1.0-SNAPSHOT.pom
[JENKINS] Archiving <https://builds.apache.org/job/woden-trunk/ws/woden/woden-commons/target/woden-impl-commons-1.0-SNAPSHOT.jar>
to /home/hudson/hudson/jobs/woden-trunk/modules/org.apache.woden$woden-impl-commons/builds/2011-07-08_10-38-09/archive/org.apache.woden/woden-impl-commons/1.0-SNAPSHOT/woden-impl-commons-1.0-SNAPSHOT.jar
[INFO]                                                                         
[INFO] ------------------------------------------------------------------------
[INFO] Building Woden - DOM 1.0-SNAPSHOT
[INFO] ------------------------------------------------------------------------
[INFO] [INFO] Deleting file set: <https://builds.apache.org/job/woden-trunk/ws/woden/woden-dom/target>
(included: [**], excluded: [])

[INFO] --- maven-clean-plugin:2.3:clean (default-clean) @ woden-impl-dom ---
[INFO] 
[INFO] --- maven-remote-resources-plugin:1.1:process (default) @ woden-impl-dom ---
[INFO] 
[INFO] Using 'UTF-8' encoding to copy filtered resources.
[INFO] skip non existing resourceDirectory <https://builds.apache.org/job/woden-trunk/ws/woden/woden-dom/src/main/resources>
[INFO] --- maven-resources-plugin:2.4:resources (default-resources) @ woden-impl-dom ---
[INFO] Copying 3 resources to META-INF
[INFO] Copying 3 resources
[INFO] 
[INFO] --- maven-compiler-plugin:2.0.2:compile (default-compile) @ woden-impl-dom ---
[INFO] Compiling 11 source files to <https://builds.apache.org/job/woden-trunk/ws/woden/woden-dom/target/classes>
[INFO] 
[INFO] --- maven-bundle-plugin:1.4.0:manifest (bundle-manifest) @ woden-impl-dom ---
[INFO] [INFO] Using 'UTF-8' encoding to copy filtered resources.

[INFO] --- maven-resources-plugin:2.4:testResources (default-testResources) @ woden-impl-dom
---
[INFO] Copying 5 resources
[INFO] Copying 3 resources
[INFO] 
[INFO] --- maven-compiler-plugin:2.0.2:testCompile (default-testCompile) @ woden-impl-dom
---
[INFO] Compiling 4 source files to <https://builds.apache.org/job/woden-trunk/ws/woden/woden-dom/target/test-classes>
[INFO] 
[INFO] --- maven-surefire-plugin:2.4.3:test (default-test) @ woden-impl-dom ---
[INFO] Surefire report directory: <https://builds.apache.org/job/woden-trunk/ws/woden/woden-dom/target/surefire-reports>

-------------------------------------------------------
 T E S T S
-------------------------------------------------------
Running org.apache.woden.DOMXMLElementTest
Tests run: 3, Failures: 0, Errors: 0, Skipped: 0, Time elapsed: 0.207 sec
Running org.apache.woden.WSDLReaderTest
Tests run: 5, Failures: 0, Errors: 0, Skipped: 0, Time elapsed: 0.757 sec
Running org.apache.woden.schema.SchemaTest
Tests run: 3, Failures: 0, Errors: 0, Skipped: 0, Time elapsed: 0.004 sec
Running org.apache.woden.DOMWSDLWriterTest
Tests run: 2, Failures: 0, Errors: 0, Skipped: 0, Time elapsed: 0.176 sec

Results :

Tests run: 13, Failures: 0, Errors: 0, Skipped: 0

[JENKINS] Recording test results
[INFO] 
[INFO] --- maven-jar-plugin:2.3:jar (default-jar) @ woden-impl-dom ---
[INFO] Building jar: <https://builds.apache.org/job/woden-trunk/ws/woden/woden-dom/target/woden-impl-dom-1.0-SNAPSHOT.jar>
[INFO] [INFO] Installing <https://builds.apache.org/job/woden-trunk/ws/woden/woden-dom/target/woden-impl-dom-1.0-SNAPSHOT.jar>
to <https://builds.apache.org/job/woden-trunk/ws/.repository/org/apache/woden/woden-impl-dom/1.0-SNAPSHOT/woden-impl-dom-1.0-SNAPSHOT.jar>
[INFO] Installing <https://builds.apache.org/job/woden-trunk/ws/woden/woden-dom/pom.xml>
to <https://builds.apache.org/job/woden-trunk/ws/.repository/org/apache/woden/woden-impl-dom/1.0-SNAPSHOT/woden-impl-dom-1.0-SNAPSHOT.pom>

[INFO] --- maven-install-plugin:2.3:install (default-install) @ woden-impl-dom ---
projectSucceeded org.apache.woden:woden-impl-dom:1.0-SNAPSHOT
[JENKINS] Archiving <https://builds.apache.org/job/woden-trunk/ws/woden/woden-dom/pom.xml>
to /home/hudson/hudson/jobs/woden-trunk/modules/org.apache.woden$woden-impl-dom/builds/2011-07-08_10-38-09/archive/org.apache.woden/woden-impl-dom/1.0-SNAPSHOT/woden-impl-dom-1.0-SNAPSHOT.pom
[JENKINS] Archiving <https://builds.apache.org/job/woden-trunk/ws/woden/woden-dom/target/woden-impl-dom-1.0-SNAPSHOT.jar>
to /home/hudson/hudson/jobs/woden-trunk/modules/org.apache.woden$woden-impl-dom/builds/2011-07-08_10-38-09/archive/org.apache.woden/woden-impl-dom/1.0-SNAPSHOT/woden-impl-dom-1.0-SNAPSHOT.jar
[INFO]                                                                         
[INFO] ------------------------------------------------------------------------
[INFO] Building Woden - OM 1.0-SNAPSHOT
[INFO] ------------------------------------------------------------------------
Downloading: http://repository.apache.org/snapshots/org/apache/ws/commons/axiom/axiom-api/1.2.12-SNAPSHOT/maven-metadata.xml
Downloading: http://repository.apache.org/snapshots/org/apache/ws/commons/axiom/axiom-api/1.2.12-SNAPSHOT/axiom-api-1.2.12-SNAPSHOT.pom
[WARNING] The POM for org.apache.ws.commons.axiom:axiom-api:jar:1.2.12-SNAPSHOT is missing,
no dependency information available
Downloading: http://repository.apache.org/snapshots/org/apache/ws/commons/axiom/axiom-impl/1.2.12-SNAPSHOT/maven-metadata.xml
Downloading: http://repository.apache.org/snapshots/org/apache/ws/commons/axiom/axiom-impl/1.2.12-SNAPSHOT/axiom-impl-1.2.12-SNAPSHOT.pom
[WARNING] The POM for org.apache.ws.commons.axiom:axiom-impl:jar:1.2.12-SNAPSHOT is missing,
no dependency information available
Downloading: http://repository.apache.org/snapshots/org/apache/ws/commons/axiom/axiom-api/1.2.12-SNAPSHOT/axiom-api-1.2.12-SNAPSHOT.jar
Downloading: http://repository.apache.org/snapshots/org/apache/ws/commons/axiom/axiom-impl/1.2.12-SNAPSHOT/axiom-impl-1.2.12-SNAPSHOT.jar
projectFailed org.apache.woden:woden-impl-om:1.0-SNAPSHOT
[JENKINS] Archiving <https://builds.apache.org/job/woden-trunk/ws/woden/woden-om/pom.xml>
to /home/hudson/hudson/jobs/woden-trunk/modules/org.apache.woden$woden-impl-om/builds/2011-07-08_10-38-09/archive/org.apache.woden/woden-impl-om/1.0-SNAPSHOT/woden-impl-om-1.0-SNAPSHOT.pom
sessionEnded
[INFO] ------------------------------------------------------------------------
[INFO] Reactor Summary:
[INFO] 
[INFO] Woden ............................................. SUCCESS [2.558s]
[INFO] Woden - API ....................................... SUCCESS [7.052s]
[INFO] Woden - Commons ................................... SUCCESS [3.178s]
[INFO] Woden - DOM ....................................... SUCCESS [3.570s]
[INFO] Woden - OM ........................................ FAILURE [0.208s]
[INFO] Woden - Tests ..................................... SKIPPED
[INFO] Woden - Tool ...................................... SKIPPED
[INFO] Woden - converter Maven plugin .................... SKIPPED
[INFO] Woden - Ant ....................................... SKIPPED
[INFO] ------------------------------------------------------------------------
[INFO] BUILD FAILURE
[INFO] ------------------------------------------------------------------------
[INFO] Total time: 18.933s
[INFO] Finished at: Fri Jul 08 10:35:37 GMT 2011
[INFO] Final Memory: 13M/403M
[INFO] ------------------------------------------------------------------------
mavenExecutionResult exceptions not empty
message : Failed to execute goal on project woden-impl-om: Could not resolve dependencies
for project org.apache.woden:woden-impl-om:jar:1.0-SNAPSHOT: The following artifacts could
not be resolved: org.apache.ws.commons.axiom:axiom-api:jar:1.2.12-SNAPSHOT, org.apache.ws.commons.axiom:axiom-impl:jar:1.2.12-SNAPSHOT:
Could not find artifact org.apache.ws.commons.axiom:axiom-api:jar:1.2.12-SNAPSHOT in Nexus
(http://repository.apache.org/snapshots)
cause : Could not resolve dependencies for project org.apache.woden:woden-impl-om:jar:1.0-SNAPSHOT:
The following artifacts could not be resolved: org.apache.ws.commons.axiom:axiom-api:jar:1.2.12-SNAPSHOT,
org.apache.ws.commons.axiom:axiom-impl:jar:1.2.12-SNAPSHOT: Could not find artifact org.apache.ws.commons.axiom:axiom-api:jar:1.2.12-SNAPSHOT
in Nexus (http://repository.apache.org/snapshots)
Stack trace : 
org.apache.maven.lifecycle.LifecycleExecutionException: Failed to execute goal on project
woden-impl-om: Could not resolve dependencies for project org.apache.woden:woden-impl-om:jar:1.0-SNAPSHOT:
The following artifacts could not be resolved: org.apache.ws.commons.axiom:axiom-api:jar:1.2.12-SNAPSHOT,
org.apache.ws.commons.axiom:axiom-impl:jar:1.2.12-SNAPSHOT: Could not find artifact org.apache.ws.commons.axiom:axiom-api:jar:1.2.12-SNAPSHOT
in Nexus (http://repository.apache.org/snapshots)
	at org.apache.maven.lifecycle.internal.LifecycleDependencyResolver.getDependencies(LifecycleDependencyResolver.java:196)
	at org.apache.maven.lifecycle.internal.LifecycleDependencyResolver.resolveProjectDependencies(LifecycleDependencyResolver.java:108)
	at org.apache.maven.lifecycle.internal.MojoExecutor.ensureDependenciesAreResolved(MojoExecutor.java:258)
	at org.apache.maven.lifecycle.internal.MojoExecutor.execute(MojoExecutor.java:201)
	at org.apache.maven.lifecycle.internal.MojoExecutor.execute(MojoExecutor.java:153)
	at org.apache.maven.lifecycle.internal.MojoExecutor.execute(MojoExecutor.java:145)
	at org.apache.maven.lifecycle.internal.LifecycleModuleBuilder.buildProject(LifecycleModuleBuilder.java:84)
	at org.apache.maven.lifecycle.internal.LifecycleModuleBuilder.buildProject(LifecycleModuleBuilder.java:59)
	at org.apache.maven.lifecycle.internal.LifecycleStarter.singleThreadedBuild(LifecycleStarter.java:183)
	at org.apache.maven.lifecycle.internal.LifecycleStarter.execute(LifecycleStarter.java:161)
	at org.apache.maven.DefaultMaven.doExecute(DefaultMaven.java:319)
	at org.apache.maven.DefaultMaven.execute(DefaultMaven.java:156)
	at org.jvnet.hudson.maven3.launcher.Maven3Launcher.main(Maven3Launcher.java:79)
	at sun.reflect.NativeMethodAccessorImpl.invoke0(Native Method)
	at sun.reflect.NativeMethodAccessorImpl.invoke(NativeMethodAccessorImpl.java:39)
	at sun.reflect.DelegatingMethodAccessorImpl.invoke(DelegatingMethodAccessorImpl.java:25)
	at java.lang.reflect.Method.invoke(Method.java:592)
	at org.codehaus.plexus.classworlds.launcher.Launcher.launchStandard(Launcher.java:329)
	at org.codehaus.plexus.classworlds.launcher.Launcher.launch(Launcher.java:239)
	at org.jvnet.hudson.maven3.agent.Maven3Main.launch(Maven3Main.java:158)
	at hudson.maven.Maven3Builder.call(Maven3Builder.java:128)
	at hudson.maven.Maven3Builder.call(Maven3Builder.java:75)
	at hudson.remoting.UserRequest.perform(UserRequest.java:118)
	at hudson.remoting.UserRequest.perform(UserRequest.java:48)
	at hudson.remoting.Request$2.run(Request.java:270)
	at java.util.concurrent.Executors$RunnableAdapter.call(Executors.java:417)
	at java.util.concurrent.FutureTask$Sync.innerRun(FutureTask.java:269)
	at java.util.concurrent.FutureTask.run(FutureTask.java:123)
	at java.util.concurrent.ThreadPoolExecutor$Worker.runTask(ThreadPoolExecutor.java:651)
	at java.util.concurrent.ThreadPoolExecutor$Worker.run(ThreadPoolExecutor.java:676)
	at java.lang.Thread.run(Thread.java:595)
Caused by: org.apache.maven.project.DependencyResolutionException: Could not resolve dependencies
for project org.apache.woden:woden-impl-om:jar:1.0-SNAPSHOT: The following artifacts could
not be resolved: org.apache.ws.commons.axiom:axiom-api:jar:1.2.12-SNAPSHOT, org.apache.ws.commons.axiom:axiom-impl:jar:1.2.12-SNAPSHOT:
Could not find artifact org.apache.ws.commons.axiom:axiom-api:jar:1.2.12-SNAPSHOT in Nexus
(http://repository.apache.org/snapshots)
	at org.apache.maven.project.DefaultProjectDependenciesResolver.resolve(DefaultProjectDependenciesResolver.java:170)
	at org.apache.maven.lifecycle.internal.LifecycleDependencyResolver.getDependencies(LifecycleDependencyResolver.java:171)
	... 30 moreSending e-mails to: dev@ws.apache.org

Caused by: org.sonatype.aether.resolution.DependencyResolutionException: The following artifacts
could not be resolved: org.apache.ws.commons.axiom:axiom-api:jar:1.2.12-SNAPSHOT, org.apache.ws.commons.axiom:axiom-impl:jar:1.2.12-SNAPSHOT:
Could not find artifact org.apache.ws.commons.axiom:axiom-api:jar:1.2.12-SNAPSHOT in Nexus
(http://repository.apache.org/snapshots)
	at org.sonatype.aether.impl.internal.DefaultRepositorySystem.resolveDependencies(DefaultRepositorySystem.java:412)
	at org.apache.maven.project.DefaultProjectDependenciesResolver.resolve(DefaultProjectDependenciesResolver.java:164)
	... 31 more
Caused by: org.sonatype.aether.resolution.ArtifactResolutionException: The following artifacts
could not be resolved: org.apache.ws.commons.axiom:axiom-api:jar:1.2.12-SNAPSHOT, org.apache.ws.commons.axiom:axiom-impl:jar:1.2.12-SNAPSHOT:
Could not find artifact org.apache.ws.commons.axiom:axiom-api:jar:1.2.12-SNAPSHOT in Nexus
(http://repository.apache.org/snapshots)
	at org.sonatype.aether.impl.internal.DefaultArtifactResolver.resolve(DefaultArtifactResolver.java:541)
	at org.sonatype.aether.impl.internal.DefaultArtifactResolver.resolveArtifacts(DefaultArtifactResolver.java:220)
	at org.sonatype.aether.impl.internal.DefaultRepositorySystem.resolveDependencies(DefaultRepositorySystem.java:395)
	... 32 more
Caused by: org.sonatype.aether.transfer.ArtifactNotFoundException: Could not find artifact
org.apache.ws.commons.axiom:axiom-api:jar:1.2.12-SNAPSHOT in Nexus (http://repository.apache.org/snapshots)
	at org.sonatype.aether.connector.wagon.WagonRepositoryConnector$4.wrap(WagonRepositoryConnector.java:945)
	at org.sonatype.aether.connector.wagon.WagonRepositoryConnector$4.wrap(WagonRepositoryConnector.java:940)
	at org.sonatype.aether.connector.wagon.WagonRepositoryConnector$GetTask.flush(WagonRepositoryConnector.java:695)
	at org.sonatype.aether.connector.wagon.WagonRepositoryConnector$GetTask.flush(WagonRepositoryConnector.java:689)
	at org.sonatype.aether.connector.wagon.WagonRepositoryConnector.get(WagonRepositoryConnector.java:445)
	at org.sonatype.aether.impl.internal.DefaultArtifactResolver.resolve(DefaultArtifactResolver.java:460)
	... 34 more
channel stopped


---------------------------------------------------------------------
To unsubscribe, e-mail: dev-unsubscribe@ws.apache.org
For additional commands, e-mail: dev-help@ws.apache.org


Mime
View raw message