ws-dev mailing list archives

Site index · List index
Message view « Date » · « Thread »
Top « Date » · « Thread »
From Apache Jenkins Server <hud...@hudson.apache.org>
Subject Build failed in Jenkins: wss4j-1.5 #31
Date Wed, 01 Jun 2011 18:15:39 GMT
See <https://builds.apache.org/hudson/job/wss4j-1.5/31/changes>

Changes:

[dkulp] [WSS-292] Fix concurrency issue with EnvelopeIdResolver

------------------------------------------
[...truncated 682 lines...]
Downloading: http://repo1.maven.org/maven2/org/bouncycastle/bcprov-jdk14/1.46/bcprov-jdk14-1.46.pom
[WARNING] *** CHECKSUM FAILED - Error retrieving checksum file for org/bouncycastle/bcprov-jdk14/1.46/bcprov-jdk14-1.46.pom
- IGNORING
Downloading: http://repo1.maven.org/maven2/commons-logging/commons-logging/1.1/commons-logging-1.1.jar
Downloading: http://repo1.maven.org/maven2/log4j/log4j/1.2.12/log4j-1.2.12.jar
Downloading: http://repo1.maven.org/maven2/logkit/logkit/1.0.1/logkit-1.0.1.jar
Downloading: http://repo1.maven.org/maven2/avalon-framework/avalon-framework/4.1.3/avalon-framework-4.1.3.jar
Downloading: http://repo1.maven.org/maven2/javax/servlet/servlet-api/2.3/servlet-api-2.3.jar
Downloading: http://repo1.maven.org/maven2/commons-discovery/commons-discovery/0.2/commons-discovery-0.2.jar
Downloading: http://repo1.maven.org/maven2/commons-codec/commons-codec/1.3/commons-codec-1.3.jar
Downloading: http://repo1.maven.org/maven2/org/apache/santuario/xmlsec/1.4.5/xmlsec-1.4.5.jar
Downloading: http://repo1.maven.org/maven2/xalan/xalan/2.7.1/xalan-2.7.1.jar
Downloading: http://repo1.maven.org/maven2/xalan/serializer/2.7.1/serializer-2.7.1.jar
[WARNING] *** CHECKSUM FAILED - Checksum failed on download: local = '4b4b18df434451249bb65a63f2fb69e215a6a020';
remote = 'SHA1(serializer-2.7.1.jar)=' - RETRYING
Downloading: http://repo1.maven.org/maven2/xalan/serializer/2.7.1/serializer-2.7.1.jar
[WARNING] *** CHECKSUM FAILED - Checksum failed on download: local = '4b4b18df434451249bb65a63f2fb69e215a6a020';
remote = 'SHA1(serializer-2.7.1.jar)=' - IGNORING
Downloading: http://repo1.maven.org/maven2/xml-apis/xml-apis/1.3.04/xml-apis-1.3.04.jar
Downloading: http://repo1.maven.org/maven2/xerces/xercesImpl/2.9.1/xercesImpl-2.9.1.jar
Downloading: http://repo1.maven.org/maven2/junit/junit/3.8.1/junit-3.8.1.jar
Downloading: http://repo1.maven.org/maven2/org/opensaml/opensaml/1.1/opensaml-1.1.jar
Downloading: http://repo1.maven.org/maven2/org/apache/axis/axis/1.4/axis-1.4.jar
Downloading: http://repo1.maven.org/maven2/org/apache/axis/axis-ant/1.4/axis-ant-1.4.jar
Downloading: http://repo1.maven.org/maven2/org/apache/axis/axis-jaxrpc/1.4/axis-jaxrpc-1.4.jar
Downloading: http://repo1.maven.org/maven2/org/apache/axis/axis-saaj/1.4/axis-saaj-1.4.jar
Downloading: http://repo1.maven.org/maven2/org/bouncycastle/bcprov-jdk14/1.46/bcprov-jdk14-1.46.jar
Downloading: http://repo1.maven.org/maven2/org/apache/maven/maven-project/2.0.5/maven-project-2.0.5.pom
Downloading: http://repo1.maven.org/maven2/org/apache/maven/maven/2.0.5/maven-2.0.5.pom
Downloading: http://repo1.maven.org/maven2/org/apache/maven/maven-settings/2.0.5/maven-settings-2.0.5.pom
Downloading: http://repo1.maven.org/maven2/org/apache/maven/maven-model/2.0.5/maven-model-2.0.5.pom
Downloading: http://repo1.maven.org/maven2/org/apache/maven/maven-profile/2.0.5/maven-profile-2.0.5.pom
Downloading: http://repo1.maven.org/maven2/org/apache/maven/maven-artifact-manager/2.0.5/maven-artifact-manager-2.0.5.pom
Downloading: http://repo1.maven.org/maven2/org/apache/maven/maven-repository-metadata/2.0.5/maven-repository-metadata-2.0.5.pom
Downloading: http://repo1.maven.org/maven2/org/apache/maven/maven-artifact/2.0.5/maven-artifact-2.0.5.pom
Downloading: http://repo1.maven.org/maven2/org/apache/maven/maven-core/2.0.5/maven-core-2.0.5.pom
Downloading: http://repo1.maven.org/maven2/org/apache/maven/wagon/wagon-file/1.0-beta-2/wagon-file-1.0-beta-2.pom
Downloading: http://repo1.maven.org/maven2/org/apache/maven/wagon/wagon-providers/1.0-beta-2/wagon-providers-1.0-beta-2.pom
Downloading: http://repo1.maven.org/maven2/org/apache/maven/maven-plugin-parameter-documenter/2.0.5/maven-plugin-parameter-documenter-2.0.5.pom
Downloading: http://repo1.maven.org/maven2/org/apache/maven/wagon/wagon-http-lightweight/1.0-beta-2/wagon-http-lightweight-1.0-beta-2.pom
Downloading: http://repo1.maven.org/maven2/org/apache/maven/wagon/wagon-http-shared/1.0-beta-2/wagon-http-shared-1.0-beta-2.pom
Downloading: http://repo1.maven.org/maven2/jtidy/jtidy/4aug2000r7-dev/jtidy-4aug2000r7-dev.pom
Downloading: http://repo1.maven.org/maven2/org/apache/maven/reporting/maven-reporting-api/2.0.5/maven-reporting-api-2.0.5.pom
Downloading: http://repo1.maven.org/maven2/org/apache/maven/reporting/maven-reporting/2.0.5/maven-reporting-2.0.5.pom
Downloading: http://repo1.maven.org/maven2/org/apache/maven/maven-error-diagnostics/2.0.5/maven-error-diagnostics-2.0.5.pom
Downloading: http://repo1.maven.org/maven2/org/apache/maven/maven-plugin-registry/2.0.5/maven-plugin-registry-2.0.5.pom
Downloading: http://repo1.maven.org/maven2/commons-cli/commons-cli/1.0/commons-cli-1.0.pom
Downloading: http://repo1.maven.org/maven2/org/apache/maven/maven-plugin-api/2.0.5/maven-plugin-api-2.0.5.pom
Downloading: http://repo1.maven.org/maven2/org/apache/maven/wagon/wagon-ssh-external/1.0-beta-2/wagon-ssh-external-1.0-beta-2.pom
Downloading: http://repo1.maven.org/maven2/org/apache/maven/wagon/wagon-ssh-common/1.0-beta-2/wagon-ssh-common-1.0-beta-2.pom
Downloading: http://repo1.maven.org/maven2/org/codehaus/plexus/plexus-interactivity-api/1.0-alpha-4/plexus-interactivity-api-1.0-alpha-4.pom
Downloading: http://repo1.maven.org/maven2/org/codehaus/plexus/plexus-container-default/1.0-alpha-7/plexus-container-default-1.0-alpha-7.pom
Downloading: http://repo1.maven.org/maven2/plexus/plexus-containers/1.0.2/plexus-containers-1.0.2.pom
Downloading: http://repo1.maven.org/maven2/plexus/plexus-root/1.0.3/plexus-root-1.0.3.pom
Downloading: http://repo1.maven.org/maven2/plexus/plexus-utils/1.0.2/plexus-utils-1.0.2.pom
Downloading: http://repo1.maven.org/maven2/org/apache/maven/maven-plugin-descriptor/2.0.5/maven-plugin-descriptor-2.0.5.pom
Downloading: http://repo1.maven.org/maven2/org/apache/maven/maven-monitor/2.0.5/maven-monitor-2.0.5.pom
Downloading: http://repo1.maven.org/maven2/org/apache/maven/wagon/wagon-ssh/1.0-beta-2/wagon-ssh-1.0-beta-2.pom
Downloading: http://repo1.maven.org/maven2/com/jcraft/jsch/0.1.27/jsch-0.1.27.pom
Downloading: http://repo1.maven.org/maven2/classworlds/classworlds/1.1/classworlds-1.1.pom
Downloading: http://repo1.maven.org/maven2/velocity/velocity-dep/1.4/velocity-dep-1.4.pom
Downloading: http://repo1.maven.org/maven2/org/apache/maven/shared/maven-common-artifact-filters/1.0/maven-common-artifact-filters-1.0.pom
Downloading: http://repo1.maven.org/maven2/org/apache/maven/maven-artifact/2.0.8/maven-artifact-2.0.8.pom
Downloading: http://repo1.maven.org/maven2/org/apache/maven/maven/2.0.8/maven-2.0.8.pom
Downloading: http://repo1.maven.org/maven2/org/apache/maven/maven-parent/6/maven-parent-6.pom
Downloading: http://repo1.maven.org/maven2/org/apache/maven/shared/maven-plugin-testing-harness/1.1/maven-plugin-testing-harness-1.1.pom
Downloading: http://repo1.maven.org/maven2/org/apache/maven/shared/maven-shared-components/7/maven-shared-components-7.pom
Downloading: http://repo1.maven.org/maven2/org/apache/maven/maven-core/2.0/maven-core-2.0.pom
Downloading: http://repo1.maven.org/maven2/org/codehaus/plexus/plexus-utils/1.4.2/plexus-utils-1.4.2.pom
Downloading: http://repo1.maven.org/maven2/org/codehaus/plexus/plexus-archiver/1.0-alpha-7/plexus-archiver-1.0-alpha-7.pom
Downloading: http://repo1.maven.org/maven2/org/codehaus/plexus/plexus-components/1.1.6/plexus-components-1.1.6.pom
Downloading: http://repo1.maven.org/maven2/org/codehaus/plexus/plexus/1.0.8/plexus-1.0.8.pom
Downloading: http://repo1.maven.org/maven2/org/codehaus/plexus/plexus-utils/1.2/plexus-utils-1.2.pom
Downloading: http://repo1.maven.org/maven2/org/codehaus/plexus/plexus/1.0.5/plexus-1.0.5.pom
Downloading: http://repo1.maven.org/maven2/org/apache/maven/shared/maven-downloader/1.1/maven-downloader-1.1.pom
Downloading: http://repo1.maven.org/maven2/org/apache/maven/shared/maven-shared-components/4/maven-shared-components-4.pom
Downloading: http://repo1.maven.org/maven2/org/codehaus/plexus/plexus-velocity/1.1.3/plexus-velocity-1.1.3.pom
Downloading: http://repo1.maven.org/maven2/org/codehaus/plexus/plexus-components/1.1.5/plexus-components-1.1.5.pom
Downloading: http://repo1.maven.org/maven2/commons-collections/commons-collections/2.0/commons-collections-2.0.pom
Downloading: http://repo1.maven.org/maven2/velocity/velocity/1.4/velocity-1.4.pom
Downloading: http://repo1.maven.org/maven2/org/codehaus/plexus/plexus-resources/1.0-alpha-4/plexus-resources-1.0-alpha-4.pom
Downloading: http://repo1.maven.org/maven2/org/codehaus/plexus/plexus-components/1.1.7/plexus-components-1.1.7.pom
Downloading: http://repo1.maven.org/maven2/org/codehaus/plexus/plexus-utils/1.4.1/plexus-utils-1.4.1.jar
Downloading: http://repo1.maven.org/maven2/velocity/velocity-dep/1.4/velocity-dep-1.4.jar
Downloading: http://repo1.maven.org/maven2/org/apache/maven/shared/maven-common-artifact-filters/1.0/maven-common-artifact-filters-1.0.jar
Downloading: http://repo1.maven.org/maven2/org/apache/maven/shared/maven-plugin-testing-harness/1.1/maven-plugin-testing-harness-1.1.jar
Downloading: http://repo1.maven.org/maven2/org/codehaus/plexus/plexus-archiver/1.0-alpha-7/plexus-archiver-1.0-alpha-7.jar
Downloading: http://repo1.maven.org/maven2/org/apache/maven/shared/maven-downloader/1.1/maven-downloader-1.1.jar
Downloading: http://repo1.maven.org/maven2/org/codehaus/plexus/plexus-velocity/1.1.3/plexus-velocity-1.1.3.jar
Downloading: http://repo1.maven.org/maven2/commons-collections/commons-collections/2.0/commons-collections-2.0.jar
Downloading: http://repo1.maven.org/maven2/velocity/velocity/1.4/velocity-1.4.jar
Downloading: http://repo1.maven.org/maven2/org/codehaus/plexus/plexus-resources/1.0-alpha-4/plexus-resources-1.0-alpha-4.jar
[INFO] Setting property: classpath.resource.loader.class => 'org.codehaus.plexus.velocity.ContextClassLoaderResourceLoader'.
[INFO] Setting property: velocimacro.messages.on => 'false'.
[INFO] Setting property: resource.loader => 'classpath'.
[INFO] Setting property: resource.manager.logwhenfound => 'false'.
[INFO] [remote-resources:process {execution: default}]
Downloading: http://repo1.maven.org/maven2/org/apache/apache-jar-resource-bundle/1.4/apache-jar-resource-bundle-1.4.jar
[INFO] [resources:resources]
[INFO] Using default encoding to copy filtered resources.
Downloading: http://repo1.maven.org/maven2/org/codehaus/plexus/plexus-utils/1.5.1/plexus-utils-1.5.1.pom
Downloading: http://repo1.maven.org/maven2/org/codehaus/plexus/plexus-compiler-api/1.6/plexus-compiler-api-1.6.pom
Downloading: http://repo1.maven.org/maven2/org/codehaus/plexus/plexus-compiler/1.6/plexus-compiler-1.6.pom
Downloading: http://repo1.maven.org/maven2/org/codehaus/plexus/plexus-components/1.1.16/plexus-components-1.1.16.pom
Downloading: http://repo1.maven.org/maven2/org/codehaus/plexus/plexus/2.0.4/plexus-2.0.4.pom
Downloading: http://repo1.maven.org/maven2/org/apache/maven/maven-toolchain/1.0/maven-toolchain-1.0.pom
Downloading: http://repo1.maven.org/maven2/org/apache/maven/maven-core/2.0.6/maven-core-2.0.6.pom
Downloading: http://repo1.maven.org/maven2/org/apache/maven/maven-plugin-parameter-documenter/2.0.6/maven-plugin-parameter-documenter-2.0.6.pom
Downloading: http://repo1.maven.org/maven2/org/apache/maven/maven-error-diagnostics/2.0.6/maven-error-diagnostics-2.0.6.pom
Downloading: http://repo1.maven.org/maven2/org/apache/maven/maven-plugin-descriptor/2.0.6/maven-plugin-descriptor-2.0.6.pom
Downloading: http://repo1.maven.org/maven2/org/apache/maven/maven-monitor/2.0.6/maven-monitor-2.0.6.pom
Downloading: http://repo1.maven.org/maven2/org/codehaus/plexus/plexus-compiler-manager/1.6/plexus-compiler-manager-1.6.pom
Downloading: http://repo1.maven.org/maven2/org/codehaus/plexus/plexus-compiler-javac/1.6/plexus-compiler-javac-1.6.pom
Downloading: http://repo1.maven.org/maven2/org/codehaus/plexus/plexus-compilers/1.6/plexus-compilers-1.6.pom
Downloading: http://repo1.maven.org/maven2/org/codehaus/plexus/plexus-utils/1.5.1/plexus-utils-1.5.1.jar
Downloading: http://repo1.maven.org/maven2/org/codehaus/plexus/plexus-compiler-api/1.6/plexus-compiler-api-1.6.jar
Downloading: http://repo1.maven.org/maven2/org/codehaus/plexus/plexus-compiler-manager/1.6/plexus-compiler-manager-1.6.jar
Downloading: http://repo1.maven.org/maven2/org/codehaus/plexus/plexus-compiler-javac/1.6/plexus-compiler-javac-1.6.jar
[INFO] [compiler:compile]
[WARNING] File encoding has not been set, using platform encoding ANSI_X3.4-1968, i.e. build
is platform dependent!
[INFO] Compiling 112 source files to <https://builds.apache.org/hudson/job/wss4j-1.5/ws/wss4j/target/classes>
[INFO] [resources:testResources]
[INFO] Using default encoding to copy filtered resources.
[INFO] [compiler:testCompile]
[WARNING] File encoding has not been set, using platform encoding ANSI_X3.4-1968, i.e. build
is platform dependent!
[INFO] Compiling 58 source files to <https://builds.apache.org/hudson/job/wss4j-1.5/ws/wss4j/target/test-classes>
Downloading: http://repo1.maven.org/maven2/org/apache/maven/maven-plugin-api/2.0.9/maven-plugin-api-2.0.9.pom
Downloading: http://repo1.maven.org/maven2/org/apache/maven/maven/2.0.9/maven-2.0.9.pom
Downloading: http://repo1.maven.org/maven2/org/apache/maven/maven-parent/8/maven-parent-8.pom
Downloading: http://repo1.maven.org/maven2/org/apache/maven/surefire/surefire-booter/2.6/surefire-booter-2.6.pom
Downloading: http://repo1.maven.org/maven2/org/apache/maven/surefire/surefire-api/2.6/surefire-api-2.6.pom
Downloading: http://repo1.maven.org/maven2/org/apache/maven/surefire/maven-surefire-common/2.6/maven-surefire-common-2.6.pom
Downloading: http://repo1.maven.org/maven2/org/codehaus/plexus/plexus-utils/2.0.5/plexus-utils-2.0.5.pom
Downloading: http://repo1.maven.org/maven2/org/codehaus/plexus/plexus/2.0.6/plexus-2.0.6.pom
Downloading: http://repo1.maven.org/maven2/org/apache/maven/maven-artifact/2.0.9/maven-artifact-2.0.9.pom
Downloading: http://repo1.maven.org/maven2/org/apache/maven/maven-project/2.0.9/maven-project-2.0.9.pom
Downloading: http://repo1.maven.org/maven2/org/apache/maven/maven-settings/2.0.9/maven-settings-2.0.9.pom
Downloading: http://repo1.maven.org/maven2/org/apache/maven/maven-model/2.0.9/maven-model-2.0.9.pom
Downloading: http://repo1.maven.org/maven2/org/apache/maven/maven-profile/2.0.9/maven-profile-2.0.9.pom
Downloading: http://repo1.maven.org/maven2/org/apache/maven/maven-artifact-manager/2.0.9/maven-artifact-manager-2.0.9.pom
Downloading: http://repo1.maven.org/maven2/org/apache/maven/maven-repository-metadata/2.0.9/maven-repository-metadata-2.0.9.pom
Downloading: http://repo1.maven.org/maven2/org/apache/maven/maven-plugin-registry/2.0.9/maven-plugin-registry-2.0.9.pom
Downloading: http://repo1.maven.org/maven2/org/apache/maven/maven-core/2.0.9/maven-core-2.0.9.pom
Downloading: http://repo1.maven.org/maven2/org/apache/maven/maven-plugin-parameter-documenter/2.0.9/maven-plugin-parameter-documenter-2.0.9.pom
Downloading: http://repo1.maven.org/maven2/org/apache/maven/reporting/maven-reporting-api/2.0.9/maven-reporting-api-2.0.9.pom
Downloading: http://repo1.maven.org/maven2/org/apache/maven/reporting/maven-reporting/2.0.9/maven-reporting-2.0.9.pom
Downloading: http://repo1.maven.org/maven2/org/apache/maven/maven-error-diagnostics/2.0.9/maven-error-diagnostics-2.0.9.pom
Downloading: http://repo1.maven.org/maven2/org/apache/maven/maven-plugin-descriptor/2.0.9/maven-plugin-descriptor-2.0.9.pom
Downloading: http://repo1.maven.org/maven2/org/apache/maven/maven-monitor/2.0.9/maven-monitor-2.0.9.pom
Downloading: http://repo1.maven.org/maven2/org/apache/maven/maven-toolchain/2.0.9/maven-toolchain-2.0.9.pom
Downloading: http://repo1.maven.org/maven2/org/apache/maven/shared/maven-common-artifact-filters/1.2/maven-common-artifact-filters-1.2.pom
Downloading: http://repo1.maven.org/maven2/org/apache/maven/maven-model/2.0.8/maven-model-2.0.8.pom
Downloading: http://repo1.maven.org/maven2/org/apache/maven/maven-project/2.0.8/maven-project-2.0.8.pom
Downloading: http://repo1.maven.org/maven2/org/apache/maven/maven-plugin-api/2.0.8/maven-plugin-api-2.0.8.pom
Downloading: http://repo1.maven.org/maven2/org/apache/maven/surefire/surefire-booter/2.6/surefire-booter-2.6.jar
Downloading: http://repo1.maven.org/maven2/org/apache/maven/surefire/surefire-api/2.6/surefire-api-2.6.jar
Downloading: http://repo1.maven.org/maven2/org/apache/maven/surefire/maven-surefire-common/2.6/maven-surefire-common-2.6.jar
Downloading: http://repo1.maven.org/maven2/org/codehaus/plexus/plexus-utils/2.0.5/plexus-utils-2.0.5.jar
Downloading: http://repo1.maven.org/maven2/org/apache/maven/shared/maven-common-artifact-filters/1.2/maven-common-artifact-filters-1.2.jar
[INFO] [surefire:test]
Downloading: http://repo1.maven.org/maven2/org/apache/maven/surefire/surefire-junit/2.6/surefire-junit-2.6.pom
Downloading: http://repo1.maven.org/maven2/org/apache/maven/surefire/surefire-providers/2.6/surefire-providers-2.6.pom
Downloading: http://repo1.maven.org/maven2/org/apache/maven/surefire/surefire-junit/2.6/surefire-junit-2.6.jar
[WARNING] Build uses Maven 2.0.x, cannot propagate system properties from command line to
tests (cf. SUREFIRE-121)
[INFO] Surefire report directory: <https://builds.apache.org/hudson/job/wss4j-1.5/ws/wss4j/target/surefire-reports>

-------------------------------------------------------
 T E S T S
-------------------------------------------------------
Running components.PackageTests
Tests run: 7, Failures: 0, Errors: 0, Skipped: 0, Time elapsed: 0.819 sec
Running wssec.PackageTests
Tests run: 161, Failures: 0, Errors: 0, Skipped: 0, Time elapsed: 4.165 sec

Results :

Tests run: 168, Failures: 0, Errors: 0, Skipped: 0

[JENKINS] Recording test results
Downloading: http://repo1.maven.org/maven2/biz/aQute/bndlib/0.0.255/bndlib-0.0.255.pom
Downloading: http://repo1.maven.org/maven2/net/sf/kxml/kxml2/2.2.2/kxml2-2.2.2.pom
Downloading: http://repo1.maven.org/maven2/xmlpull/xmlpull/1.1.3.1/xmlpull-1.1.3.1.pom
Downloading: http://repo1.maven.org/maven2/org/apache/felix/org.osgi.core/1.0.0/org.osgi.core-1.0.0.pom
Downloading: http://repo1.maven.org/maven2/org/apache/felix/felix/1.0.0/felix-1.0.0.pom
Downloading: http://repo1.maven.org/maven2/org/apache/felix/org.osgi.service.obr/1.0.1/org.osgi.service.obr-1.0.1.pom
Downloading: http://repo1.maven.org/maven2/org/apache/maven/maven-project/2.0.7/maven-project-2.0.7.pom
Downloading: http://repo1.maven.org/maven2/org/apache/maven/maven/2.0.7/maven-2.0.7.pom
Downloading: http://repo1.maven.org/maven2/org/apache/maven/maven-settings/2.0.7/maven-settings-2.0.7.pom
Downloading: http://repo1.maven.org/maven2/org/apache/maven/maven-model/2.0.7/maven-model-2.0.7.pom
Downloading: http://repo1.maven.org/maven2/org/apache/maven/maven-profile/2.0.7/maven-profile-2.0.7.pom
Downloading: http://repo1.maven.org/maven2/org/apache/maven/maven-artifact-manager/2.0.7/maven-artifact-manager-2.0.7.pom
Downloading: http://repo1.maven.org/maven2/org/apache/maven/maven-repository-metadata/2.0.7/maven-repository-metadata-2.0.7.pom
Downloading: http://repo1.maven.org/maven2/org/apache/maven/maven-artifact/2.0.7/maven-artifact-2.0.7.pom
Downloading: http://repo1.maven.org/maven2/org/apache/maven/maven-plugin-registry/2.0.7/maven-plugin-registry-2.0.7.pom
Downloading: http://repo1.maven.org/maven2/org/apache/maven/maven-plugin-api/2.0.7/maven-plugin-api-2.0.7.pom
Downloading: http://repo1.maven.org/maven2/org/apache/maven/maven-archiver/2.2/maven-archiver-2.2.pom
Downloading: http://repo1.maven.org/maven2/org/apache/maven/shared/maven-shared-components/3/maven-shared-components-3.pom
Downloading: http://repo1.maven.org/maven2/org/apache/maven/shared/maven-dependency-tree/1.1/maven-dependency-tree-1.1.pom
Downloading: http://repo1.maven.org/maven2/org/apache/maven/shared/maven-osgi/0.2.0/maven-osgi-0.2.0.pom
Downloading: http://repo1.maven.org/maven2/biz/aQute/bndlib/0.0.203/bndlib-0.0.203.pom
Downloading: http://repo1.maven.org/maven2/org/codehaus/plexus/plexus-utils/1.4.7/plexus-utils-1.4.7.pom
Downloading: http://repo1.maven.org/maven2/biz/aQute/bndlib/0.0.255/bndlib-0.0.255.jar
Downloading: http://repo1.maven.org/maven2/net/sf/kxml/kxml2/2.2.2/kxml2-2.2.2.jar
Downloading: http://repo1.maven.org/maven2/xmlpull/xmlpull/1.1.3.1/xmlpull-1.1.3.1.jar
Downloading: http://repo1.maven.org/maven2/org/apache/felix/org.osgi.core/1.0.0/org.osgi.core-1.0.0.jar
Downloading: http://repo1.maven.org/maven2/org/apache/felix/org.osgi.service.obr/1.0.1/org.osgi.service.obr-1.0.1.jar
Downloading: http://repo1.maven.org/maven2/org/codehaus/plexus/plexus-utils/1.4.7/plexus-utils-1.4.7.jar
Downloading: http://repo1.maven.org/maven2/org/apache/maven/maven-archiver/2.2/maven-archiver-2.2.jar
Downloading: http://repo1.maven.org/maven2/org/apache/maven/shared/maven-dependency-tree/1.1/maven-dependency-tree-1.1.jar
Downloading: http://repo1.maven.org/maven2/org/apache/maven/shared/maven-osgi/0.2.0/maven-osgi-0.2.0.jar
[INFO] [bundle:bundle]
[WARNING] Warning building bundle org.apache.ws.security:wss4j:bundle:1.5.12-SNAPSHOT : Did
not find matching referal for javax.xml.crypto.*
[WARNING] Warning building bundle org.apache.ws.security:wss4j:bundle:1.5.12-SNAPSHOT : Did
not find matching referal for org.jcp.xml.dsig.internal.*
Downloading: http://repo1.maven.org/maven2/org/codehaus/plexus/plexus-digest/1.0/plexus-digest-1.0.pom
Downloading: http://repo1.maven.org/maven2/org/codehaus/plexus/plexus-digest/1.0/plexus-digest-1.0.jar
[INFO] [install:install]
[INFO] Installing <https://builds.apache.org/hudson/job/wss4j-1.5/ws/wss4j/target/wss4j-1.5.12-SNAPSHOT.jar>
to <https://builds.apache.org/hudson/job/wss4j-1.5/ws/.repository/org/apache/ws/security/wss4j/1.5.12-SNAPSHOT/wss4j-1.5.12-SNAPSHOT.jar>
[INFO] [bundle:install]
[INFO] Parsing <https://builds.apache.org/hudson/job/wss4j-1.5/ws/.repository/repository.xml>
[INFO] Installing org/apache/ws/security/wss4j/1.5.12-SNAPSHOT/wss4j-1.5.12-SNAPSHOT.jar
[INFO] Writing OBR metadata
Downloading: http://repo1.maven.org/maven2/org/apache/maven/maven-settings/2.0/maven-settings-2.0.pom
Downloading: http://repo1.maven.org/maven2/org/apache/maven/wagon/wagon-file/1.0-alpha-5/wagon-file-1.0-alpha-5.pom
Downloading: http://repo1.maven.org/maven2/org/apache/maven/maven-plugin-parameter-documenter/2.0/maven-plugin-parameter-documenter-2.0.pom
Downloading: http://repo1.maven.org/maven2/org/apache/maven/wagon/wagon-http-lightweight/1.0-alpha-5/wagon-http-lightweight-1.0-alpha-5.pom
Downloading: http://repo1.maven.org/maven2/org/apache/maven/reporting/maven-reporting-api/2.0/maven-reporting-api-2.0.pom
Downloading: http://repo1.maven.org/maven2/org/apache/maven/reporting/maven-reporting/2.0/maven-reporting-2.0.pom
Downloading: http://repo1.maven.org/maven2/doxia/doxia-sink-api/1.0-alpha-4/doxia-sink-api-1.0-alpha-4.pom
Downloading: http://repo1.maven.org/maven2/org/apache/maven/maven-error-diagnostics/2.0/maven-error-diagnostics-2.0.pom
Downloading: http://repo1.maven.org/maven2/org/apache/maven/maven-plugin-registry/2.0/maven-plugin-registry-2.0.pom
Downloading: http://repo1.maven.org/maven2/org/apache/maven/maven-plugin-descriptor/2.0/maven-plugin-descriptor-2.0.pom
Downloading: http://repo1.maven.org/maven2/org/apache/maven/maven-monitor/2.0/maven-monitor-2.0.pom
Downloading: http://repo1.maven.org/maven2/org/apache/maven/wagon/wagon-ssh/1.0-alpha-5/wagon-ssh-1.0-alpha-5.pom
Downloading: http://repo1.maven.org/maven2/com/jcraft/jsch/0.1.23/jsch-0.1.23.pom
[INFO] [deploy:deploy]
altDeploymentRepository = null
[INFO] Retrieving previous build number from apache.snapshots.https
[JENKINS] Archiving <https://builds.apache.org/hudson/job/wss4j-1.5/ws/wss4j/target/wss4j-1.5.12-SNAPSHOT.jar>
to /home/hudson/hudson/jobs/wss4j-1.5/modules/org.apache.ws.security$wss4j/builds/2011-06-01_18-10-50/archive/org.apache.ws.security/wss4j/1.5.12-SNAPSHOT/wss4j-1.5.12-SNAPSHOT.jar
[INFO] ------------------------------------------------------------------------
[ERROR] BUILD ERROR
[INFO] ------------------------------------------------------------------------
[INFO] Error retrieving previous build number for artifact 'org.apache.ws.security:wss4j:bundle':
Cannot read metadata from '<https://builds.apache.org/hudson/job/wss4j-1.5/ws/.repository/org/apache/ws/security/wss4j/1.5.12-SNAPSHOT/maven-metadata-apache.snapshots.https.xml'>:
expected START_TAG or END_TAG not TEXT (position: TEXT seen ...<extension>jar</...
@14:25) 

[INFO] ------------------------------------------------------------------------
[INFO] For more information, run Maven with the -e switch
[INFO] ------------------------------------------------------------------------
[INFO] Total time: 4 minutes 18 seconds
[INFO] Finished at: Wed Jun 01 11:15:35 PDT 2011
[INFO] Final Memory: 37M/73M
[INFO] ------------------------------------------------------------------------
Sending e-mails to: wss4j-dev@ws.apache.org dkulp_apache@dankulp.com
channel stopped


---------------------------------------------------------------------
To unsubscribe, e-mail: dev-unsubscribe@ws.apache.org
For additional commands, e-mail: dev-help@ws.apache.org


Mime
View raw message