ws-dev mailing list archives

Site index · List index
Message view « Date » · « Thread »
Top « Date » · « Thread »
From Apache Hudson Server <hud...@hudson.apache.org>
Subject Build failed in Hudson: xmlschema-new-trunk-jdk15-native-m3 #3
Date Sun, 23 Jan 2011 19:52:24 GMT
See <https://hudson.apache.org/hudson/job/xmlschema-new-trunk-jdk15-native-m3/3/>

------------------------------------------
[...truncated 889 lines...]
Downloaded: http://repo1.maven.org/maven2/org/codehaus/plexus/plexus-compiler-api/1.8.1/plexus-compiler-api-1.8.1.pom
(805 B at 1.1 KB/sec)
Downloading: http://repo1.maven.org/maven2/org/codehaus/plexus/plexus-compiler/1.8.1/plexus-compiler-1.8.1.pom
Downloaded: http://repo1.maven.org/maven2/org/codehaus/plexus/plexus-compiler/1.8.1/plexus-compiler-1.8.1.pom
(4 KB at 4.4 KB/sec)
Downloading: http://repo1.maven.org/maven2/org/codehaus/plexus/plexus-components/1.1.18/plexus-components-1.1.18.pom
Downloaded: http://repo1.maven.org/maven2/org/codehaus/plexus/plexus-components/1.1.18/plexus-components-1.1.18.pom
(6 KB at 7.0 KB/sec)
Downloading: http://repo1.maven.org/maven2/org/codehaus/plexus/plexus/2.0.7/plexus-2.0.7.pom
Downloaded: http://repo1.maven.org/maven2/org/codehaus/plexus/plexus/2.0.7/plexus-2.0.7.pom
(17 KB at 22.9 KB/sec)
Downloading: http://repo1.maven.org/maven2/org/codehaus/plexus/plexus-compiler-manager/1.8.1/plexus-compiler-manager-1.8.1.pom
Downloaded: http://repo1.maven.org/maven2/org/codehaus/plexus/plexus-compiler-manager/1.8.1/plexus-compiler-manager-1.8.1.pom
(713 B at 0.9 KB/sec)
Downloading: http://repo1.maven.org/maven2/org/codehaus/plexus/plexus-compiler-javac/1.8.1/plexus-compiler-javac-1.8.1.pom
Downloaded: http://repo1.maven.org/maven2/org/codehaus/plexus/plexus-compiler-javac/1.8.1/plexus-compiler-javac-1.8.1.pom
(710 B at 0.9 KB/sec)
Downloading: http://repo1.maven.org/maven2/org/codehaus/plexus/plexus-compilers/1.8.1/plexus-compilers-1.8.1.pom
Downloaded: http://repo1.maven.org/maven2/org/codehaus/plexus/plexus-compilers/1.8.1/plexus-compilers-1.8.1.pom
(2 KB at 1.7 KB/sec)
Downloading: http://repo1.maven.org/maven2/org/codehaus/plexus/plexus-compiler-api/1.8.1/plexus-compiler-api-1.8.1.jar
Downloading: http://repo1.maven.org/maven2/org/codehaus/plexus/plexus-compiler-manager/1.8.1/plexus-compiler-manager-1.8.1.jar
Downloading: http://repo1.maven.org/maven2/org/codehaus/plexus/plexus-compiler-javac/1.8.1/plexus-compiler-javac-1.8.1.jar
Downloaded: http://repo1.maven.org/maven2/org/codehaus/plexus/plexus-compiler-manager/1.8.1/plexus-compiler-manager-1.8.1.jar
(6 KB at 3.6 KB/sec)
Downloaded: http://repo1.maven.org/maven2/org/codehaus/plexus/plexus-compiler-api/1.8.1/plexus-compiler-api-1.8.1.jar
(20 KB at 11.6 KB/sec)
Downloaded: http://repo1.maven.org/maven2/org/codehaus/plexus/plexus-compiler-javac/1.8.1/plexus-compiler-javac-1.8.1.jar
(13 KB at 5.7 KB/sec)
[INFO] No sources to compile
[INFO] [INFO] Using 'UTF-8' encoding to copy filtered resources.

[INFO] --- maven-resources-plugin:2.4:testResources (default-testResources) @ xmlschema-eclipse
---[INFO] skip non existing resourceDirectory <https://hudson.apache.org/hudson/job/xmlschema-new-trunk-jdk15-native-m3/ws/xmlschema-eclipse/src/test/resources>
[INFO] Copying 3 resources

[INFO] 
[INFO] --- maven-compiler-plugin:2.3.2:testCompile (default-testCompile) @ xmlschema-eclipse
---[INFO] No sources to compile

[INFO] 
[INFO] --- maven-surefire-plugin:2.6:test (default-test) @ xmlschema-eclipse ---Downloading:
http://repo1.maven.org/maven2/org/apache/maven/maven-plugin-api/2.0.9/maven-plugin-api-2.0.9.pom

Downloaded: http://repo1.maven.org/maven2/org/apache/maven/maven-plugin-api/2.0.9/maven-plugin-api-2.0.9.pom
(2 KB at 1.7 KB/sec)
Downloading: http://repo1.maven.org/maven2/org/apache/maven/maven/2.0.9/maven-2.0.9.pom
Downloaded: http://repo1.maven.org/maven2/org/apache/maven/maven/2.0.9/maven-2.0.9.pom (19
KB at 49.2 KB/sec)
Downloading: http://repo1.maven.org/maven2/org/apache/maven/maven-parent/8/maven-parent-8.pom
Downloaded: http://repo1.maven.org/maven2/org/apache/maven/maven-parent/8/maven-parent-8.pom
(24 KB at 26.9 KB/sec)
Downloading: http://repo1.maven.org/maven2/org/apache/maven/surefire/surefire-booter/2.6/surefire-booter-2.6.pom
Downloaded: http://repo1.maven.org/maven2/org/apache/maven/surefire/surefire-booter/2.6/surefire-booter-2.6.pom
(2 KB at 2.7 KB/sec)
Downloading: http://repo1.maven.org/maven2/org/apache/maven/surefire/surefire-api/2.6/surefire-api-2.6.pom
Downloaded: http://repo1.maven.org/maven2/org/apache/maven/surefire/surefire-api/2.6/surefire-api-2.6.pom
(3 KB at 2.8 KB/sec)
Downloading: http://repo1.maven.org/maven2/org/apache/maven/surefire/maven-surefire-common/2.6/maven-surefire-common-2.6.pom
Downloaded: http://repo1.maven.org/maven2/org/apache/maven/surefire/maven-surefire-common/2.6/maven-surefire-common-2.6.pom
(4 KB at 5.1 KB/sec)
Downloading: http://repo1.maven.org/maven2/org/apache/maven/maven-artifact/2.0.9/maven-artifact-2.0.9.pom
Downloaded: http://repo1.maven.org/maven2/org/apache/maven/maven-artifact/2.0.9/maven-artifact-2.0.9.pom
(2 KB at 2.1 KB/sec)
Downloading: http://repo1.maven.org/maven2/org/apache/maven/maven-project/2.0.9/maven-project-2.0.9.pom
Downloaded: http://repo1.maven.org/maven2/org/apache/maven/maven-project/2.0.9/maven-project-2.0.9.pom
(3 KB at 3.5 KB/sec)
Downloading: http://repo1.maven.org/maven2/org/apache/maven/maven-settings/2.0.9/maven-settings-2.0.9.pom
Downloaded: http://repo1.maven.org/maven2/org/apache/maven/maven-settings/2.0.9/maven-settings-2.0.9.pom
(3 KB at 2.7 KB/sec)
Downloading: http://repo1.maven.org/maven2/org/apache/maven/maven-model/2.0.9/maven-model-2.0.9.pom
Downloaded: http://repo1.maven.org/maven2/org/apache/maven/maven-model/2.0.9/maven-model-2.0.9.pom
(4 KB at 4.1 KB/sec)
Downloading: http://repo1.maven.org/maven2/org/apache/maven/maven-profile/2.0.9/maven-profile-2.0.9.pom
Downloaded: http://repo1.maven.org/maven2/org/apache/maven/maven-profile/2.0.9/maven-profile-2.0.9.pom
(3 KB at 2.8 KB/sec)
Downloading: http://repo1.maven.org/maven2/org/apache/maven/maven-artifact-manager/2.0.9/maven-artifact-manager-2.0.9.pom
Downloaded: http://repo1.maven.org/maven2/org/apache/maven/maven-artifact-manager/2.0.9/maven-artifact-manager-2.0.9.pom
(3 KB at 3.7 KB/sec)
Downloading: http://repo1.maven.org/maven2/org/apache/maven/maven-repository-metadata/2.0.9/maven-repository-metadata-2.0.9.pom
Downloaded: http://repo1.maven.org/maven2/org/apache/maven/maven-repository-metadata/2.0.9/maven-repository-metadata-2.0.9.pom
(2 KB at 2.5 KB/sec)
Downloading: http://repo1.maven.org/maven2/org/apache/maven/maven-plugin-registry/2.0.9/maven-plugin-registry-2.0.9.pom
Downloaded: http://repo1.maven.org/maven2/org/apache/maven/maven-plugin-registry/2.0.9/maven-plugin-registry-2.0.9.pom
(2 KB at 2.6 KB/sec)
Downloading: http://repo1.maven.org/maven2/org/apache/maven/maven-core/2.0.9/maven-core-2.0.9.pom
Downloaded: http://repo1.maven.org/maven2/org/apache/maven/maven-core/2.0.9/maven-core-2.0.9.pom
(8 KB at 10.4 KB/sec)
Downloading: http://repo1.maven.org/maven2/org/apache/maven/maven-plugin-parameter-documenter/2.0.9/maven-plugin-parameter-documenter-2.0.9.pom
Downloaded: http://repo1.maven.org/maven2/org/apache/maven/maven-plugin-parameter-documenter/2.0.9/maven-plugin-parameter-documenter-2.0.9.pom
(2 KB at 2.7 KB/sec)
Downloading: http://repo1.maven.org/maven2/org/apache/maven/reporting/maven-reporting-api/2.0.9/maven-reporting-api-2.0.9.pom
Downloaded: http://repo1.maven.org/maven2/org/apache/maven/reporting/maven-reporting-api/2.0.9/maven-reporting-api-2.0.9.pom
(2 KB at 2.4 KB/sec)
Downloading: http://repo1.maven.org/maven2/org/apache/maven/reporting/maven-reporting/2.0.9/maven-reporting-2.0.9.pom
Downloaded: http://repo1.maven.org/maven2/org/apache/maven/reporting/maven-reporting/2.0.9/maven-reporting-2.0.9.pom
(2 KB at 1.9 KB/sec)
Downloading: http://repo1.maven.org/maven2/org/apache/maven/maven-error-diagnostics/2.0.9/maven-error-diagnostics-2.0.9.pom
Downloaded: http://repo1.maven.org/maven2/org/apache/maven/maven-error-diagnostics/2.0.9/maven-error-diagnostics-2.0.9.pom
(2 KB at 2.4 KB/sec)
Downloading: http://repo1.maven.org/maven2/org/apache/maven/maven-plugin-descriptor/2.0.9/maven-plugin-descriptor-2.0.9.pom
Downloaded: http://repo1.maven.org/maven2/org/apache/maven/maven-plugin-descriptor/2.0.9/maven-plugin-descriptor-2.0.9.pom
(3 KB at 2.7 KB/sec)
Downloading: http://repo1.maven.org/maven2/org/apache/maven/maven-monitor/2.0.9/maven-monitor-2.0.9.pom
Downloaded: http://repo1.maven.org/maven2/org/apache/maven/maven-monitor/2.0.9/maven-monitor-2.0.9.pom
(2 KB at 1.7 KB/sec)
Downloading: http://repo1.maven.org/maven2/org/apache/maven/maven-toolchain/2.0.9/maven-toolchain-2.0.9.pom
Downloaded: http://repo1.maven.org/maven2/org/apache/maven/maven-toolchain/2.0.9/maven-toolchain-2.0.9.pom
(4 KB at 4.7 KB/sec)
Downloading: http://repo1.maven.org/maven2/org/apache/maven/shared/maven-common-artifact-filters/1.2/maven-common-artifact-filters-1.2.pom
Downloaded: http://repo1.maven.org/maven2/org/apache/maven/shared/maven-common-artifact-filters/1.2/maven-common-artifact-filters-1.2.pom
(5 KB at 6.2 KB/sec)
Downloading: http://repo1.maven.org/maven2/org/apache/maven/maven-plugin-api/2.0.8/maven-plugin-api-2.0.8.pom
Downloaded: http://repo1.maven.org/maven2/org/apache/maven/maven-plugin-api/2.0.8/maven-plugin-api-2.0.8.pom
(2 KB at 2.0 KB/sec)
Downloading: http://repo1.maven.org/maven2/org/apache/maven/surefire/surefire-booter/2.6/surefire-booter-2.6.jar
Downloading: http://repo1.maven.org/maven2/org/apache/maven/surefire/surefire-api/2.6/surefire-api-2.6.jar
Downloading: http://repo1.maven.org/maven2/org/apache/maven/surefire/maven-surefire-common/2.6/maven-surefire-common-2.6.jar
Downloading: http://repo1.maven.org/maven2/org/apache/maven/shared/maven-common-artifact-filters/1.2/maven-common-artifact-filters-1.2.jar
Downloading: http://repo1.maven.org/maven2/org/apache/maven/reporting/maven-reporting-api/2.0.9/maven-reporting-api-2.0.9.jar
Downloaded: http://repo1.maven.org/maven2/org/apache/maven/shared/maven-common-artifact-filters/1.2/maven-common-artifact-filters-1.2.jar
(31 KB at 17.8 KB/sec)
Downloaded: http://repo1.maven.org/maven2/org/apache/maven/surefire/surefire-booter/2.6/surefire-booter-2.6.jar
(271 KB at 114.0 KB/sec)
Downloaded: http://repo1.maven.org/maven2/org/apache/maven/reporting/maven-reporting-api/2.0.9/maven-reporting-api-2.0.9.jar
(10 KB at 4.0 KB/sec)
Downloaded: http://repo1.maven.org/maven2/org/apache/maven/surefire/maven-surefire-common/2.6/maven-surefire-common-2.6.jar
(22 KB at 5.8 KB/sec)
Downloaded: http://repo1.maven.org/maven2/org/apache/maven/surefire/surefire-api/2.6/surefire-api-2.6.jar
(519 KB at 85.0 KB/sec)
Downloading: http://repo1.maven.org/maven2/org/apache/maven/surefire/surefire-junit/2.6/surefire-junit-2.6.pom
Downloaded: http://repo1.maven.org/maven2/org/apache/maven/surefire/surefire-junit/2.6/surefire-junit-2.6.pom
(2 KB at 3.3 KB/sec)
Downloading: http://repo1.maven.org/maven2/org/apache/maven/surefire/surefire-providers/2.6/surefire-providers-2.6.pom
Downloaded: http://repo1.maven.org/maven2/org/apache/maven/surefire/surefire-providers/2.6/surefire-providers-2.6.pom
(2 KB at 2.3 KB/sec)
Downloading: http://repo1.maven.org/maven2/org/apache/maven/surefire/surefire-junit/2.6/surefire-junit-2.6.jar
Downloaded: http://repo1.maven.org/maven2/org/apache/maven/surefire/surefire-junit/2.6/surefire-junit-2.6.jar
(16 KB at 18.5 KB/sec)
[INFO] Surefire report directory: <https://hudson.apache.org/hudson/job/xmlschema-new-trunk-jdk15-native-m3/ws/xmlschema-eclipse/target/surefire-reports>

-------------------------------------------------------
 T E S T S
-------------------------------------------------------
There are no tests to run.

Results :

Tests run: 0, Failures: 0, Errors: 0, Skipped: 0

[HUDSON] Recording test results
[INFO] Downloading: http://repo1.maven.org/maven2/org/apache/maven/maven-archiver/2.4/maven-archiver-2.4.pom

[INFO] --- maven-jar-plugin:2.3:jar (default-jar) @ xmlschema-eclipse ---
Downloaded: http://repo1.maven.org/maven2/org/apache/maven/maven-archiver/2.4/maven-archiver-2.4.pom
(4 KB at 3.8 KB/sec)
Downloading: http://repo1.maven.org/maven2/org/apache/maven/shared/maven-shared-components/10/maven-shared-components-10.pom
Downloaded: http://repo1.maven.org/maven2/org/apache/maven/shared/maven-shared-components/10/maven-shared-components-10.pom
(9 KB at 9.9 KB/sec)
Downloading: http://repo1.maven.org/maven2/org/codehaus/plexus/plexus-archiver/1.0-alpha-11/plexus-archiver-1.0-alpha-11.pom
Downloaded: http://repo1.maven.org/maven2/org/codehaus/plexus/plexus-archiver/1.0-alpha-11/plexus-archiver-1.0-alpha-11.pom
(2 KB at 2.4 KB/sec)
Downloading: http://repo1.maven.org/maven2/org/codehaus/plexus/plexus-components/1.1.9/plexus-components-1.1.9.pom
Downloaded: http://repo1.maven.org/maven2/org/codehaus/plexus/plexus-components/1.1.9/plexus-components-1.1.9.pom
(3 KB at 3.1 KB/sec)
Downloading: http://repo1.maven.org/maven2/org/codehaus/plexus/plexus-utils/1.5.1/plexus-utils-1.5.1.pom
Downloaded: http://repo1.maven.org/maven2/org/codehaus/plexus/plexus-utils/1.5.1/plexus-utils-1.5.1.pom
(3 KB at 2.9 KB/sec)
Downloading: http://repo1.maven.org/maven2/org/codehaus/plexus/plexus-container-default/1.0-alpha-15/plexus-container-default-1.0-alpha-15.pom
Downloaded: http://repo1.maven.org/maven2/org/codehaus/plexus/plexus-container-default/1.0-alpha-15/plexus-container-default-1.0-alpha-15.pom
(2 KB at 2.2 KB/sec)
Downloading: http://repo1.maven.org/maven2/org/codehaus/plexus/plexus-containers/1.0-alpha-15/plexus-containers-1.0-alpha-15.pom
Downloaded: http://repo1.maven.org/maven2/org/codehaus/plexus/plexus-containers/1.0-alpha-15/plexus-containers-1.0-alpha-15.pom
(2 KB at 2.5 KB/sec)
Downloading: http://repo1.maven.org/maven2/org/codehaus/plexus/plexus-component-api/1.0-alpha-15/plexus-component-api-1.0-alpha-15.pom
Downloaded: http://repo1.maven.org/maven2/org/codehaus/plexus/plexus-component-api/1.0-alpha-15/plexus-component-api-1.0-alpha-15.pom
(948 B at 1.2 KB/sec)
Downloading: http://repo1.maven.org/maven2/org/codehaus/plexus/plexus-classworlds/1.2-alpha-6/plexus-classworlds-1.2-alpha-6.pom
Downloaded: http://repo1.maven.org/maven2/org/codehaus/plexus/plexus-classworlds/1.2-alpha-6/plexus-classworlds-1.2-alpha-6.pom
(3 KB at 3.0 KB/sec)
Downloading: http://repo1.maven.org/maven2/org/codehaus/plexus/plexus-io/1.0-alpha-3/plexus-io-1.0-alpha-3.pom
Downloaded: http://repo1.maven.org/maven2/org/codehaus/plexus/plexus-io/1.0-alpha-3/plexus-io-1.0-alpha-3.pom
(2 KB at 1.8 KB/sec)
Downloading: http://repo1.maven.org/maven2/org/codehaus/plexus/plexus-component-api/1.0-alpha-16/plexus-component-api-1.0-alpha-16.pom
Downloaded: http://repo1.maven.org/maven2/org/codehaus/plexus/plexus-component-api/1.0-alpha-16/plexus-component-api-1.0-alpha-16.pom
(3 KB at 2.9 KB/sec)
Downloading: http://repo1.maven.org/maven2/org/codehaus/plexus/plexus-containers/1.0-alpha-16/plexus-containers-1.0-alpha-16.pom
Downloaded: http://repo1.maven.org/maven2/org/codehaus/plexus/plexus-containers/1.0-alpha-16/plexus-containers-1.0-alpha-16.pom
(2 KB at 2.4 KB/sec)
Downloading: http://repo1.maven.org/maven2/org/codehaus/plexus/plexus-utils/1.4.9/plexus-utils-1.4.9.pom
Downloaded: http://repo1.maven.org/maven2/org/codehaus/plexus/plexus-utils/1.4.9/plexus-utils-1.4.9.pom
(3 KB at 3.0 KB/sec)
Downloading: http://repo1.maven.org/maven2/org/codehaus/plexus/plexus-interpolation/1.6/plexus-interpolation-1.6.pom
Downloaded: http://repo1.maven.org/maven2/org/codehaus/plexus/plexus-interpolation/1.6/plexus-interpolation-1.6.pom
(3 KB at 3.8 KB/sec)
Downloading: http://repo1.maven.org/maven2/org/codehaus/plexus/plexus-archiver/1.0-alpha-12/plexus-archiver-1.0-alpha-12.pom
Downloaded: http://repo1.maven.org/maven2/org/codehaus/plexus/plexus-archiver/1.0-alpha-12/plexus-archiver-1.0-alpha-12.pom
(2 KB at 3.3 KB/sec)
Downloading: http://repo1.maven.org/maven2/org/codehaus/plexus/plexus-io/1.0-alpha-4/plexus-io-1.0-alpha-4.pom
Downloaded: http://repo1.maven.org/maven2/org/codehaus/plexus/plexus-io/1.0-alpha-4/plexus-io-1.0-alpha-4.pom
(2 KB at 1.6 KB/sec)
Downloading: http://repo1.maven.org/maven2/org/apache/maven/maven-archiver/2.4/maven-archiver-2.4.jar
Downloading: http://repo1.maven.org/maven2/org/codehaus/plexus/plexus-archiver/1.0-alpha-12/plexus-archiver-1.0-alpha-12.jar
Downloading: http://repo1.maven.org/maven2/org/codehaus/plexus/plexus-interpolation/1.6/plexus-interpolation-1.6.jar
Downloading: http://repo1.maven.org/maven2/org/codehaus/plexus/plexus-io/1.0-alpha-4/plexus-io-1.0-alpha-4.jar
Downloading: http://repo1.maven.org/maven2/org/codehaus/plexus/plexus-utils/1.4.9/plexus-utils-1.4.9.jar
Downloaded: http://repo1.maven.org/maven2/org/codehaus/plexus/plexus-utils/1.4.9/plexus-utils-1.4.9.jar
(200 KB at 87.7 KB/sec)
Downloaded: http://repo1.maven.org/maven2/org/codehaus/plexus/plexus-io/1.0-alpha-4/plexus-io-1.0-alpha-4.jar
(48 KB at 16.9 KB/sec)
Downloaded: http://repo1.maven.org/maven2/org/apache/maven/maven-archiver/2.4/maven-archiver-2.4.jar
(20 KB at 6.8 KB/sec)
Downloaded: http://repo1.maven.org/maven2/org/codehaus/plexus/plexus-interpolation/1.6/plexus-interpolation-1.6.jar
(50 KB at 12.9 KB/sec)
Downloaded: http://repo1.maven.org/maven2/org/codehaus/plexus/plexus-archiver/1.0-alpha-12/plexus-archiver-1.0-alpha-12.jar
(173 KB at 33.1 KB/sec)
[INFO] Building jar: <https://hudson.apache.org/hudson/job/xmlschema-new-trunk-jdk15-native-m3/ws/xmlschema-eclipse/target/xmlschema-eclipse-2.0-SNAPSHOT.jar>
[INFO] [INFO] Installing <https://hudson.apache.org/hudson/job/xmlschema-new-trunk-jdk15-native-m3/ws/xmlschema-eclipse/target/xmlschema-eclipse-2.0-SNAPSHOT.jar>
to <https://hudson.apache.org/hudson/job/xmlschema-new-trunk-jdk15-native-m3/ws/.repository/org/apache/ws/xmlschema/xmlschema-eclipse/2.0-SNAPSHOT/xmlschema-eclipse-2.0-SNAPSHOT.jar>

[INFO] Installing <https://hudson.apache.org/hudson/job/xmlschema-new-trunk-jdk15-native-m3/ws/xmlschema-eclipse/pom.xml>
to <https://hudson.apache.org/hudson/job/xmlschema-new-trunk-jdk15-native-m3/ws/.repository/org/apache/ws/xmlschema/xmlschema-eclipse/2.0-SNAPSHOT/xmlschema-eclipse-2.0-SNAPSHOT.pom>
[INFO] --- maven-install-plugin:2.3:install (default-install) @ xmlschema-eclipse ---
projectSucceeded org.apache.ws.xmlschema:xmlschema-eclipse:2.0-SNAPSHOT
[HUDSON] Archiving <https://hudson.apache.org/hudson/job/xmlschema-new-trunk-jdk15-native-m3/ws/xmlschema-eclipse/target/xmlschema-eclipse-2.0-SNAPSHOT.jar>
to /home/hudson/hudson/jobs/xmlschema-new-trunk-jdk15-native-m3/modules/org.apache.ws.xmlschema$xmlschema-eclipse/builds/2011-01-23_19-42-37/archive/org.apache.ws.xmlschema/xmlschema-eclipse/2.0-SNAPSHOT/xmlschema-eclipse-2.0-SNAPSHOT.jar
[INFO]                                                                         
[INFO] ------------------------------------------------------------------------
[INFO] Building XmlSchema Core 2.0-SNAPSHOT
[INFO] ------------------------------------------------------------------------Downloading:
http://repo1.maven.org/maven2/org/apache/maven/plugins/maven-remote-resources-plugin/1.0/maven-remote-resources-plugin-1.0.pom

Downloaded: http://repo1.maven.org/maven2/org/apache/maven/plugins/maven-remote-resources-plugin/1.0/maven-remote-resources-plugin-1.0.pom
(7 KB at 7.8 KB/sec)
Downloading: http://repo1.maven.org/maven2/org/apache/maven/plugins/maven-plugins/10/maven-plugins-10.pom
Downloaded: http://repo1.maven.org/maven2/org/apache/maven/plugins/maven-plugins/10/maven-plugins-10.pom
(8 KB at 9.7 KB/sec)
Downloading: http://repo1.maven.org/maven2/org/apache/maven/plugins/maven-remote-resources-plugin/1.0/maven-remote-resources-plugin-1.0.jar
Downloaded: http://repo1.maven.org/maven2/org/apache/maven/plugins/maven-remote-resources-plugin/1.0/maven-remote-resources-plugin-1.0.jar
(49 KB at 55.5 KB/sec)
Downloading: http://repo1.maven.org/maven2/junit/junit/4.8/junit-4.8.pom
Downloaded: http://repo1.maven.org/maven2/junit/junit/4.8/junit-4.8.pom (2 KB at 2.1 KB/sec)
Downloading: http://repo1.maven.org/maven2/xmlunit/xmlunit/1.2/xmlunit-1.2.pom
Downloaded: http://repo1.maven.org/maven2/xmlunit/xmlunit/1.2/xmlunit-1.2.pom (3 KB at 4.4
KB/sec)
Downloading: http://repo1.maven.org/maven2/junit/junit/4.8/junit-4.8.jar
Downloading: http://repo1.maven.org/maven2/xmlunit/xmlunit/1.2/xmlunit-1.2.jar
Downloaded: http://repo1.maven.org/maven2/junit/junit/4.8/junit-4.8.jar (232 KB at 138.6 KB/sec)
Downloaded: http://repo1.maven.org/maven2/xmlunit/xmlunit/1.2/xmlunit-1.2.jar (95 KB at 46.9
KB/sec)
[INFO] 
[INFO] --- maven-checkstyle-plugin:2.6:checkstyle (validate) @ xmlschema-core ---
mojoFailed org.apache.maven.plugins:maven-checkstyle-plugin:2.6(validate)
projectFailed org.apache.ws.xmlschema:xmlschema-core:2.0-SNAPSHOT
[HUDSON] Archiving <https://hudson.apache.org/hudson/job/xmlschema-new-trunk-jdk15-native-m3/ws/xmlschema-core/pom.xml>
to /home/hudson/hudson/jobs/xmlschema-new-trunk-jdk15-native-m3/modules/org.apache.ws.xmlschema$xmlschema-core/builds/2011-01-23_19-42-37/archive/org.apache.ws.xmlschema/xmlschema-core/2.0-SNAPSHOT/pom.xml
sessionEnded
[INFO] ------------------------------------------------------------------------
[INFO] Reactor Summary:
[INFO] 
[INFO] XmlSchema ......................................... SUCCESS [5:05.211s]
[INFO] XmlSchema Eclipse Support ......................... SUCCESS [1:31.995s]
[INFO] XmlSchema Core .................................... FAILURE [9.745s]
[INFO] XmlSchema OSGi bundle test ........................ SKIPPED
[INFO] XmlSchema W3C tests ............................... SKIPPED
[INFO] ------------------------------------------------------------------------
[INFO] BUILD FAILURE
[INFO] ------------------------------------------------------------------------
[INFO] Total time: 8:08.054s
[INFO] Finished at: Sun Jan 23 19:53:46 GMT+00:00 2011
[INFO] Final Memory: 20M/206M
[INFO] ------------------------------------------------------------------------
mavenExecutionResult exceptions not empty
org.apache.maven.lifecycle.LifecycleExecutionException: Failed to execute goal org.apache.maven.plugins:maven-checkstyle-plugin:2.6:checkstyle
(validate) on project xmlschema-core: An error has occurred in Checkstyle report generation.
	at org.apache.maven.lifecycle.internal.MojoExecutor.execute(MojoExecutor.java:217)
	at org.apache.maven.lifecycle.internal.MojoExecutor.execute(MojoExecutor.java:153)
	at org.apache.maven.lifecycle.internal.MojoExecutor.execute(MojoExecutor.java:145)
	at org.apache.maven.lifecycle.internal.LifecycleModuleBuilder.buildProject(LifecycleModuleBuilder.java:84)
	at org.apache.maven.lifecycle.internal.LifecycleModuleBuilder.buildProject(LifecycleModuleBuilder.java:59)
	at org.apache.maven.lifecycle.internal.LifecycleStarter.singleThreadedBuild(LifecycleStarter.java:183)
	at org.apache.maven.lifecycle.internal.LifecycleStarter.execute(LifecycleStarter.java:161)
	at org.apache.maven.DefaultMaven.doExecute(DefaultMaven.java:319)
	at org.apache.maven.DefaultMaven.execute(DefaultMaven.java:156)
	at org.jvnet.hudson.maven3.launcher.Maven3Launcher.main(Maven3Launcher.java:79)
	at sun.reflect.NativeMethodAccessorImpl.invoke0(Native Method)
	at sun.reflect.NativeMethodAccessorImpl.invoke(NativeMethodAccessorImpl.java:39)
	at sun.reflect.DelegatingMethodAccessorImpl.invoke(DelegatingMethodAccessorImpl.java:25)
	at java.lang.reflect.Method.invoke(Method.java:592)
	at org.codehaus.plexus.classworlds.launcher.Launcher.launchStandard(Launcher.java:329)
	at org.codehaus.plexus.classworlds.launcher.Launcher.launch(Launcher.java:239)
	at org.jvnet.hudson.maven3.agent.Maven3Main.launch(Maven3Main.java:145)
	at hudson.maven.Maven3Builder.call(Maven3Builder.java:124)
	at hudson.maven.Maven3Builder.call(Maven3Builder.java:71)
	at hudson.remoting.UserRequest.perform(UserRequest.java:114)
	at hudson.remoting.UserRequest.perform(UserRequest.java:48)
	at hudson.remoting.Request$2.run(Request.java:270)
	at java.util.concurrent.Executors$RunnableAdapter.call(Executors.java:417)
	at java.util.concurrent.FutureTask$Sync.innerRun(FutureTask.java:269)
	at java.util.concurrent.FutureTask.run(FutureTask.java:123)
	at java.util.concurrent.ThreadPoolExecutor$Worker.runTask(ThreadPoolExecutor.java:651)
	at java.util.concurrent.ThreadPoolExecutor$Worker.run(ThreadPoolExecutor.java:676)
	at java.lang.Thread.run(Thread.java:595)
Caused by: org.apache.maven.plugin.MojoExecutionException: An error has occurred in Checkstyle
report generation.
	at org.apache.maven.reporting.AbstractMavenReport.execute(AbstractMavenReport.java:122)
	at org.apache.maven.plugin.DefaultBuildPluginManager.executeMojo(DefaultBuildPluginManager.java:107)
	at org.apache.maven.lifecycle.internal.MojoExecutor.execute(MojoExecutor.java:209)
	... 27 more
Caused by: org.apache.maven.reporting.MavenReportException: Failed during checkstyle execution
	at org.apache.maven.plugin.checkstyle.CheckstyleReport.executeReport(CheckstyleReport.java:597)
	at org.apache.maven.reporting.AbstractMavenReport.generate(AbstractMavenReport.java:190)
	at org.apache.maven.reporting.AbstractMavenReport.execute(AbstractMavenReport.java:99)
	... 29 more
Caused by: org.apache.maven.plugin.checkstyle.CheckstyleExecutorException: Unable to find
configuration file at location /xmlschema-checkstyle.xml
	at org.apache.maven.plugin.checkstyle.DefaultCheckstyleExecutor.getConfigFile(DefaultCheckstyleExecutor.java:481)
	at org.apache.maven.plugin.checkstyle.DefaultCheckstyleExecutor.getConfiguration(DefaultCheckstyleExecutor.java:236)
	at org.apache.maven.plugin.checkstyle.DefaultCheckstyleExecutor.executeCheckstyle(DefaultCheckstyleExecutor.java:173)
	at org.apache.maven.plugin.checkstyle.CheckstyleReport.executeReport(CheckstyleReport.java:578)
	... 31 more
Caused by: org.codehaus.plexus.resource.loader.ResourceNotFoundException: Could not find resource
'/xmlschema-checkstyle.xml'.
	at org.codehaus.plexus.resource.DefaultResourceManager.getResource(DefaultResourceManager.java:173)
	at org.codehaus.plexus.resource.DefaultResourceManager.getResourceAsFile(DefaultResourceManager.java:91)
	at org.apache.maven.plugin.checkstyle.DefaultCheckstyleExecutor.getConfigFile(DefaultCheckstyleExecutor.java:471)
	... 34 more
Sending e-mails to: dev@ws.apache.org
channel stopped


---------------------------------------------------------------------
To unsubscribe, e-mail: dev-unsubscribe@ws.apache.org
For additional commands, e-mail: dev-help@ws.apache.org


Mime
View raw message