wicket-dev mailing list archives

Site index · List index
Message view « Date » · « Thread »
Top « Date » · « Thread »
From "Johan Compagner" <jcompag...@gmail.com>
Subject Re: Johan broke the build! was: Build Apache Wicket::Wicket 1.4.x #20 failed (tests failed: 143 (143 new), passed: 541)
Date Sun, 04 May 2008 20:42:46 GMT
Yeah i have fixed that already but not comitted it yet
Now at the movies will commit later.
I though generics only, but 1 patch had some extra thing sneaked in.

On 5/4/08, Martijn Dashorst <martijn.dashorst@gmail.com> wrote:
> Hmm, having a build server doesn't excuse us from running the tests
> ourselves before committing.
>
> Martijn
>
> On 5/4/08, builds.wicketstuff.org@gmail.com
> <builds.wicketstuff.org@gmail.com> wrote:
> > Build Apache Wicket::Wicket 1.4.x #20 failed (tests failed: 143 (143 new),
> passed: 541)
> >  Agent: Default agent
> >  Build results:
> http://wicketstuff.org/teamcity/viewLog.html?buildId=71&buildTypeId=bt2
> >
> >  Newly failed tests (143 tests, only first 3 failures shown here)
> >  ==================================================================
> >
> org.apache.wicket.resource.loader.ComponentStringResourceLoaderTest.testRenderHomePage_2
> =================
> >  org.apache.wicket.WicketRuntimeException: Exception in rendering
> component: [Component id = item, page =
> org.apache.wicket.resource.loader.TestPage_1, path = 0:item.Label, isVisible
> = true, isVersioned = true]
> >         at
> org.apache.wicket.Component.renderComponent(Component.java:2574)
> >         at
> org.apache.wicket.markup.html.WebComponent.onRender(WebComponent.java:64)
> >         at org.apache.wicket.Component.render(Component.java:2372)
> >         at
> org.apache.wicket.MarkupContainer.renderNext(MarkupContainer.java:1368)
> >         at
> org.apache.wicket.MarkupContainer.renderAll(MarkupContainer.java:1501)
> >         at org.apache.wicket.Page.onRender(Page.java:1481)
> >         at org.apache.wicket.Component.render(Component.java:2372)
> >         at org.apache.wicket.Page.renderPage(Page.java:896)
> >         at
> org.apache.wicket.request.target.component.BookmarkablePageRequestTarget.respond(BookmarkablePageRequestTarget.java:231)
> >         at
> org.apache.wicket.request.AbstractRequestCycleProcessor.respond(AbstractRequestCycleProcessor.java:104)
> >         at
> org.apache.wicket.RequestCycle.processEventsAndRespond(RequestCycle.java:1180)
> >         at org.apache.wicket.RequestCycle.step(RequestCycle.java:1251)
> >         at org.apache.wicket.RequestCycle.steps(RequestCycle.java:1352)
> >         at org.apache.wicket.RequestCycle.request(RequestCycle.java:545)
> >         at
> org.apache.wicket.protocol.http.MockWebApplication.processRequestCycle(MockWebApplication.java:375)
> >         at
> org.apache.wicket.protocol.http.MockWebApplication.processRequestCycle(MockWebApplication.java:359)
> >         at
> org.apache.wicket.util.tester.BaseWicketTester.startPage(BaseWicketTester.java:296)
> >         at
> org.apache.wicket.WicketTestCase.executeTest(WicketTestCase.java:82)
> >         at
> org.apache.wicket.resource.loader.ComponentStringResourceLoaderTest.testRenderHomePage_2(ComponentStringResourceLoaderTest.java:66)
> >         at sun.reflect.NativeMethodAccessorImpl.invoke0(Native Method)
> >         at
> sun.reflect.NativeMethodAccessorImpl.invoke(NativeMethodAccessorImpl.java:39)
> >         at
> sun.reflect.DelegatingMethodAccessorImpl.invoke(DelegatingMethodAccessorImpl.java:25)
> >         at java.lang.reflect.Method.invoke(Method.java:585)
> >         at junit.framework.TestCase.runTest(TestCase.java:154)
> >         at junit.framework.TestCase.runBare(TestCase.java:127)
> >         at junit.framework.TestResult$1.protect(TestResult.java:106)
> >         at junit.framework.TestResult.runProtected(TestResult.java:124)
> >         at junit.framework.TestResult.run(TestResult.java:109)
> >         at junit.framework.TestCase.run(TestCase.java:118)
> >         at junit.framework.TestSuite.runTest(TestSuite.java:208)
> >         at junit.framework.TestSuite.run(TestSuite.java:203)
> >         at sun.reflect.NativeMethodAccessorImpl.invoke0(Native Method)
> >         at
> sun.reflect.NativeMethodAccessorImpl.invoke(NativeMethodAccessorImpl.java:39)
> >         at
> sun.reflect.DelegatingMethodAccessorImpl.invoke(DelegatingMethodAccessorImpl.java:25)
> >         at java.lang.reflect.Method.invoke(Method.java:585)
> >         at
> org.apache.maven.surefire.battery.JUnitBattery.executeJUnit(JUnitBattery.java:242)
> >         at
> org.apache.maven.surefire.battery.JUnitBattery.execute(JUnitBattery.java:216)
> >         at
> org.apache.maven.surefire.Surefire.executeBattery(Surefire.java:215)
> >         at org.apache.maven.surefire.Surefire.run(Surefire.java:163)
> >         at org.apache.maven.surefire.Surefire.run(Surefire.java:87)
> >         at sun.reflect.NativeMethodAccessorImpl.invoke0(Native Method)
> >         at
> sun.reflect.NativeMethodAccessorImpl.invoke(NativeMethodAccessorImpl.java:39)
> >         at
> sun.reflect.DelegatingMethodAccessorImpl.invoke(DelegatingMethodAccessorImpl.java:25)
> >         at java.lang.reflect.Method.invoke(Method.java:585)
> >         at
> org.apache.maven.surefire.SurefireBooter.runTestsInProcess(SurefireBooter.java:313)
> >         at
> org.apache.maven.surefire.SurefireBooter.run(SurefireBooter.java:221)
> >         at
> org.apache.maven.test.SurefirePlugin.execute(SurefirePlugin.java:371)
> >         at
> org.apache.maven.plugin.DefaultPluginManager.executeMojo(DefaultPluginManager.java:451)
> >         at
> org.apache.maven.lifecycle.DefaultLifecycleExecutor.executeGoals(DefaultLifecycleExecutor.java:558)
> >         at
> org.apache.maven.lifecycle.DefaultLifecycleExecutor.executeGoalWithLifecycle(DefaultLifecycleExecutor.java:499)
> >         at
> org.apache.maven.lifecycle.DefaultLifecycleExecutor.executeGoal(DefaultLifecycleExecutor.java:478)
> >         at
> org.apache.maven.lifecycle.DefaultLifecycleExecutor.executeGoalAndHandleFailures(DefaultLifecycleExecutor.java:330)
> >         at
> org.apache.maven.lifecycle.DefaultLifecycleExecutor.executeTaskSegments(DefaultLifecycleExecutor.java:291)
> >         at
> org.apache.maven.lifecycle.DefaultLifecycleExecutor.execute(DefaultLifecycleExecutor.java:142)
> >         at org.apache.maven.DefaultMaven.doExecute(DefaultMaven.java:336)
> >         at org.apache.maven.DefaultMaven.execute(DefaultMaven.java:129)
> >         at org.apache.maven.cli.MavenCli.main(MavenCli.java:287)
> >         at sun.reflect.NativeMethodAccessorImpl.invoke0(Native Method)
> >         at
> sun.reflect.NativeMethodAccessorImpl.invoke(NativeMethodAccessorImpl.java:39)
> >         at
> sun.reflect.DelegatingMethodAccessorImpl.invoke(DelegatingMethodAccessorImpl.java:25)
> >         at java.lang.reflect.Method.invoke(Method.java:585)
> >         at
> org.codehaus.classworlds.Launcher.launchEnhanced(Launcher.java:315)
> >         at org.codehaus.classworlds.Launcher.launch(Launcher.java:255)
> >         at
> org.codehaus.classworlds.Launcher.mainWithExitCode(Launcher.java:430)
> >         at org.codehaus.classworlds.Launcher.main(Launcher.java:375)
> >  Caused by: java.lang.IllegalArgumentException: converter can not convert
> java.lang.String to string
> >         at
> org.apache.wicket.Component.getModelObjectAsString(Component.java:1652)
> >         at
> org.apache.wicket.Component.getModelObjectAsString(Component.java:1625)
> >         at
> org.apache.wicket.markup.html.basic.Label.onComponentTagBody(Label.java:115)
> >         at
> org.apache.wicket.Component.renderComponent(Component.java:2535)
> >         ... 64 more
> >
> >  ------- Stdout: -------
> >  === org.apache.wicket.resource.loader.TestPage_1 ===
> >
> >  org.apache.wicket.resource.loader.PackageStringResourceLoaderTest.test_1
> =================
> >  org.apache.wicket.WicketRuntimeException: Exception in rendering
> component: [Component id = label1, page =
> org.apache.wicket.resource.loader.pages.Test1, path = 0:label1.Label,
> isVisible = true, isVersioned = true]
> >         at
> org.apache.wicket.Component.renderComponent(Component.java:2574)
> >         at
> org.apache.wicket.markup.html.WebComponent.onRender(WebComponent.java:64)
> >         at org.apache.wicket.Component.render(Component.java:2372)
> >         at
> org.apache.wicket.MarkupContainer.renderNext(MarkupContainer.java:1368)
> >         at
> org.apache.wicket.MarkupContainer.renderAll(MarkupContainer.java:1501)
> >         at org.apache.wicket.Page.onRender(Page.java:1481)
> >         at org.apache.wicket.Component.render(Component.java:2372)
> >         at org.apache.wicket.Page.renderPage(Page.java:896)
> >         at
> org.apache.wicket.request.target.component.BookmarkablePageRequestTarget.respond(BookmarkablePageRequestTarget.java:231)
> >         at
> org.apache.wicket.request.AbstractRequestCycleProcessor.respond(AbstractRequestCycleProcessor.java:104)
> >         at
> org.apache.wicket.RequestCycle.processEventsAndRespond(RequestCycle.java:1180)
> >         at org.apache.wicket.RequestCycle.step(RequestCycle.java:1251)
> >         at org.apache.wicket.RequestCycle.steps(RequestCycle.java:1352)
> >         at org.apache.wicket.RequestCycle.request(RequestCycle.java:545)
> >         at
> org.apache.wicket.protocol.http.MockWebApplication.processRequestCycle(MockWebApplication.java:375)
> >         at
> org.apache.wicket.protocol.http.MockWebApplication.processRequestCycle(MockWebApplication.java:359)
> >         at
> org.apache.wicket.util.tester.BaseWicketTester.startPage(BaseWicketTester.java:296)
> >         at
> org.apache.wicket.WicketTestCase.executeTest(WicketTestCase.java:82)
> >         at
> org.apache.wicket.resource.loader.PackageStringResourceLoaderTest.test_1(PackageStringResourceLoaderTest.java:73)
> >         at sun.reflect.NativeMethodAccessorImpl.invoke0(Native Method)
> >         at
> sun.reflect.NativeMethodAccessorImpl.invoke(NativeMethodAccessorImpl.java:39)
> >         at
> sun.reflect.DelegatingMethodAccessorImpl.invoke(DelegatingMethodAccessorImpl.java:25)
> >         at java.lang.reflect.Method.invoke(Method.java:585)
> >         at junit.framework.TestCase.runTest(TestCase.java:154)
> >         at junit.framework.TestCase.runBare(TestCase.java:127)
> >         at junit.framework.TestResult$1.protect(TestResult.java:106)
> >         at junit.framework.TestResult.runProtected(TestResult.java:124)
> >         at junit.framework.TestResult.run(TestResult.java:109)
> >         at junit.framework.TestCase.run(TestCase.java:118)
> >         at junit.framework.TestSuite.runTest(TestSuite.java:208)
> >         at junit.framework.TestSuite.run(TestSuite.java:203)
> >         at sun.reflect.NativeMethodAccessorImpl.invoke0(Native Method)
> >         at
> sun.reflect.NativeMethodAccessorImpl.invoke(NativeMethodAccessorImpl.java:39)
> >         at
> sun.reflect.DelegatingMethodAccessorImpl.invoke(DelegatingMethodAccessorImpl.java:25)
> >         at java.lang.reflect.Method.invoke(Method.java:585)
> >         at
> org.apache.maven.surefire.battery.JUnitBattery.executeJUnit(JUnitBattery.java:242)
> >         at
> org.apache.maven.surefire.battery.JUnitBattery.execute(JUnitBattery.java:216)
> >         at
> org.apache.maven.surefire.Surefire.executeBattery(Surefire.java:215)
> >         at org.apache.maven.surefire.Surefire.run(Surefire.java:163)
> >         at org.apache.maven.surefire.Surefire.run(Surefire.java:87)
> >         at sun.reflect.NativeMethodAccessorImpl.invoke0(Native Method)
> >         at
> sun.reflect.NativeMethodAccessorImpl.invoke(NativeMethodAccessorImpl.java:39)
> >         at
> sun.reflect.DelegatingMethodAccessorImpl.invoke(DelegatingMethodAccessorImpl.java:25)
> >         at java.lang.reflect.Method.invoke(Method.java:585)
> >         at
> org.apache.maven.surefire.SurefireBooter.runTestsInProcess(SurefireBooter.java:313)
> >         at
> org.apache.maven.surefire.SurefireBooter.run(SurefireBooter.java:221)
> >         at
> org.apache.maven.test.SurefirePlugin.execute(SurefirePlugin.java:371)
> >         at
> org.apache.maven.plugin.DefaultPluginManager.executeMojo(DefaultPluginManager.java:451)
> >         at
> org.apache.maven.lifecycle.DefaultLifecycleExecutor.executeGoals(DefaultLifecycleExecutor.java:558)
> >         at
> org.apache.maven.lifecycle.DefaultLifecycleExecutor.executeGoalWithLifecycle(DefaultLifecycleExecutor.java:499)
> >         at
> org.apache.maven.lifecycle.DefaultLifecycleExecutor.executeGoal(DefaultLifecycleExecutor.java:478)
> >         at
> org.apache.maven.lifecycle.DefaultLifecycleExecutor.executeGoalAndHandleFailures(DefaultLifecycleExecutor.java:330)
> >         at
> org.apache.maven.lifecycle.DefaultLifecycleExecutor.executeTaskSegments(DefaultLifecycleExecutor.java:291)
> >         at
> org.apache.maven.lifecycle.DefaultLifecycleExecutor.execute(DefaultLifecycleExecutor.java:142)
> >         at org.apache.maven.DefaultMaven.doExecute(DefaultMaven.java:336)
> >         at org.apache.maven.DefaultMaven.execute(DefaultMaven.java:129)
> >         at org.apache.maven.cli.MavenCli.main(MavenCli.java:287)
> >         at sun.reflect.NativeMethodAccessorImpl.invoke0(Native Method)
> >         at
> sun.reflect.NativeMethodAccessorImpl.invoke(NativeMethodAccessorImpl.java:39)
> >         at
> sun.reflect.DelegatingMethodAccessorImpl.invoke(DelegatingMethodAccessorImpl.java:25)
> >         at java.lang.reflect.Method.invoke(Method.java:585)
> >         at
> org.codehaus.classworlds.Launcher.launchEnhanced(Launcher.java:315)
> >         at org.codehaus.classworlds.Launcher.launch(Launcher.java:255)
> >         at
> org.codehaus.classworlds.Launcher.mainWithExitCode(Launcher.java:430)
> >         at org.codehaus.classworlds.Launcher.main(Launcher.java:375)
> >  Caused by: java.lang.IllegalArgumentException: converter can not convert
> java.lang.String to string
> >         at
> org.apache.wicket.Component.getModelObjectAsString(Component.java:1652)
> >         at
> org.apache.wicket.Component.getModelObjectAsString(Component.java:1625)
> >         at
> org.apache.wicket.markup.html.basic.Label.onComponentTagBody(Label.java:115)
> >         at
> org.apache.wicket.Component.renderComponent(Component.java:2535)
> >         ... 64 more
> >
> >  ------- Stdout: -------
> >  === org.apache.wicket.resource.loader.pages.Test1 ===
> >
> >
> org.apache.wicket.protocol.http.WebRequestCodingStrategyTest.testEncodeStringArray
> =================
> >  org.apache.wicket.WicketRuntimeException: Exception in rendering
> component: [Component id = linkClickCount, page =
> org.apache.wicket.protocol.http.MockPage, path =
> 0:actionLink:linkClickCount.Label, isVisible = true, isVersioned = true]
> >         at
> org.apache.wicket.Component.renderComponent(Component.java:2574)
> >         at
> org.apache.wicket.markup.html.WebComponent.onRender(WebComponent.java:64)
> >         at org.apache.wicket.Component.render(Component.java:2372)
> >         at
> org.apache.wicket.MarkupContainer.renderNext(MarkupContainer.java:1368)
> >         at
> org.apache.wicket.MarkupContainer.renderComponentTagBody(MarkupContainer.java:1550)
> >         at
> org.apache.wicket.markup.html.link.AbstractLink.onComponentTagBody(AbstractLink.java:174)
> >         at
> org.apache.wicket.Component.renderComponent(Component.java:2535)
> >         at
> org.apache.wicket.MarkupContainer.onRender(MarkupContainer.java:1485)
> >         at org.apache.wicket.Component.render(Component.java:2372)
> >         at
> org.apache.wicket.MarkupContainer.renderNext(MarkupContainer.java:1368)
> >         at
> org.apache.wicket.MarkupContainer.renderAll(MarkupContainer.java:1501)
> >         at org.apache.wicket.Page.onRender(Page.java:1481)
> >         at org.apache.wicket.Component.render(Component.java:2372)
> >         at org.apache.wicket.Page.renderPage(Page.java:896)
> >         at
> org.apache.wicket.request.target.component.BookmarkablePageRequestTarget.respond(BookmarkablePageRequestTarget.java:231)
> >         at
> org.apache.wicket.request.AbstractRequestCycleProcessor.respond(AbstractRequestCycleProcessor.java:104)
> >         at
> org.apache.wicket.RequestCycle.processEventsAndRespond(RequestCycle.java:1180)
> >         at org.apache.wicket.RequestCycle.step(RequestCycle.java:1251)
> >         at org.apache.wicket.RequestCycle.steps(RequestCycle.java:1352)
> >         at org.apache.wicket.RequestCycle.request(RequestCycle.java:545)
> >         at
> org.apache.wicket.protocol.http.MockWebApplication.processRequestCycle(MockWebApplication.java:375)
> >         at
> org.apache.wicket.protocol.http.MockWebApplication.processRequestCycle(MockWebApplication.java:359)
> >         at
> org.apache.wicket.util.tester.BaseWicketTester.startPage(BaseWicketTester.java:296)
> >         at
> org.apache.wicket.protocol.http.WebRequestCodingStrategyTest.testEncodeStringArray(WebRequestCodingStrategyTest.java:40)
> >         at sun.reflect.NativeMethodAccessorImpl.invoke0(Native Method)
> >         at
> sun.reflect.NativeMethodAccessorImpl.invoke(NativeMethodAccessorImpl.java:39)
> >         at
> sun.reflect.DelegatingMethodAccessorImpl.invoke(DelegatingMethodAccessorImpl.java:25)
> >         at java.lang.reflect.Method.invoke(Method.java:585)
> >         at junit.framework.TestCase.runTest(TestCase.java:154)
> >         at junit.framework.TestCase.runBare(TestCase.java:127)
> >         at junit.framework.TestResult$1.protect(TestResult.java:106)
> >         at junit.framework.TestResult.runProtected(TestResult.java:124)
> >         at junit.framework.TestResult.run(TestResult.java:109)
> >         at junit.framework.TestCase.run(TestCase.java:118)
> >         at junit.framework.TestSuite.runTest(TestSuite.java:208)
> >         at junit.framework.TestSuite.run(TestSuite.java:203)
> >         at sun.reflect.GeneratedMethodAccessor7.invoke(Unknown Source)
> >         at
> sun.reflect.DelegatingMethodAccessorImpl.invoke(DelegatingMethodAccessorImpl.java:25)
> >         at java.lang.reflect.Method.invoke(Method.java:585)
> >         at
> org.apache.maven.surefire.battery.JUnitBattery.executeJUnit(JUnitBattery.java:242)
> >         at
> org.apache.maven.surefire.battery.JUnitBattery.execute(JUnitBattery.java:216)
> >         at
> org.apache.maven.surefire.Surefire.executeBattery(Surefire.java:215)
> >         at org.apache.maven.surefire.Surefire.run(Surefire.java:163)
> >         at org.apache.maven.surefire.Surefire.run(Surefire.java:87)
> >         at sun.reflect.NativeMethodAccessorImpl.invoke0(Native Method)
> >         at
> sun.reflect.NativeMethodAccessorImpl.invoke(NativeMethodAccessorImpl.java:39)
> >         at
> sun.reflect.DelegatingMethodAccessorImpl.invoke(DelegatingMethodAccessorImpl.java:25)
> >         at java.lang.reflect.Method.invoke(Method.java:585)
> >         at
> org.apache.maven.surefire.SurefireBooter.runTestsInProcess(SurefireBooter.java:313)
> >         at
> org.apache.maven.surefire.SurefireBooter.run(SurefireBooter.java:221)
> >         at
> org.apache.maven.test.SurefirePlugin.execute(SurefirePlugin.java:371)
> >         at
> org.apache.maven.plugin.DefaultPluginManager.executeMojo(DefaultPluginManager.java:451)
> >         at
> org.apache.maven.lifecycle.DefaultLifecycleExecutor.executeGoals(DefaultLifecycleExecutor.java:558)
> >         at
> org.apache.maven.lifecycle.DefaultLifecycleExecutor.executeGoalWithLifecycle(DefaultLifecycleExecutor.java:499)
> >         at
> org.apache.maven.lifecycle.DefaultLifecycleExecutor.executeGoal(DefaultLifecycleExecutor.java:478)
> >         at
> org.apache.maven.lifecycle.DefaultLifecycleExecutor.executeGoalAndHandleFailures(DefaultLifecycleExecutor.java:330)
> >         at
> org.apache.maven.lifecycle.DefaultLifecycleExecutor.executeTaskSegments(DefaultLifecycleExecutor.java:291)
> >         at
> org.apache.maven.lifecycle.DefaultLifecycleExecutor.execute(DefaultLifecycleExecutor.java:142)
> >         at org.apache.maven.DefaultMaven.doExecute(DefaultMaven.java:336)
> >         at org.apache.maven.DefaultMaven.execute(DefaultMaven.java:129)
> >         at org.apache.maven.cli.MavenCli.main(MavenCli.java:287)
> >         at sun.reflect.NativeMethodAccessorImpl.invoke0(Native Method)
> >         at
> sun.reflect.NativeMethodAccessorImpl.invoke(NativeMethodAccessorImpl.java:39)
> >         at
> sun.reflect.DelegatingMethodAccessorImpl.invoke(DelegatingMethodAccessorImpl.java:25)
> >         at java.lang.reflect.Method.invoke(Method.java:585)
> >         at
> org.codehaus.classworlds.Launcher.launchEnhanced(Launcher.java:315)
> >         at org.codehaus.classworlds.Launcher.launch(Launcher.java:255)
> >         at
> org.codehaus.classworlds.Launcher.mainWithExitCode(Launcher.java:430)
> >         at org.codehaus.classworlds.Launcher.main(Launcher.java:375)
> >  Caused by: java.lang.IllegalArgumentException: converter can not convert
> java.lang.Integer to string
> >         at
> org.apache.wicket.Component.getModelObjectAsString(Component.java:1652)
> >         at
> org.apache.wicket.Component.getModelObjectAsString(Component.java:1625)
> >         at
> org.apache.wicket.markup.html.basic.Label.onComponentTagBody(Label.java:115)
> >         at
> org.apache.wicket.Component.renderComponent(Component.java:2535)
> >         ... 68 more
> >
> >  see all newly failed tests:
> http://wicketstuff.org/teamcity/viewLog.html?buildId=71&buildTypeId=bt2
> >  Changes included (1 change)
> >  ====================================================
> >  Change 653261 by jcompagner (33 files):
> >  generics
> >
> >  see more information about changed files:
> http://wicketstuff.org/teamcity/viewLog.html?tab=buildChangesDiv&buildId=71&buildTypeId=bt2
> >
> >
> >
> ============================================================================
> >  Configure email notifications:
> http://wicketstuff.org/teamcity/profile.html?init=1#notifications
> >
> >
>
>
> --
> Buy Wicket in Action: http://manning.com/dashorst
> Apache Wicket 1.3.3 is released
> Get it now: http://www.apache.org/dyn/closer.cgi/wicket/1.3.3
>

Mime
View raw message