velocity-dev mailing list archives

Site index · List index
Message view « Date » · « Thread »
Top « Date » · « Thread »
From Velocity Gump <...@velocity.apache.org>
Subject [GUMP@vmgump]: Project velocity-engine-test (in module velocity-engine) failed
Date Tue, 29 Jul 2008 03:52:40 GMT
To whom it may engage...
        
This is an automated request, but not an unsolicited one. For 
more information please visit http://gump.apache.org/nagged.html, 
and/or contact the folk at general@gump.apache.org.

Project velocity-engine-test has an issue affecting its community integration.
This issue affects 1 projects,
 and has been outstanding for 2 runs.
The current state of this project is 'Failed', with reason 'Build Failed'.
For reference only, the following projects are affected by this:
    - velocity-engine-test :  Velocity Templating engine


Full details are available at:
    http://vmgump.apache.org/gump/public/velocity-engine/velocity-engine-test/index.html

That said, some information snippets are provided here.

The following annotations (debug/informational/warning/error messages) were provided:
 -INFO- Failed with reason build failed



The following work was performed:
http://vmgump.apache.org/gump/public/velocity-engine/velocity-engine-test/gump_work/build_velocity-engine_velocity-engine-test.html
Work Name: build_velocity-engine_velocity-engine-test (Type: Build)
Work ended in a state of : Failed
Elapsed: 45 secs
Command Line: /usr/lib/jvm/java-1.5.0-sun/bin/java -Djava.awt.headless=true org.apache.tools.ant.Main
-Dgump.merge=/srv/gump/public/gump/work/merge.xml -Dbuild.sysclasspath=only -Djar.oro.dir=/srv/gump/public/workspace/jakarta-oro
-Ddeprecation=false -Djar.commons-collections.version=29072008 -Dskip.jar.loading=true -Djar.commons-lang.dir=/srv/gump/public/workspace/apache-commons/lang/dist
-Dversion=29072008 -Djar.commons-collections.dir=/srv/gump/public/workspace/apache-commons/collections/build
-Djar.commons-lang.version=29072008 -Djar.oro.name=jakarta-oro -Djar.oro.version=29072008
test 
[Working Directory: /srv/gump/public/workspace/velocity-engine/build]
CLASSPATH: /usr/lib/jvm/java-1.5.0-sun/lib/tools.jar:/srv/gump/public/workspace/velocity-engine/test:/srv/gump/public/workspace/velocity-engine/bin/test-classes:/srv/gump/public/workspace/velocity-engine/test/cpload/test1.jar:/srv/gump/public/workspace/velocity-engine/test/texen-classpath/test.jar:/srv/gump/public/workspace/velocity-engine/test/multiloader/test1.jar:/srv/gump/public/workspace/velocity-engine/bin/velocity-29072008.jar:/srv/gump/public/workspace/velocity-engine/bin/velocity-dep-29072008.jar:/srv/gump/public/workspace/ant/dist/lib/ant-jmf.jar:/srv/gump/public/workspace/ant/dist/lib/ant-swing.jar:/srv/gump/public/workspace/ant/dist/lib/ant-apache-resolver.jar:/srv/gump/public/workspace/ant/dist/lib/ant-trax.jar:/srv/gump/public/workspace/ant/dist/lib/ant-junit.jar:/srv/gump/public/workspace/ant/dist/lib/ant-launcher.jar:/srv/gump/public/workspace/ant/dist/lib/ant-nodeps.jar:/srv/gump/public/workspace/ant/dist/lib/ant.jar:/srv/gump/packages/junit3.8.1/junit.jar:/s
 rv/gump/public/workspace/xml-commons/java/build/resolver.jar:/srv/gump/packages/avalon-logkit/avalon-logkit-2.1.jar:/srv/gump/public/workspace/apache-commons/collections/build/commons-collections-29072008.jar:/srv/gump/public/workspace/apache-commons/lang/commons-lang-29072008.jar:/srv/gump/public/workspace/logging-log4j-12/dist/lib/log4j-29072008.jar:/srv/gump/public/workspace/jdom/build/jdom.jar:/srv/gump/public/workspace/jakarta-servletapi-4/lib/servlet.jar:/srv/gump/public/workspace/jakarta-oro/jakarta-oro-29072008.jar:/srv/gump/packages/werken-xpath/werken-xpath-0.9.4.jar:/srv/gump/public/workspace/apache-commons/logging/target/commons-logging-29072008.jar:/srv/gump/public/workspace/apache-commons/logging/target/commons-logging-api-29072008.jar:/srv/gump/packages/antlr-2.7.6/antlr.jar:/srv/gump/public/workspace/hsqldb/lib/hsqldb.jar
---------------------------------------------
    [junit]   method    = doException
    [junit]   throwable = java.lang.NullPointerException
    [junit]   exception = null
    [junit] Caught MIE (good!) :
    [junit]   reference = woogie
    [junit]   method    = getFoo
    [junit]   throwable = java.lang.Exception: Hello from getFoo()
    [junit]   exception = Hello from getFoo()
    [junit] Caught MIE (good!) :
    [junit]   reference = woogie
    [junit]   method    = getFoo
    [junit]   throwable = java.lang.Exception: Hello from getFoo()
    [junit]   exception = Hello from getFoo()
    [junit] Caught MIE (good!) :
    [junit]   reference = 
    [junit]   method    = foo
    [junit]   throwable = java.lang.Exception: Hello from setFoo()
    [junit]   exception = Hello from setFoo()
    [junit] Caught MIE (good!) :
    [junit]   reference = woogie
    [junit]   method    = getFoo
    [junit]   throwable = java.lang.Exception: Hello from getFoo()
    [junit]   exception = Hello from getFoo()
    [junit] Tests run: 5, Failures: 0, Errors: 0, Time elapsed: 0.513 sec
    [junit] Running org.apache.velocity.test.MethodOverloadingTestCase
    [junit] Tests run: 2, Failures: 0, Errors: 0, Time elapsed: 0.521 sec
    [junit] Running org.apache.velocity.test.MiscTestCase
    [junit] Tests run: 2, Failures: 0, Errors: 0, Time elapsed: 0.074 sec
    [junit] Running org.apache.velocity.test.MultipleFileResourcePathTestCase
    [junit] Tests run: 1, Failures: 0, Errors: 0, Time elapsed: 0.397 sec
    [junit] Running org.apache.velocity.test.NumberMethodCallsTestCase
    [junit] Testing: method calls with arguments as context objects
    [junit] Testing: method calls with arguments as literals
    [junit] Testing: method calls with arguments as calculated values
    [junit] Tests run: 1, Failures: 0, Errors: 0, Time elapsed: 0.419 sec
    [junit] Running org.apache.velocity.test.ParseExceptionTestCase
    [junit] Tests run: 7, Failures: 0, Errors: 0, Time elapsed: 0.934 sec
    [junit] Running org.apache.velocity.test.ParseWithMacroLibsTestCase
    [junit] Tests run: 6, Failures: 0, Errors: 0, Time elapsed: 1.045 sec
    [junit] Running org.apache.velocity.test.ParserTestCase
    [junit] Tests run: 4, Failures: 0, Errors: 0, Time elapsed: 0.576 sec
    [junit] Running org.apache.velocity.test.ResourceCachingTestCase
    [junit] Tests run: 1, Failures: 0, Errors: 0, Time elapsed: 0.569 sec
    [junit] Running org.apache.velocity.test.ResourceLoaderInstanceTestCase
    [junit] Tests run: 1, Failures: 0, Errors: 1, Time elapsed: 0.33 sec

BUILD FAILED
/srv/gump/public/workspace/velocity-engine/build/build.xml:974: Test org.apache.velocity.test.ResourceLoaderInstanceTestCase
failed

Total time: 44 seconds
---------------------------------------------

To subscribe to this information via syndicated feeds:
- RSS: http://vmgump.apache.org/gump/public/velocity-engine/velocity-engine-test/rss.xml
- Atom: http://vmgump.apache.org/gump/public/velocity-engine/velocity-engine-test/atom.xml

============================== Gump Tracking Only ===
Produced by Gump version 2.3.
Gump Run 05020029072008, vmgump:vmgump-public:05020029072008
Gump E-mail Identifier (unique within run) #20.

--
Apache Gump
http://gump.apache.org/ [Instance: vmgump]

---------------------------------------------------------------------
To unsubscribe, e-mail: dev-unsubscribe@velocity.apache.org
For additional commands, e-mail: dev-help@velocity.apache.org


Mime
View raw message