velocity-dev mailing list archives

Site index · List index
Message view « Date » · « Thread »
Top « Date » · « Thread »
From Geir Magnusson Jr. <ge...@apache.org>
Subject [GUMP] Test Failure - Velocity
Date Sun, 02 Sep 2001 11:02:17 GMT
----------------------------------------------------
This email is autogenerated from the output from:
<http://jakarta.apache.org/builds/gump/2001-09-02/jakarta-velocity-test.html>
----------------------------------------------------

Buildfile: testcases.xml

test-template:
     [echo] Running Template tests...
     [java] Adding TemplateTestCase : arithmetic
     [java] Adding TemplateTestCase : array
     [java] Adding TemplateTestCase : block
     [java] Adding TemplateTestCase : comment
     [java] Adding TemplateTestCase : equality
     [java] Adding TemplateTestCase : escape
     [java] Adding TemplateTestCase : foreach-array
     [java] Adding TemplateTestCase : foreach-method
     [java] Adding TemplateTestCase : foreach-variable
     [java] Adding TemplateTestCase : formal
     [java] Adding TemplateTestCase : if
     [java] Adding TemplateTestCase : logical
     [java] Adding TemplateTestCase : loop
     [java] Adding TemplateTestCase : method
     [java] Adding TemplateTestCase : quotes
     [java] Adding TemplateTestCase : sample
     [java] Adding TemplateTestCase : shorthand
     [java] Adding TemplateTestCase : test
     [java] Adding TemplateTestCase : diabolical
     [java] Adding TemplateTestCase : pedantic
     [java] Adding TemplateTestCase : subclass
     [java] Adding TemplateTestCase : foreach-map
     [java] Adding TemplateTestCase : include
     [java] Adding TemplateTestCase : escape2
     [java] Adding TemplateTestCase : parse
     [java] Adding TemplateTestCase : velocimacro
     [java] Adding TemplateTestCase : reference
     [java] Adding TemplateTestCase : interpolation
     [java] Adding TemplateTestCase : vm_test1
     [java] Adding TemplateTestCase : map
     [java] Adding TemplateTestCase : literal
     [java] Adding TemplateTestCase : ifstatement
     [java] Adding TemplateTestCase : math
     [java] Adding TemplateTestCase : range
     [java] Adding TemplateTestCase : get
     [java] Adding TemplateTestCase : velocimacro2
     [java] Adding TemplateTestCase : foreach-type
     [java] Adding TemplateTestCase : foreach-introspect
     [java] ......................................
     [java] Time: 2.925
     [java] 
     [java] OK (38 tests)
     [java] 

test-velocityapp:
     [echo] Running app.Velocity tests...
     [java] .
     [java] Time: 0.011
     [java] 
     [java] OK (1 tests)
     [java] 

test-introspect:
     [echo] Running Introspector tests...
     [java] .
     [java] Time: 0.067
     [java] 
     [java] OK (1 tests)
     [java] 

test-inlinevmscope:
     [echo] Running Inline VM Scope tests...
     [java] .
     [java] Time: 0.333
     [java] 
     [java] OK (1 tests)
     [java] 

test-multi:
     [echo] Running Multiple File Resource Path tests...
     [java] .
     [java] Time: 0.201
     [java] 
     [java] OK (1 tests)
     [java] 

test-cpload:
     [echo] Running Classpath Resource tests...
     [java] .
     [java] Time: 0.193
     [java] 
     [java] OK (1 tests)
     [java] 

test-contextsafety:
     [echo] Running Context Safety tests...
     [java] .
     [java] Time: 0.126
     [java] 
     [java] OK (1 tests)
     [java] 

test-configuration:
     [java] .
     [java] Time: 0.371
     [java] 
     [java] OK (1 tests)
     [java] 

test-commonsextprop:
     [java] .
     [java] Time: 0.178
     [java] 
     [java] OK (1 tests)
     [java] 

test-externallogger:
     [echo] Running external logger tests...
     [java] .
     [java] Time: 0.009
     [java] 
     [java] OK (1 tests)
     [java] 

test-methodinvocationexception:
     [echo] Running MethodInvocationException tests...
     [java] .Caught MIE (good!) :
     [java]   reference = woogie
     [java]   method    = doException
     [java]   throwable = java.lang.NullPointerException
     [java]   exception = null
     [java] Caught MIE (good!) :
     [java]   reference = woogie
     [java]   method    = getFoo
     [java]   throwable = java.lang.Exception: Hello from getFoo()
     [java]   exception = Hello from getFoo()
     [java] Caught MIE (good!) :
     [java]   reference = woogie
     [java]   method    = getFoo
     [java]   throwable = java.lang.Exception: Hello from getFoo()
     [java]   exception = Hello from getFoo()
     [java] Caught MIE (good!) :
     [java]   reference = 
     [java]   method    = foo
     [java]   throwable = java.lang.Exception: Hello from setFoo()
     [java]   exception = Hello from setFoo()
     [java] 
     [java] Time: 0.434
     [java] 
     [java] OK (1 tests)
     [java] 

test-multiloader:
     [echo] Running MultiLoader tests...
     [java] .
     [java] Time: 0.2
     [java] 
     [java] OK (1 tests)
     [java] 

test-encoding:
     [echo] Running Template encoding test...
     [java] .
     [java] Time: 0.502
     [java] 
     [java] OK (1 tests)
     [java] 

test-eventhandling:
     [echo] Running Event Handler tests...
     [java] .
     [java] Time: 0.362
     [java] 
     [java] OK (1 tests)
     [java] 

test-velocimacro:
     [echo] Running Velocimacro tests...
     [java] .
     [java] Time: 0.557
     [java] 
     [java] OK (1 tests)
     [java] 

test-anakia:
     [echo] Running Anakia tests...
   [anakia] Transforming into: /home/rubys/jakarta/jakarta-velocity/test/anakia/results
   [anakia] Input:  index.xml
   [anakia] Output: /home/rubys/jakarta/jakarta-velocity/test/anakia/results/index.html
     [java] .Passed!
     [java] 
     [java] Time: 0.076
     [java] 
     [java] OK (1 tests)
     [java] 

test-texen:
    [texen] /home/rubys/jakarta/jakarta-velocity/test/texen/results/report
     [java] .
     [java] Time: 0.118
     [java] 
     [java] OK (1 tests)
     [java] 

test-texen-classpath:

BUILD FAILED

/home/rubys/jakarta/jakarta-velocity/build/testcases.xml:295: java.lang.NullPointerException

Total time: 57 seconds

Mime
View raw message