usergrid-commits mailing list archives

Site index · List index
Message view « Date » · « Thread »
Top « Date » · « Thread »
From Apache Jenkins Server <jenk...@builds.apache.org>
Subject Build failed in Jenkins: usergrid-stack #96
Date Fri, 12 Jun 2015 15:12:18 GMT
See <https://builds.apache.org/job/usergrid-stack/96/changes>

Changes:

[jwest] Added threading and queueing to imports.

[Dave Johnson] Fix divide by zero error due to rounding

------------------------------------------
[...truncated 23 lines...]
[stack] $ /home/jenkins/tools/java/latest1.7/bin/java -Xmx2g -Xms256m -XX:MaxPermSize=512m
-cp /home/jenkins/jenkins-slave/maven3-agent.jar:/home/jenkins/tools/maven/apache-maven-3.0.4/boot/plexus-classworlds-2.4.jar
org.jvnet.hudson.maven3.agent.Maven3Main /home/jenkins/tools/maven/apache-maven-3.0.4 /home/jenkins/jenkins-slave/slave.jar
/home/jenkins/jenkins-slave/maven3-interceptor.jar /home/jenkins/jenkins-slave/maven3-interceptor-commons.jar
56697
<===[JENKINS REMOTING CAPACITY]===>   channel started
Executing Maven:  -B -f <https://builds.apache.org/job/usergrid-stack/ws/stack/pom.xml>
-Dmaven.repo.local=/home/jenkins/jenkins-slave/maven-repositories/0 clean install deploy
[INFO] Scanning for projects...
[INFO] ------------------------------------------------------------------------
[INFO] Reactor Build Order:
[INFO] 
[INFO] Usergrid Parent
[INFO] Usergrid Java SDK 0.0.3
[INFO] Usergrid Build Tools
[INFO] Usergrid Config
[INFO] Usergrid Test Utils
[INFO] Usergrid Core
[INFO] Usergrid Services
[INFO] Usergrid MongoDB Emulator
[INFO] Usergrid REST
[INFO] Usergrid Tools
[INFO] Usergrid Websocket
[INFO] Usergrid Launcher
[INFO]                                                                         
[INFO] ------------------------------------------------------------------------
[INFO] Building Usergrid Parent 1.0.2
[INFO] ------------------------------------------------------------------------
[INFO] 
[INFO] --- maven-clean-plugin:2.4.1:clean (default-clean) @ usergrid ---
[INFO] 
[INFO] --- maven-enforcer-plugin:1.3.1:enforce (enforce-java) @ usergrid ---
[INFO] 
[INFO] --- maven-remote-resources-plugin:1.2.1:process (default) @ usergrid ---
[INFO] 
[INFO] --- maven-site-plugin:3.3:attach-descriptor (attach-descriptor) @ usergrid ---
[INFO] 
[INFO] --- maven-jar-plugin:2.4:test-jar (test-jar-execution) @ usergrid ---
[WARNING] JAR will be empty - no content was marked for inclusion!
[INFO] Building jar: <https://builds.apache.org/job/usergrid-stack/ws/stack/target/usergrid-1.0.2-tests.jar>
[INFO] 
[INFO] --- apache-rat-plugin:0.10:check (default) @ usergrid ---
[INFO] 62 implicit excludes (use -debug for more details).
[INFO] Exclude: **/README.md
[INFO] Exclude: **/CHANGES.txt
[INFO] Exclude: **/*.json
[INFO] Exclude: **/*.log
[INFO] Exclude: **/*.md5
[INFO] Exclude: **/.git/**
[INFO] Exclude: **/.gitignore
[INFO] Exclude: **/.idea/**
[INFO] Exclude: **/*.iml
[INFO] Exclude: **/nbactions.xml
[INFO] Exclude: **/nb-configuration.xml
[INFO] Exclude: **/.classpath/**
[INFO] Exclude: **/.project
[INFO] Exclude: **/.settings/**
[INFO] Exclude: **/logs/**
[INFO] Exclude: **/docs/**
[INFO] Exclude: **/tmp/**
[INFO] Exclude: **/target/**
[INFO] Exclude: **/antlr3/**
[INFO] Exclude: **/META-INF/**
[INFO] Exclude: **/dependency-reduced-pom.xml
[INFO] Exclude: **/**QueryFilter.tokens
[INFO] Exclude: **/**QueryFilterLexer.java
[INFO] Exclude: **/**QueryFilterParser.java
[INFO] Exclude: **/m2/**
[INFO] Exclude: **/*.asc
[INFO] Exclude: **/src/test/resources/**
[INFO] Exclude: **/cloudbees.xml
[INFO] Exclude: **/doc/**
[INFO] Exclude: **/awscluster/**
[INFO] Exclude: **/aws.properties
[INFO] Exclude: **/launcher-vagrant/**
[INFO] Exclude: **/usergrid-custom.properties
[INFO] 17 resources included (use -debug for more details)
[INFO] Rat check: Summary of files. Unapproved: 0 unknown: 0 generated: 0 approved: 17 licence.
[INFO] 
[INFO] --- maven-install-plugin:2.4:install (default-install) @ usergrid ---
[INFO] Installing <https://builds.apache.org/job/usergrid-stack/ws/stack/pom.xml> to
/home/jenkins/jenkins-slave/maven-repositories/0/org/apache/usergrid/usergrid/1.0.2/usergrid-1.0.2.pom
[INFO] Installing <https://builds.apache.org/job/usergrid-stack/ws/stack/target/usergrid-1.0.2-tests.jar>
to /home/jenkins/jenkins-slave/maven-repositories/0/org/apache/usergrid/usergrid/1.0.2/usergrid-1.0.2-tests.jar
[INFO] 
[INFO] --- maven-enforcer-plugin:1.3.1:enforce (enforce-java) @ usergrid ---
[INFO] 
[INFO] --- maven-remote-resources-plugin:1.2.1:process (default) @ usergrid ---
[INFO] 
[INFO] --- maven-site-plugin:3.3:attach-descriptor (attach-descriptor) @ usergrid ---
[INFO] 
[INFO] --- maven-jar-plugin:2.4:test-jar (test-jar-execution) @ usergrid ---
[WARNING] JAR will be empty - no content was marked for inclusion!
[WARNING] Artifact org.apache.usergrid:usergrid:test-jar:tests:1.0.2 already attached to project,
ignoring duplicate
[INFO] 
[INFO] --- apache-rat-plugin:0.10:check (default) @ usergrid ---
[INFO] 62 implicit excludes (use -debug for more details).
[INFO] Exclude: **/README.md
[INFO] Exclude: **/CHANGES.txt
[INFO] Exclude: **/*.json
[INFO] Exclude: **/*.log
[INFO] Exclude: **/*.md5
[INFO] Exclude: **/.git/**
[INFO] Exclude: **/.gitignore
[INFO] Exclude: **/.idea/**
[INFO] Exclude: **/*.iml
[INFO] Exclude: **/nbactions.xml
[INFO] Exclude: **/nb-configuration.xml
[INFO] Exclude: **/.classpath/**
[INFO] Exclude: **/.project
[INFO] Exclude: **/.settings/**
[INFO] Exclude: **/logs/**
[INFO] Exclude: **/docs/**
[INFO] Exclude: **/tmp/**
[INFO] Exclude: **/target/**
[INFO] Exclude: **/antlr3/**
[INFO] Exclude: **/META-INF/**
[INFO] Exclude: **/dependency-reduced-pom.xml
[INFO] Exclude: **/**QueryFilter.tokens
[INFO] Exclude: **/**QueryFilterLexer.java
[INFO] Exclude: **/**QueryFilterParser.java
[INFO] Exclude: **/m2/**
[INFO] Exclude: **/*.asc
[INFO] Exclude: **/src/test/resources/**
[INFO] Exclude: **/cloudbees.xml
[INFO] Exclude: **/doc/**
[INFO] Exclude: **/awscluster/**
[INFO] Exclude: **/aws.properties
[INFO] Exclude: **/launcher-vagrant/**
[INFO] Exclude: **/usergrid-custom.properties
[INFO] 17 resources included (use -debug for more details)
[INFO] Rat check: Summary of files. Unapproved: 0 unknown: 0 generated: 0 approved: 17 licence.
[INFO] 
[INFO] --- maven-install-plugin:2.4:install (default-install) @ usergrid ---
[INFO] Installing <https://builds.apache.org/job/usergrid-stack/ws/stack/pom.xml> to
/home/jenkins/jenkins-slave/maven-repositories/0/org/apache/usergrid/usergrid/1.0.2/usergrid-1.0.2.pom
[INFO] Installing <https://builds.apache.org/job/usergrid-stack/ws/stack/target/usergrid-1.0.2-tests.jar>
to /home/jenkins/jenkins-slave/maven-repositories/0/org/apache/usergrid/usergrid/1.0.2/usergrid-1.0.2-tests.jar
[INFO] 
[INFO] --- maven-deploy-plugin:2.7:deploy (default-deploy) @ usergrid ---
Uploading: https://repository.apache.org/service/local/staging/deploy/maven2/org/apache/usergrid/usergrid/1.0.2/usergrid-1.0.2.pom
[INFO] ------------------------------------------------------------------------
[INFO] Reactor Summary:
[INFO] 
[INFO] Usergrid Parent ................................... FAILURE [5.843s]
[INFO] Usergrid Java SDK 0.0.3 ........................... SKIPPED
[INFO] Usergrid Build Tools .............................. SKIPPED
[INFO] Usergrid Config ................................... SKIPPED
[INFO] Usergrid Test Utils ............................... SKIPPED
[INFO] Usergrid Core ..................................... SKIPPED
[INFO] Usergrid Services ................................. SKIPPED
[INFO] Usergrid MongoDB Emulator ......................... SKIPPED
[INFO] Usergrid REST ..................................... SKIPPED
[INFO] Usergrid Tools .................................... SKIPPED
[INFO] Usergrid Websocket ................................ SKIPPED
[INFO] Usergrid Launcher ................................. SKIPPED
[INFO] ------------------------------------------------------------------------
[INFO] BUILD FAILURE
[INFO] ------------------------------------------------------------------------
[INFO] Total time: 8.061s
[INFO] Finished at: Fri Jun 12 15:11:41 UTC 2015
[INFO] Final Memory: 24M/316M
[INFO] ------------------------------------------------------------------------
Waiting for Jenkins to finish collecting data[ERROR] Failed to execute goal org.apache.maven.plugins:maven-deploy-plugin:2.7:deploy
(default-deploy) on project usergrid: Failed to deploy artifacts: Could not transfer artifact
org.apache.usergrid:usergrid:pom:1.0.2 from/to apache.releases.https (https://repository.apache.org/service/local/staging/deploy/maven2):
Failed to transfer file: https://repository.apache.org/service/local/staging/deploy/maven2/org/apache/usergrid/usergrid/1.0.2/usergrid-1.0.2.pom.
Return code is: 401, ReasonPhrase:Unauthorized. -> [Help 1]
[ERROR] 
[ERROR] To see the full stack trace of the errors, re-run Maven with the -e switch.
[ERROR] Re-run Maven using the -X switch to enable full debug logging.
[ERROR] 
[ERROR] For more information about the errors and possible solutions, please read the following
articles:
[ERROR] [Help 1] http://cwiki.apache.org/confluence/display/MAVEN/MojoExecutionException

[JENKINS] Archiving <https://builds.apache.org/job/usergrid-stack/ws/stack/build-tools/pom.xml>
to org.apache.usergrid/build-tools/1.0.2/build-tools-1.0.2.pom
Sending artifact delta relative to usergrid-stack » Usergrid Build Tools #54
Archived 1 artifacts
Archive block size is 32768
Received 0 blocks and 1928 bytes
Compression is 0.0%
Took 0.33 sec
[JENKINS] Archiving <https://builds.apache.org/job/usergrid-stack/ws/stack/websocket/pom.xml>
to org.apache.usergrid/usergrid-websocket/1.0.2/usergrid-websocket-1.0.2.pom
Sending artifact delta relative to usergrid-stack » Usergrid Websocket #54
Archived 1 artifacts
Archive block size is 32768
Received 0 blocks and 6114 bytes
Compression is 0.0%
Took 0.2 sec
[JENKINS] Archiving <https://builds.apache.org/job/usergrid-stack/ws/stack/services/pom.xml>
to org.apache.usergrid/usergrid-services/1.0.2/usergrid-services-1.0.2.pom
Sending artifact delta relative to usergrid-stack » Usergrid Services #54
Archived 1 artifacts
Archive block size is 32768
Received 0 blocks and 18686 bytes
Compression is 0.0%
Took 0.1 sec
[JENKINS] Archiving <https://builds.apache.org/job/usergrid-stack/ws/stack/pom.xml>
to org.apache.usergrid/usergrid/1.0.2/usergrid-1.0.2.pom
[JENKINS] Archiving <https://builds.apache.org/job/usergrid-stack/ws/stack/target/usergrid-1.0.2-tests.jar>
to org.apache.usergrid/usergrid/1.0.2/usergrid-1.0.2-tests.jar
Sending artifact delta relative to usergrid-stack » Usergrid Parent #94
Archived 2 artifacts
Archive block size is 32768
Received 1 blocks and 33889 bytes
Compression is 49.2%
Took 0.12 sec
[JENKINS] Archiving <https://builds.apache.org/job/usergrid-stack/ws/stack/config/pom.xml>
to org.apache.usergrid/usergrid-config/1.0.2/usergrid-config-1.0.2.pom
Sending artifact delta relative to usergrid-stack » Usergrid Config #54
Archived 1 artifacts
Archive block size is 32768
Received 0 blocks and 1837 bytes
Compression is 0.0%
Took 0.16 sec
[JENKINS] Archiving <https://builds.apache.org/job/usergrid-stack/ws/stack/launcher/pom.xml>
to org.apache.usergrid/usergrid-launcher/1.0.2/usergrid-launcher-1.0.2.pom
Sending artifact delta relative to usergrid-stack » Usergrid Launcher #54
Archived 1 artifacts
Archive block size is 32768
Received 0 blocks and 7937 bytes
Compression is 0.0%
Took 10 sec
[JENKINS] Archiving <https://builds.apache.org/job/usergrid-stack/ws/stack/test-utils/pom.xml>
to org.apache.usergrid/usergrid-test-utils/1.0.2/usergrid-test-utils-1.0.2.pom
Sending artifact delta relative to usergrid-stack » Usergrid Test Utils #54
Archived 1 artifacts
Archive block size is 32768
Received 0 blocks and 7943 bytes
Compression is 0.0%
Took 0.1 sec
[JENKINS] Archiving <https://builds.apache.org/job/usergrid-stack/ws/stack/core/pom.xml>
to org.apache.usergrid/usergrid-core/1.0.2/usergrid-core-1.0.2.pom
Sending artifact delta relative to usergrid-stack » Usergrid Core #54
Archived 1 artifacts
Archive block size is 32768
Received 0 blocks and 19389 bytes
Compression is 0.0%
Took 0.28 sec
[JENKINS] Archiving <https://builds.apache.org/job/usergrid-stack/ws/stack/rest/pom.xml>
to org.apache.usergrid/usergrid-rest/1.0.2/usergrid-rest-1.0.2.pom
Sending artifact delta relative to usergrid-stack » Usergrid REST #54
Archived 1 artifacts
Archive block size is 32768
Received 0 blocks and 19905 bytes
Compression is 0.0%
Took 8.7 sec
[JENKINS] Archiving <https://builds.apache.org/job/usergrid-stack/ws/stack/mongo-emulator/pom.xml>
to org.apache.usergrid/usergrid-mongo-emulator/1.0.2/usergrid-mongo-emulator-1.0.2.pom
Sending artifact delta relative to usergrid-stack » Usergrid MongoDB Emulator #54
Archived 1 artifacts
Archive block size is 32768
Received 0 blocks and 5539 bytes
Compression is 0.0%
Took 0.12 sec
[JENKINS] Archiving <https://builds.apache.org/job/usergrid-stack/ws/stack/tools/pom.xml>
to org.apache.usergrid/usergrid-tools/1.0.2/usergrid-tools-1.0.2.pom
Sending artifact delta relative to usergrid-stack » Usergrid Tools #54
Archived 1 artifacts
Archive block size is 32768
Received 0 blocks and 7857 bytes
Compression is 0.0%
Took 13 sec
[JENKINS] Archiving <https://builds.apache.org/job/usergrid-stack/ws/stack/java-sdk-old/pom.xml>
to org.usergrid/usergrid-java-client/0.0.3/usergrid-java-client-0.0.3.pom
Sending artifact delta relative to usergrid-stack » Usergrid Java SDK 0.0.3 #54
Archived 1 artifacts
Archive block size is 32768
Received 0 blocks and 3870 bytes
Compression is 0.0%
Took 0.16 sec
Sending e-mails to: commits@usergrid.incubator.apache.org
channel stopped

Mime
View raw message