tuscany-dev mailing list archives

Site index · List index
Message view « Date » · « Thread »
Top « Date » · « Thread »
From Apache Hudson Server <hud...@hudson.zones.apache.org>
Subject Build failed in Hudson: Tuscany-2x » Apache Tuscany SCA iTest Distribution calculator-rmi #236
Date Fri, 02 Oct 2009 01:13:20 GMT
See <http://hudson.zones.apache.org/hudson/job/Tuscany-2x/org.apache.tuscany.sca$itest-distribution-calculator-rmi/236/>

------------------------------------------
[INFO] ------------------------------------------------------------------------
[INFO] Building Apache Tuscany SCA iTest Distribution calculator-rmi
[INFO]    task-segment: [clean, install]
[INFO] ------------------------------------------------------------------------
[INFO] [clean:clean]
[INFO] Deleting directory <http://hudson.zones.apache.org/hudson/job/Tuscany-2x/org.apache.tuscany.sca$itest-distribution-calculator-rmi/ws/target>
[INFO] [resources:resources]
[INFO] Using default encoding to copy filtered resources.
[INFO] [compiler:compile]
[INFO] No sources to compile
[INFO] [resources:testResources]
[INFO] Using default encoding to copy filtered resources.
[INFO] [compiler:testCompile]
[INFO] No sources to compile
[INFO] [surefire:test]
[INFO] No tests to run.
[HUDSON] Recording test results
[INFO] [jar:jar]
[INFO] Building jar: <http://hudson.zones.apache.org/hudson/job/Tuscany-2x/org.apache.tuscany.sca$itest-distribution-calculator-rmi/ws/target/itest-distribution-calculator-rmi-2.0-SNAPSHOT.jar>
[INFO] [antrun:run {execution: run-samples}]
[INFO] Executing tasks

run:

init:
    [mkdir] Created dir: /export/home/hudson/hudson/jobs/Tuscany-2x/workspace/sca/distribution/all/target/apache-tuscany-sca-all-2.0-SNAPSHOT-dir/tuscany-sca-2.0-SNAPSHOT/samples/calculator-rmi-service/target/classes

compile:
    [javac] Compiling 12 source files to /export/home/hudson/hudson/jobs/Tuscany-2x/workspace/sca/distribution/all/target/apache-tuscany-sca-all-2.0-SNAPSHOT-dir/tuscany-sca-2.0-SNAPSHOT/samples/calculator-rmi-service/target/classes
     [copy] Copying 2 files to /export/home/hudson/hudson/jobs/Tuscany-2x/workspace/sca/distribution/all/target/apache-tuscany-sca-all-2.0-SNAPSHOT-dir/tuscany-sca-2.0-SNAPSHOT/samples/calculator-rmi-service/target/classes
      [jar] Building jar: /export/home/hudson/hudson/jobs/Tuscany-2x/workspace/sca/distribution/all/target/apache-tuscany-sca-all-2.0-SNAPSHOT-dir/tuscany-sca-2.0-SNAPSHOT/samples/calculator-rmi-service/target/sample-calculator-rmi-service.jar

run:

init:
    [mkdir] Created dir: /export/home/hudson/hudson/jobs/Tuscany-2x/workspace/sca/distribution/all/target/apache-tuscany-sca-all-2.0-SNAPSHOT-dir/tuscany-sca-2.0-SNAPSHOT/samples/calculator-rmi-reference/target/classes

compile:
    [javac] Compiling 7 source files to /export/home/hudson/hudson/jobs/Tuscany-2x/workspace/sca/distribution/all/target/apache-tuscany-sca-all-2.0-SNAPSHOT-dir/tuscany-sca-2.0-SNAPSHOT/samples/calculator-rmi-reference/target/classes
     [copy] Copying 1 file to /export/home/hudson/hudson/jobs/Tuscany-2x/workspace/sca/distribution/all/target/apache-tuscany-sca-all-2.0-SNAPSHOT-dir/tuscany-sca-2.0-SNAPSHOT/samples/calculator-rmi-reference/target/classes
      [jar] Building jar: /export/home/hudson/hudson/jobs/Tuscany-2x/workspace/sca/distribution/all/target/apache-tuscany-sca-all-2.0-SNAPSHOT-dir/tuscany-sca-2.0-SNAPSHOT/samples/calculator-rmi-reference/target/sample-calculator-rmi-reference.jar

run:
     [java] Oct 2, 2009 1:13:03 AM org.apache.tuscany.sca.node.impl.NodeImpl start
     [java] INFO: Starting node: http://tuscany.apache.org/sca/1.1/nodes/default0 domain:
defaultDoamin
     [java] Oct 2, 2009 1:13:03 AM org.apache.tuscany.sca.node.impl.NodeImpl start
     [java] INFO: Starting node: http://tuscany.apache.org/sca/1.1/nodes/default0 domain:
tuscany.apache.org
     [java] 2009-10-02 01:13:04.090::INFO:  Logging to STDERR via org.mortbay.log.StdErrLog
     [java] 2009-10-02 01:13:04.116::INFO:  Logging to STDERR via org.mortbay.log.StdErrLog
     [java] Oct 2, 2009 1:13:04 AM org.apache.tuscany.sca.endpoint.wrapper.EndpointRegistryWrapper
start
     [java] INFO: EndpointRegistry found: org.apache.tuscany.sca.core.assembly.impl.EndpointRegistryImpl
     [java] Oct 2, 2009 1:13:04 AM org.apache.tuscany.sca.endpoint.wrapper.EndpointRegistryWrapper
start
     [java] INFO: EndpointRegistry found: org.apache.tuscany.sca.core.assembly.impl.EndpointRegistryImpl
     [java] Oct 2, 2009 1:13:08 AM org.apache.tuscany.sca.node.impl.NodeFactoryImpl loadContributions
     [java] INFO: Loading contribution: file:/zonestorage/hudson/home/hudson/hudson/jobs/Tuscany-2x/workspace/sca/distribution/all/target/apache-tuscany-sca-all-2.0-SNAPSHOT-dir/tuscany-sca-2.0-SNAPSHOT/samples/calculator-rmi-service/target/sample-calculator-rmi-service.jar
     [java] Oct 2, 2009 1:13:08 AM org.apache.tuscany.sca.node.impl.NodeFactoryImpl loadContributions
     [java] INFO: Loading contribution: file:/zonestorage/hudson/home/hudson/hudson/jobs/Tuscany-2x/workspace/sca/distribution/all/target/apache-tuscany-sca-all-2.0-SNAPSHOT-dir/tuscany-sca-2.0-SNAPSHOT/samples/calculator-rmi-reference/target/sample-calculator-rmi-reference.jar
     [java] Oct 2, 2009 1:13:09 AM org.apache.tuscany.sca.node.impl.NodeFactoryImpl configureNode
     [java] INFO: Adding composite: {http://sample}Calculator to domain defaultDoamin
     [java] Oct 2, 2009 1:13:09 AM org.apache.tuscany.sca.node.impl.NodeFactoryImpl configureNode
     [java] INFO: Adding composite: {http://sample}Calculator to domain http://tuscany.apache.org/sca/1.1/domains/default
     [java] Oct 2, 2009 1:13:09 AM org.apache.tuscany.sca.core.assembly.impl.EndpointRegistryImpl
addEndpoint
     [java] INFO: Add endpoint - (@6789355)Endpoint:  URI = CalculatorServiceComponent#service-binding(CalculatorService/CalculatorService)
     [java] Exception in thread "main" java.lang.reflect.InvocationTargetException
     [java] 	at sun.reflect.NativeMethodAccessorImpl.invoke0(Native Method)
     [java] 	at sun.reflect.NativeMethodAccessorImpl.invoke(NativeMethodAccessorImpl.java:39)
     [java] 	at sun.reflect.DelegatingMethodAccessorImpl.invoke(DelegatingMethodAccessorImpl.java:25)
     [java] 	at java.lang.reflect.Method.invoke(Method.java:597)
     [java] 	at org.apache.tuscany.sca.launcher.LauncherMain.invokeMainMethod(LauncherMain.java:115)
     [java] 	at org.apache.tuscany.sca.launcher.LauncherMain.main(LauncherMain.java:56)
     [java] Caused by: org.apache.tuscany.sca.host.rmi.RMIHostRuntimeException: Connection
refused to host: localhost; nested exception is: 
     [java] 	java.net.ConnectException: Connection refused
     [java] 	at sun.rmi.transport.tcp.TCPEndpoint.newSocket(TCPEndpoint.java:601)
     [java] 	at sun.rmi.transport.tcp.TCPChannel.createConnection(TCPChannel.java:198)
     [java] 	at sun.rmi.transport.tcp.TCPChannel.newConnection(TCPChannel.java:184)
     [java] 	at sun.rmi.server.UnicastRef.newCall(UnicastRef.java:322)
     [java] 	at sun.rmi.registry.RegistryImpl_Stub.lookup(Unknown Source)
     [java] 	at org.apache.tuscany.sca.host.rmi.DefaultRMIHost.findService(DefaultRMIHost.java:116)
     [java] 	at org.apache.tuscany.sca.host.rmi.ExtensibleRMIHost.findService(ExtensibleRMIHost.java:56)
     [java] 	at org.apache.tuscany.sca.binding.rmi.provider.RMIBindingInvoker.invokeTarget(RMIBindingInvoker.java:81)
     [java] 	at org.apache.tuscany.sca.binding.rmi.provider.RMIBindingInvoker.invoke(RMIBindingInvoker.java:54)
     [java] 	at org.apache.tuscany.sca.core.invocation.impl.JDKInvocationHandler.invoke(JDKInvocationHandler.java:289)
     [java] 	at org.apache.tuscany.sca.core.invocation.impl.JDKInvocationHandler.invoke(JDKInvocationHandler.java:154)
     [java] 	at $Proxy6.add(Unknown Source)
     [java] 	at calculator.CalculatorServiceImpl.add(CalculatorServiceImpl.java:54)
     [java] 	at sun.reflect.NativeMethodAccessorImpl.invoke0(Native Method)
     [java] 	at sun.reflect.NativeMethodAccessorImpl.invoke(NativeMethodAccessorImpl.java:39)
     [java] 	at sun.reflect.DelegatingMethodAccessorImpl.invoke(DelegatingMethodAccessorImpl.java:25)
     [java] 	at java.lang.reflect.Method.invoke(Method.java:597)
     [java] 	at org.apache.tuscany.sca.implementation.java.invocation.JavaImplementationInvoker.invoke(JavaImplementationInvoker.java:136)
     [java] 	at org.apache.tuscany.sca.core.databinding.wire.PassByValueInterceptor.invoke(PassByValueInterceptor.java:61)
     [java] 	at org.apache.tuscany.sca.binding.sca.provider.SCABindingInvoker.invoke(SCABindingInvoker.java:61)
     [java] 	at org.apache.tuscany.sca.core.databinding.wire.PassByValueInterceptor.invoke(PassByValueInterceptor.java:61)
     [java] 	at org.apache.tuscany.sca.core.invocation.impl.JDKInvocationHandler.invoke(JDKInvocationHandler.java:289)
     [java] 	at org.apache.tuscany.sca.core.invocation.impl.JDKInvocationHandler.invoke(JDKInvocationHandler.java:154)
     [java] 	at $Proxy5.add(Unknown Source)
     [java] 	at calculator.CalculatorClient.main(CalculatorClient.java:40)
     [java] 	... 6 more
     [java] Oct 2, 2009 1:13:10 AM org.apache.tuscany.sca.host.rmi.DefaultRMIHost registerService
     [java] INFO: RMI service registered: rmi://localhost:8099/CalculatorRMIService
     [java] Oct 2, 2009 1:13:10 AM org.apache.tuscany.sca.core.assembly.impl.EndpointRegistryImpl
addEndpoint
     [java] INFO: Add endpoint - (@29532653)Endpoint:  URI = CalculatorServiceComponent#service-binding(CalculatorService/CalculatorService)
     [java] Oct 2, 2009 1:13:10 AM org.apache.tuscany.sca.core.assembly.impl.EndpointRegistryImpl
addEndpoint
     [java] INFO: Add endpoint - (@4766820)Endpoint:  URI = AddServiceComponent#service-binding(AddServiceImpl/AddServiceImpl)
     [java] Oct 2, 2009 1:13:10 AM org.apache.tuscany.sca.core.assembly.impl.EndpointRegistryImpl
addEndpoint
     [java] INFO: Add endpoint - (@21521158)Endpoint:  URI = SubtractServiceComponent#service-binding(SubtractServiceImpl/SubtractServiceImpl)
     [java] Oct 2, 2009 1:13:10 AM org.apache.tuscany.sca.core.assembly.impl.EndpointRegistryImpl
addEndpoint
     [java] INFO: Add endpoint - (@22889075)Endpoint:  URI = MultiplyServiceComponent#service-binding(MultiplyServiceImpl/MultiplyServiceImpl)
     [java] Oct 2, 2009 1:13:10 AM org.apache.tuscany.sca.core.assembly.impl.EndpointRegistryImpl
addEndpoint
     [java] INFO: Add endpoint - (@28677619)Endpoint:  URI = DivideServiceComponent#service-binding(DivideServiceImpl/DivideServiceImpl)
     [java] Hit enter to stop node...
[HUDSON] Archiving <http://hudson.zones.apache.org/hudson/job/Tuscany-2x/org.apache.tuscany.sca$itest-distribution-calculator-rmi/ws/pom.xml>
to /export/home/hudson/hudson/jobs/Tuscany-2x/modules/org.apache.tuscany.sca$itest-distribution-calculator-rmi/builds/2009-10-02_00-30-29/archive/org.apache.tuscany.sca/itest-distribution-calculator-rmi/2.0-SNAPSHOT/pom.xml
[HUDSON] Archiving <http://hudson.zones.apache.org/hudson/job/Tuscany-2x/org.apache.tuscany.sca$itest-distribution-calculator-rmi/ws/target/itest-distribution-calculator-rmi-2.0-SNAPSHOT.jar>
to /export/home/hudson/hudson/jobs/Tuscany-2x/modules/org.apache.tuscany.sca$itest-distribution-calculator-rmi/builds/2009-10-02_00-30-29/archive/org.apache.tuscany.sca/itest-distribution-calculator-rmi/2.0-SNAPSHOT/itest-distribution-calculator-rmi-2.0-SNAPSHOT.jar
[INFO] ------------------------------------------------------------------------
[ERROR] BUILD ERROR
[INFO] ------------------------------------------------------------------------
[INFO] An Ant BuildException has occured: The following error occurred while executing this
line:
<http://hudson.zones.apache.org/hudson/job/Tuscany-2x/org.apache.tuscany.sca$itest-distribution-calculator-rmi/ws/build.xml>:44:
The following error occurred while executing this line:
/export/home/hudson/hudson/jobs/Tuscany-2x/workspace/sca/distribution/all/target/apache-tuscany-sca-all-2.0-SNAPSHOT-dir/tuscany-sca-2.0-SNAPSHOT/samples/calculator-rmi-reference/build.xml:59:
Java returned: 1

[INFO] ------------------------------------------------------------------------
[INFO] For more information, run Maven with the -e switch
[INFO] ------------------------------------------------------------------------
[INFO] Total time: 42 minutes 25 seconds
[INFO] Finished at: Fri Oct 02 01:13:11 UTC 2009
[INFO] Final Memory: 99M/747M
[INFO] ------------------------------------------------------------------------
Waiting for Hudson to finish collecting data


Mime
View raw message