tuscany-dev mailing list archives

Site index · List index
Message view « Date » · « Thread »
Top « Date » · « Thread »
From "Raymond Feng" <enjoyj...@gmail.com>
Subject Re: Fresh SVN has problem with WSPolicyProcessor
Date Mon, 04 Aug 2008 06:12:44 GMT
Hi,

I checked in a workaround under 682267. Please check if it helps.

Thanks,
Raymond


From: Scott Kurz 
Sent: Saturday, August 02, 2008 6:23 PM
To: dev@tuscany.apache.org 
Subject: Re: Fresh SVN has problem with WSPolicyProcessor


This looks like the same problem I reported yesterday in a follow-up to a a thread about TUSCANY-2499.

I'm wondering too how others are getting past this...




On Sat, Aug 2, 2008 at 6:04 PM, Giorgio Zoppi <giorgio.zoppi@gmail.com> wrote:

  Hi guys,
  I tried to compile SVN current with maven 2.0.8 and Java 1.5 on Ubuntu
  Linux and I have problmens with policies tests.
  BTW Still the corba test gives me failures but that's due to a missing
  default port. However I attach you my mvn execution output, which it's
  in part showed below.
  Could you give a try to a fresh svn build and tell me (if it works for
  you) which version of maven do you use?

  Running org.apache.tuscany.sca.binding.ws.axis2.itests.policy.mixed.WSSecurityMixedTestCase
  >>>Initializing WSPolicyProcessor
  2-ago-2008 23.55.00 org.apache.tuscany.sca.assembly.xml.CompositeProcessor
  AVVERTENZA: No namespace found: Composite = HelloWorld
  2-ago-2008 23.55.00 org.apache.tuscany.sca.assembly.xml.CompositeProcessor
  AVVERTENZA: No namespace found: Composite = HelloWorldNoWSDL
  2-ago-2008 23.55.00 org.apache.tuscany.sca.assembly.xml.CompositeProcessor
  AVVERTENZA: No namespace found: Composite = endpoint1
  2-ago-2008 23.55.00 org.apache.tuscany.sca.assembly.xml.CompositeProcessor
  AVVERTENZA: No namespace found: Composite = endpoint1
  2-ago-2008 23.55.00 org.apache.tuscany.sca.assembly.xml.CompositeProcessor
  AVVERTENZA: No namespace found: Composite = endpoint3
  2-ago-2008 23.55.00 org.apache.tuscany.sca.assembly.xml.CompositeProcessor
  AVVERTENZA: No namespace found: Composite = endpoint4
  2-ago-2008 23.55.00 org.apache.tuscany.sca.assembly.xml.CompositeProcessor
  AVVERTENZA: No namespace found: Composite = HelloWorld
  2-ago-2008 23.55.00 org.apache.tuscany.sca.assembly.xml.CompositeProcessor
  AVVERTENZA: No namespace found: Composite = HelloWorldOM-Merged
  2-ago-2008 23.55.00 org.apache.tuscany.sca.assembly.xml.CompositeProcessor
  AVVERTENZA: No namespace found: Composite = HelloWorldOM
  2-ago-2008 23.55.00 org.apache.tuscany.sca.assembly.xml.CompositeProcessor
  AVVERTENZA: No namespace found: Composite = HelloWorldPrec
  2-ago-2008 23.55.00 org.apache.tuscany.sca.assembly.xml.CompositeProcessor
  AVVERTENZA: No namespace found: Composite = endpoint3
  2-ago-2008 23.55.01 org.apache.tuscany.sca.assembly.xml.CompositeProcessor
  AVVERTENZA: No namespace found: Composite = endpoint3
  2-ago-2008 23.55.01 org.apache.tuscany.sca.assembly.xml.CompositeProcessor
  AVVERTENZA: No namespace found: Composite = endpoint3
  2-ago-2008 23.55.01 org.apache.tuscany.sca.assembly.xml.CompositeProcessor
  AVVERTENZA: No namespace found: Composite = endpoint3
  2-ago-2008 23.55.01 org.apache.tuscany.sca.assembly.xml.CompositeProcessor
  AVVERTENZA: No namespace found: Composite = endpoint3
  2-ago-2008 23.55.01 org.apache.tuscany.sca.assembly.xml.CompositeProcessor
  AVVERTENZA: No namespace found: Composite = endpoint3
  2-ago-2008 23.55.01 org.apache.tuscany.sca.assembly.xml.CompositeProcessor
  AVVERTENZA: No namespace found: Composite = endpoint3
  2-ago-2008 23.55.01 org.apache.tuscany.sca.assembly.xml.CompositeProcessor
  AVVERTENZA: No namespace found: Composite = QuestionMarkWSDLImport
  2-ago-2008 23.55.01 org.apache.tuscany.sca.assembly.xml.CompositeProcessor
  AVVERTENZA: No namespace found: Composite = QuestionMarkWSDLInclude
  2-ago-2008 23.55.01 org.apache.tuscany.sca.assembly.xml.CompositeProcessor
  AVVERTENZA: No namespace found: Composite = QuestionMarkWSDLTests
  2-ago-2008 23.55.01 org.apache.tuscany.sca.assembly.xml.CompositeProcessor
  AVVERTENZA: No namespace found: Composite = HelloWorld
  2-ago-2008 23.55.01 org.apache.tuscany.sca.assembly.xml.CompositeProcessor
  AVVERTENZA: No namespace found: Composite = QuestionMarkWSDLTests
  2-ago-2008 23.55.01 org.apache.tuscany.sca.policy.xml.PolicySetProcessor
  GRAVE: Provided Intent -
  {http://tuscany.apache.org/xmlns/sca/1.0}wsAuthentication not found
  for PolicySet {http://tuscany.apache.org/xmlns/sca/1.0}wsClientAuthenticationPolicy
  Tests run: 1, Failures: 0, Errors: 1, Skipped: 0, Time elapsed: 5.839
  sec <<< FAILURE!
  testHelloWorld(org.apache.tuscany.sca.binding.ws.axis2.itests.policy.mixed.WSSecurityMixedTestCase)
   Time elapsed: 5.795 sec  <<< ERROR!
  org.osoa.sca.ServiceRuntimeException:
  org.osoa.sca.ServiceRuntimeException: Provided Intent -
  {http://tuscany.apache.org/xmlns/sca/1.0}wsAuthentication not found
  for PolicySet {http://tuscany.apache.org/xmlns/sca/1.0}wsClientAuthenticationPolicy
         at org.apache.tuscany.sca.host.embedded.SCADomain.createNewInstance(SCADomain.java:276)
         at org.apache.tuscany.sca.host.embedded.SCADomain.newInstance(SCADomain.java:70)
         at org.apache.tuscany.sca.binding.ws.axis2.itests.policy.mixed.AbstractHelloWorldOMTestCase.setUp(AbstractHelloWorldOMTestCase.java:50)
         at junit.framework.TestCase.runBare(TestCase.java:132)
         at junit.framework.TestResult$1.protect(TestResult.java:110)
         at junit.framework.TestResult.runProtected(TestResult.java:128)
         at junit.framework.TestResult.run(TestResult.java:113)
         at junit.framework.TestCase.run(TestCase.java:124)
         at junit.framework.TestSuite.runTest(TestSuite.java:232)
         at junit.framework.TestSuite.run(TestSuite.java:227)
         at org.junit.internal.runners.OldTestClassRunner.run(OldTestClassRunner.java:35)
         at org.apache.maven.surefire.junit4.JUnit4TestSet.execute(JUnit4TestSet.java:62)
         at org.apache.maven.surefire.suite.AbstractDirectoryTestSuite.executeTestSet(AbstractDirectoryTestSuite.java:138)
         at org.apache.maven.surefire.suite.AbstractDirectoryTestSuite.execute(AbstractDirectoryTestSuite.java:125)
         at org.apache.maven.surefire.Surefire.run(Surefire.java:132)
         at sun.reflect.NativeMethodAccessorImpl.invoke0(Native Method)
         at sun.reflect.NativeMethodAccessorImpl.invoke(NativeMethodAccessorImpl.java:39)
         at sun.reflect.DelegatingMethodAccessorImpl.invoke(DelegatingMethodAccessorImpl.java:25)
         at java.lang.reflect.Method.invoke(Method.java:585)
         at org.apache.maven.surefire.booter.SurefireBooter.runSuitesInProcess(SurefireBooter.java:290)
         at org.apache.maven.surefire.booter.SurefireBooter.main(SurefireBooter.java:818)
  Caused by: org.osoa.sca.ServiceRuntimeException: Provided Intent -
  {http://tuscany.apache.org/xmlns/sca/1.0}wsAuthentication not found
  for PolicySet {http://tuscany.apache.org/xmlns/sca/1.0}wsClientAuthenticationPolicy
         at org.apache.tuscany.sca.host.embedded.impl.DefaultSCADomain.analyseProblems(DefaultSCADomain.java:309)
         at org.apache.tuscany.sca.host.embedded.impl.DefaultSCADomain.addContribution(DefaultSCADomain.java:334)
         at org.apache.tuscany.sca.host.embedded.impl.DefaultSCADomain.init(DefaultSCADomain.java:183)
         at org.apache.tuscany.sca.host.embedded.impl.DefaultSCADomain.<init>(DefaultSCADomain.java:120)
         at org.apache.tuscany.sca.host.embedded.SCADomain.createNewInstance(SCADomain.java:242)
         ... 20 more

  Running org.apache.tuscany.sca.binding.ws.axis2.itests.endpoints.DefaultMultiServiceTestCase
  >>>Initializing WSPolicyProcessor
  2-ago-2008 23.55.02 org.apache.tuscany.sca.assembly.xml.CompositeProcessor
  AVVERTENZA: No namespace found: Composite = HelloWorld
  2-ago-2008 23.55.03 org.apache.tuscany.sca.assembly.xml.CompositeProcessor
  AVVERTENZA: No namespace found: Composite = HelloWorldNoWSDL
  2-ago-2008 23.55.03 org.apache.tuscany.sca.assembly.xml.CompositeProcessor
  AVVERTENZA: No namespace found: Composite = endpoint1
  2-ago-2008 23.55.03 org.apache.tuscany.sca.assembly.xml.CompositeProcessor
  AVVERTENZA: No namespace found: Composite = endpoint1
  2-ago-2008 23.55.03 org.apache.tuscany.sca.assembly.xml.CompositeProcessor
  AVVERTENZA: No namespace found: Composite = endpoint3
  2-ago-2008 23.55.03 org.apache.tuscany.sca.assembly.xml.CompositeProcessor
  AVVERTENZA: No namespace found: Composite = endpoint4
  2-ago-2008 23.55.03 org.apache.tuscany.sca.assembly.xml.CompositeProcessor
  AVVERTENZA: No namespace found: Composite = HelloWorld
  2-ago-2008 23.55.03 org.apache.tuscany.sca.assembly.xml.CompositeProcessor
  AVVERTENZA: No namespace found: Composite = HelloWorldOM-Merged
  2-ago-2008 23.55.03 org.apache.tuscany.sca.assembly.xml.CompositeProcessor
  AVVERTENZA: No namespace found: Composite = HelloWorldOM
  2-ago-2008 23.55.03 org.apache.tuscany.sca.assembly.xml.CompositeProcessor
  AVVERTENZA: No namespace found: Composite = HelloWorldPrec
  2-ago-2008 23.55.03 org.apache.tuscany.sca.assembly.xml.CompositeProcessor
  AVVERTENZA: No namespace found: Composite = endpoint3
  2-ago-2008 23.55.03 org.apache.tuscany.sca.assembly.xml.CompositeProcessor
  AVVERTENZA: No namespace found: Composite = endpoint3
  2-ago-2008 23.55.03 org.apache.tuscany.sca.assembly.xml.CompositeProcessor
  AVVERTENZA: No namespace found: Composite = endpoint3
  2-ago-2008 23.55.03 org.apache.tuscany.sca.assembly.xml.CompositeProcessor
  AVVERTENZA: No namespace found: Composite = endpoint3
  2-ago-2008 23.55.03 org.apache.tuscany.sca.assembly.xml.CompositeProcessor
  AVVERTENZA: No namespace found: Composite = endpoint3
  2-ago-2008 23.55.03 org.apache.tuscany.sca.assembly.xml.CompositeProcessor
  AVVERTENZA: No namespace found: Composite = endpoint3
  2-ago-2008 23.55.03 org.apache.tuscany.sca.assembly.xml.CompositeProcessor
  AVVERTENZA: No namespace found: Composite = endpoint3
  2-ago-2008 23.55.03 org.apache.tuscany.sca.assembly.xml.CompositeProcessor
  AVVERTENZA: No namespace found: Composite = QuestionMarkWSDLImport
  2-ago-2008 23.55.04 org.apache.tuscany.sca.assembly.xml.CompositeProcessor
  AVVERTENZA: No namespace found: Composite = QuestionMarkWSDLInclude
  2-ago-2008 23.55.04 org.apache.tuscany.sca.assembly.xml.CompositeProcessor
  AVVERTENZA: No namespace found: Composite = QuestionMarkWSDLTests
  2-ago-2008 23.55.04 org.apache.tuscany.sca.assembly.xml.CompositeProcessor
  AVVERTENZA: No namespace found: Composite = HelloWorld
  2-ago-2008 23.55.04 org.apache.tuscany.sca.assembly.xml.CompositeProcessor
  AVVERTENZA: No namespace found: Composite = QuestionMarkWSDLTests
  2-ago-2008 23.55.04 org.apache.tuscany.sca.policy.xml.PolicySetProcessor
  GRAVE: Provided Intent -
  {http://tuscany.apache.org/xmlns/sca/1.0}wsAuthentication not found
  for PolicySet {http://tuscany.apache.org/xmlns/sca/1.0}wsClientAuthenticationPolicy
  Tests run: 1, Failures: 0, Errors: 1, Skipped: 0, Time elapsed: 1.911
  sec <<< FAILURE!
  testCalculator(org.apache.tuscany.sca.binding.ws.axis2.itests.endpoints.DefaultMultiServiceTestCase)
   Time elapsed: 1.901 sec  <<< ERROR!
  org.osoa.sca.ServiceRuntimeException:
  org.osoa.sca.ServiceRuntimeException: Provided Intent -
  {http://tuscany.apache.org/xmlns/sca/1.0}wsAuthentication not found
  for PolicySet {http://tuscany.apache.org/xmlns/sca/1.0}wsClientAuthenticationPolicy
         at org.apache.tuscany.sca.host.embedded.SCADomain.createNewInstance(SCADomain.java:276)
         at org.apache.tuscany.sca.host.embedded.SCADomain.newInstance(SCADomain.java:70)
         at org.apache.tuscany.sca.binding.ws.axis2.itests.endpoints.AbstractHelloWorldOMTestCase.setUp(AbstractHelloWorldOMTestCase.java:50)
         at junit.framework.TestCase.runBare(TestCase.java:132)
         at junit.framework.TestResult$1.protect(TestResult.java:110)
         at junit.framework.TestResult.runProtected(TestResult.java:128)
         at junit.framework.TestResult.run(TestResult.java:113)
         at junit.framework.TestCase.run(TestCase.java:124)
         at junit.framework.TestSuite.runTest(TestSuite.java:232)
         at junit.framework.TestSuite.run(TestSuite.java:227)
         at org.junit.internal.runners.OldTestClassRunner.run(OldTestClassRunner.java:35)
         at org.apache.maven.surefire.junit4.JUnit4TestSet.execute(JUnit4TestSet.java:62)
         at org.apache.maven.surefire.suite.AbstractDirectoryTestSuite.executeTestSet(AbstractDirectoryTestSuite.java:138)
         at org.apache.maven.surefire.suite.AbstractDirectoryTestSuite.execute(AbstractDirectoryTestSuite.java:125)
         at org.apache.maven.surefire.Surefire.run(Surefire.java:132)
         at sun.reflect.NativeMethodAccessorImpl.invoke0(Native Method)
         at sun.reflect.NativeMethodAccessorImpl.invoke(NativeMethodAccessorImpl.java:39)
         at sun.reflect.DelegatingMethodAccessorImpl.invoke(DelegatingMethodAccessorImpl.java:25)
         at java.lang.reflect.Method.invoke(Method.java:585)
         at org.apache.maven.surefire.booter.SurefireBooter.runSuitesInProcess(SurefireBooter.java:290)
         at org.apache.maven.surefire.booter.SurefireBooter.main(SurefireBooter.java:818)
  Caused by: org.osoa.sca.ServiceRuntimeException: Provided Intent -
  {http://tuscany.apache.org/xmlns/sca/1.0}wsAuthentication not found
  for PolicySet {http://tuscany.apache.org/xmlns/sca/1.0}wsClientAuthenticationPolicy
         at org.apache.tuscany.sca.host.embedded.impl.DefaultSCADomain.analyseProblems(DefaultSCADomain.java:309)
         at org.apache.tuscany.sca.host.embedded.impl.DefaultSCADomain.addContribution(DefaultSCADomain.java:334)
         at org.apache.tuscany.sca.host.embedded.impl.DefaultSCADomain.init(DefaultSCADomain.java:183)
         at org.apache.tuscany.sca.host.embedded.impl.DefaultSCADomain.<init>(DefaultSCADomain.java:120)
         at org.apache.tuscany.sca.host.embedded.SCADomain.createNewInstance(SCADomain.java:242)
         ... 20 more

  Running org.apache.tuscany.sca.binding.ws.axis2.itests.soap12.QuestionMarkWSDLTestCase
  >>>Initializing WSPolicyProcessor
  2-ago-2008 23.55.04 org.apache.tuscany.sca.assembly.xml.CompositeProcessor
  AVVERTENZA: No namespace found: Composite = HelloWorld
  2-ago-2008 23.55.04 org.apache.tuscany.sca.assembly.xml.CompositeProcessor
  AVVERTENZA: No namespace found: Composite = HelloWorldNoWSDL
  2-ago-2008 23.55.04 org.apache.tuscany.sca.assembly.xml.CompositeProcessor
  AVVERTENZA: No namespace found: Composite = endpoint1
  2-ago-2008 23.55.04 org.apache.tuscany.sca.assembly.xml.CompositeProcessor
  AVVERTENZA: No namespace found: Composite = endpoint1
  2-ago-2008 23.55.04 org.apache.tuscany.sca.assembly.xml.CompositeProcessor
  AVVERTENZA: No namespace found: Composite = endpoint3
  2-ago-2008 23.55.04 org.apache.tuscany.sca.assembly.xml.CompositeProcessor
  AVVERTENZA: No namespace found: Composite = endpoint4
  2-ago-2008 23.55.04 org.apache.tuscany.sca.assembly.xml.CompositeProcessor
  AVVERTENZA: No namespace found: Composite = HelloWorld
  2-ago-2008 23.55.05 org.apache.tuscany.sca.assembly.xml.CompositeProcessor
  AVVERTENZA: No namespace found: Composite = HelloWorldOM-Merged
  2-ago-2008 23.55.05 org.apache.tuscany.sca.assembly.xml.CompositeProcessor
  AVVERTENZA: No namespace found: Composite = HelloWorldOM
  2-ago-2008 23.55.05 org.apache.tuscany.sca.assembly.xml.CompositeProcessor
  AVVERTENZA: No namespace found: Composite = HelloWorldPrec
  2-ago-2008 23.55.05 org.apache.tuscany.sca.assembly.xml.CompositeProcessor
  AVVERTENZA: No namespace found: Composite = endpoint3
  2-ago-2008 23.55.05 org.apache.tuscany.sca.assembly.xml.CompositeProcessor
  AVVERTENZA: No namespace found: Composite = endpoint3
  2-ago-2008 23.55.05 org.apache.tuscany.sca.assembly.xml.CompositeProcessor
  AVVERTENZA: No namespace found: Composite = endpoint3
  2-ago-2008 23.55.05 org.apache.tuscany.sca.assembly.xml.CompositeProcessor
  AVVERTENZA: No namespace found: Composite = endpoint3
  2-ago-2008 23.55.05 org.apache.tuscany.sca.assembly.xml.CompositeProcessor
  AVVERTENZA: No namespace found: Composite = endpoint3
  2-ago-2008 23.55.05 org.apache.tuscany.sca.assembly.xml.CompositeProcessor
  AVVERTENZA: No namespace found: Composite = endpoint3
  2-ago-2008 23.55.05 org.apache.tuscany.sca.assembly.xml.CompositeProcessor
  AVVERTENZA: No namespace found: Composite = endpoint3
  2-ago-2008 23.55.05 org.apache.tuscany.sca.assembly.xml.CompositeProcessor
  AVVERTENZA: No namespace found: Composite = QuestionMarkWSDLImport
  2-ago-2008 23.55.05 org.apache.tuscany.sca.assembly.xml.CompositeProcessor
  AVVERTENZA: No namespace found: Composite = QuestionMarkWSDLInclude
  2-ago-2008 23.55.05 org.apache.tuscany.sca.assembly.xml.CompositeProcessor
  AVVERTENZA: No namespace found: Composite = QuestionMarkWSDLTests
  2-ago-2008 23.55.05 org.apache.tuscany.sca.assembly.xml.CompositeProcessor
  AVVERTENZA: No namespace found: Composite = HelloWorld
  2-ago-2008 23.55.05 org.apache.tuscany.sca.assembly.xml.CompositeProcessor
  AVVERTENZA: No namespace found: Composite = QuestionMarkWSDLTests
  2-ago-2008 23.55.05 org.apache.tuscany.sca.policy.xml.PolicySetProcessor
  GRAVE: Provided Intent -
  {http://tuscany.apache.org/xmlns/sca/1.0}wsAuthentication not found
  for PolicySet {http://tuscany.apache.org/xmlns/sca/1.0}wsClientAuthenticationPolicy
  >>>Initializing WSPolicyProcessor
  2-ago-2008 23.55.06 org.apache.tuscany.sca.assembly.xml.CompositeProcessor
  AVVERTENZA: No namespace found: Composite = HelloWorld
  2-ago-2008 23.55.06 org.apache.tuscany.sca.assembly.xml.CompositeProcessor
  AVVERTENZA: No namespace found: Composite = HelloWorldNoWSDL
  2-ago-2008 23.55.06 org.apache.tuscany.sca.assembly.xml.CompositeProcessor
  AVVERTENZA: No namespace found: Composite = endpoint1
  2-ago-2008 23.55.06 org.apache.tuscany.sca.assembly.xml.CompositeProcessor
  AVVERTENZA: No namespace found: Composite = endpoint1
  2-ago-2008 23.55.06 org.apache.tuscany.sca.assembly.xml.CompositeProcessor
  AVVERTENZA: No namespace found: Composite = endpoint3
  2-ago-2008 23.55.06 org.apache.tuscany.sca.assembly.xml.CompositeProcessor
  AVVERTENZA: No namespace found: Composite = endpoint4
  2-ago-2008 23.55.06 org.apache.tuscany.sca.assembly.xml.CompositeProcessor
  AVVERTENZA: No namespace found: Composite = HelloWorld
  2-ago-2008 23.55.06 org.apache.tuscany.sca.assembly.xml.CompositeProcessor
  AVVERTENZA: No namespace found: Composite = HelloWorldOM-Merged
  2-ago-2008 23.55.06 org.apache.tuscany.sca.assembly.xml.CompositeProcessor
  AVVERTENZA: No namespace found: Composite = HelloWorldOM
  2-ago-2008 23.55.06 org.apache.tuscany.sca.assembly.xml.CompositeProcessor
  AVVERTENZA: No namespace found: Composite = HelloWorldPrec
  2-ago-2008 23.55.06 org.apache.tuscany.sca.assembly.xml.CompositeProcessor
  AVVERTENZA: No namespace found: Composite = endpoint3
  2-ago-2008 23.55.06 org.apache.tuscany.sca.assembly.xml.CompositeProcessor
  AVVERTENZA: No namespace found: Composite = endpoint3
  2-ago-2008 23.55.06 org.apache.tuscany.sca.assembly.xml.CompositeProcessor
  AVVERTENZA: No namespace found: Composite = endpoint3
  2-ago-2008 23.55.06 org.apache.tuscany.sca.assembly.xml.CompositeProcessor
  AVVERTENZA: No namespace found: Composite = endpoint3
  2-ago-2008 23.55.06 org.apache.tuscany.sca.assembly.xml.CompositeProcessor
  AVVERTENZA: No namespace found: Composite = endpoint3
  2-ago-2008 23.55.06 org.apache.tuscany.sca.assembly.xml.CompositeProcessor
  AVVERTENZA: No namespace found: Composite = endpoint3
  2-ago-2008 23.55.06 org.apache.tuscany.sca.assembly.xml.CompositeProcessor
  AVVERTENZA: No namespace found: Composite = endpoint3
  2-ago-2008 23.55.06 org.apache.tuscany.sca.assembly.xml.CompositeProcessor
  AVVERTENZA: No namespace found: Composite = QuestionMarkWSDLImport
  2-ago-2008 23.55.06 org.apache.tuscany.sca.assembly.xml.CompositeProcessor
  AVVERTENZA: No namespace found: Composite = QuestionMarkWSDLInclude
  2-ago-2008 23.55.06 org.apache.tuscany.sca.assembly.xml.CompositeProcessor
  AVVERTENZA: No namespace found: Composite = QuestionMarkWSDLTests
  2-ago-2008 23.55.06 org.apache.tuscany.sca.assembly.xml.CompositeProcessor
  AVVERTENZA: No namespace found: Composite = HelloWorld
  2-ago-2008 23.55.07 org.apache.tuscany.sca.assembly.xml.CompositeProcessor
  AVVERTENZA: No namespace found: Composite = QuestionMarkWSDLTests
  2-ago-2008 23.55.07 org.apache.tuscany.sca.policy.xml.PolicySetProcessor
  GRAVE: Provided Intent -
  {http://tuscany.apache.org/xmlns/sca/1.0}wsAuthentication not found
  for PolicySet {http://tuscany.apache.org/xmlns/sca/1.0}wsClientAuthenticationPolicy
  >>>Initializing WSPolicyProcessor
  2-ago-2008 23.55.07 org.apache.tuscany.sca.assembly.xml.CompositeProcessor
  AVVERTENZA: No namespace found: Composite = HelloWorld
  2-ago-2008 23.55.07 org.apache.tuscany.sca.assembly.xml.CompositeProcessor
  AVVERTENZA: No namespace found: Composite = HelloWorldNoWSDL
  2-ago-2008 23.55.07 org.apache.tuscany.sca.assembly.xml.CompositeProcessor
  AVVERTENZA: No namespace found: Composite = endpoint1
  2-ago-2008 23.55.07 org.apache.tuscany.sca.assembly.xml.CompositeProcessor
  AVVERTENZA: No namespace found: Composite = endpoint1
  2-ago-2008 23.55.07 org.apache.tuscany.sca.assembly.xml.CompositeProcessor
  AVVERTENZA: No namespace found: Composite = endpoint3
  2-ago-2008 23.55.07 org.apache.tuscany.sca.assembly.xml.CompositeProcessor
  AVVERTENZA: No namespace found: Composite = endpoint4
  2-ago-2008 23.55.07 org.apache.tuscany.sca.assembly.xml.CompositeProcessor
  AVVERTENZA: No namespace found: Composite = HelloWorld
  2-ago-2008 23.55.07 org.apache.tuscany.sca.assembly.xml.CompositeProcessor
  AVVERTENZA: No namespace found: Composite = HelloWorldOM-Merged
  2-ago-2008 23.55.07 org.apache.tuscany.sca.assembly.xml.CompositeProcessor
  AVVERTENZA: No namespace found: Composite = HelloWorldOM
  2-ago-2008 23.55.07 org.apache.tuscany.sca.assembly.xml.CompositeProcessor
  AVVERTENZA: No namespace found: Composite = HelloWorldPrec
  2-ago-2008 23.55.07 org.apache.tuscany.sca.assembly.xml.CompositeProcessor
  AVVERTENZA: No namespace found: Composite = endpoint3
  2-ago-2008 23.55.07 org.apache.tuscany.sca.assembly.xml.CompositeProcessor
  AVVERTENZA: No namespace found: Composite = endpoint3
  2-ago-2008 23.55.08 org.apache.tuscany.sca.assembly.xml.CompositeProcessor
  AVVERTENZA: No namespace found: Composite = endpoint3
  2-ago-2008 23.55.08 org.apache.tuscany.sca.assembly.xml.CompositeProcessor
  AVVERTENZA: No namespace found: Composite = endpoint3
  2-ago-2008 23.55.08 org.apache.tuscany.sca.assembly.xml.CompositeProcessor
  AVVERTENZA: No namespace found: Composite = endpoint3
  2-ago-2008 23.55.08 org.apache.tuscany.sca.assembly.xml.CompositeProcessor
  AVVERTENZA: No namespace found: Composite = endpoint3
  2-ago-2008 23.55.08 org.apache.tuscany.sca.assembly.xml.CompositeProcessor
  AVVERTENZA: No namespace found: Composite = endpoint3
  2-ago-2008 23.55.08 org.apache.tuscany.sca.assembly.xml.CompositeProcessor
  AVVERTENZA: No namespace found: Composite = QuestionMarkWSDLImport
  2-ago-2008 23.55.08 org.apache.tuscany.sca.assembly.xml.CompositeProcessor
  AVVERTENZA: No namespace found: Composite = QuestionMarkWSDLInclude
  2-ago-2008 23.55.08 org.apache.tuscany.sca.assembly.xml.CompositeProcessor
  AVVERTENZA: No namespace found: Composite = QuestionMarkWSDLTests
  2-ago-2008 23.55.08 org.apache.tuscany.sca.assembly.xml.CompositeProcessor
  AVVERTENZA: No namespace found: Composite = HelloWorld
  2-ago-2008 23.55.08 org.apache.tuscany.sca.assembly.xml.CompositeProcessor
  AVVERTENZA: No namespace found: Composite = QuestionMarkWSDLTests
  2-ago-2008 23.55.08 org.apache.tuscany.sca.policy.xml.PolicySetProcessor
  GRAVE: Provided Intent -
  {http://tuscany.apache.org/xmlns/sca/1.0}wsAuthentication not found
  for PolicySet {http://tuscany.apache.org/xmlns/sca/1.0}wsClientAuthenticationPolicy
  Tests run: 3, Failures: 0, Errors: 3, Skipped: 0, Time elapsed: 3.993
  sec <<< FAILURE!
  testSOAPDefault(org.apache.tuscany.sca.binding.ws.axis2.itests.soap12.QuestionMarkWSDLTestCase)
   Time elapsed: 1.413 sec  <<< ERROR!
  org.osoa.sca.ServiceRuntimeException:
  org.osoa.sca.ServiceRuntimeException: Provided Intent -
  {http://tuscany.apache.org/xmlns/sca/1.0}wsAuthentication not found
  for PolicySet {http://tuscany.apache.org/xmlns/sca/1.0}wsClientAuthenticationPolicy
         at org.apache.tuscany.sca.host.embedded.SCADomain.createNewInstance(SCADomain.java:276)
         at org.apache.tuscany.sca.host.embedded.SCADomain.newInstance(SCADomain.java:70)
         at org.apache.tuscany.sca.binding.ws.axis2.itests.soap12.QuestionMarkWSDLTestCase.setUp(QuestionMarkWSDLTestCase.java:130)
         at junit.framework.TestCase.runBare(TestCase.java:132)
         at junit.framework.TestResult$1.protect(TestResult.java:110)
         at junit.framework.TestResult.runProtected(TestResult.java:128)
         at junit.framework.TestResult.run(TestResult.java:113)
         at junit.framework.TestCase.run(TestCase.java:124)
         at junit.framework.TestSuite.runTest(TestSuite.java:232)
         at junit.framework.TestSuite.run(TestSuite.java:227)
         at org.junit.internal.runners.OldTestClassRunner.run(OldTestClassRunner.java:35)
         at org.apache.maven.surefire.junit4.JUnit4TestSet.execute(JUnit4TestSet.java:62)
         at org.apache.maven.surefire.suite.AbstractDirectoryTestSuite.executeTestSet(AbstractDirectoryTestSuite.java:138)
         at org.apache.maven.surefire.suite.AbstractDirectoryTestSuite.execute(AbstractDirectoryTestSuite.java:125)
         at org.apache.maven.surefire.Surefire.run(Surefire.java:132)
         at sun.reflect.NativeMethodAccessorImpl.invoke0(Native Method)
         at sun.reflect.NativeMethodAccessorImpl.invoke(NativeMethodAccessorImpl.java:39)
         at sun.reflect.DelegatingMethodAccessorImpl.invoke(DelegatingMethodAccessorImpl.java:25)
         at java.lang.reflect.Method.invoke(Method.java:585)
         at org.apache.maven.surefire.booter.SurefireBooter.runSuitesInProcess(SurefireBooter.java:290)
         at org.apache.maven.surefire.booter.SurefireBooter.main(SurefireBooter.java:818)
  Caused by: org.osoa.sca.ServiceRuntimeException: Provided Intent -
  {http://tuscany.apache.org/xmlns/sca/1.0}wsAuthentication not found
  for PolicySet {http://tuscany.apache.org/xmlns/sca/1.0}wsClientAuthenticationPolicy
         at org.apache.tuscany.sca.host.embedded.impl.DefaultSCADomain.analyseProblems(DefaultSCADomain.java:309)
         at org.apache.tuscany.sca.host.embedded.impl.DefaultSCADomain.addContribution(DefaultSCADomain.java:334)
         at org.apache.tuscany.sca.host.embedded.impl.DefaultSCADomain.init(DefaultSCADomain.java:183)
         at org.apache.tuscany.sca.host.embedded.impl.DefaultSCADomain.<init>(DefaultSCADomain.java:120)
         at org.apache.tuscany.sca.host.embedded.SCADomain.createNewInstance(SCADomain.java:242)
         ... 20 more

  testSOAP11Endpoint(org.apache.tuscany.sca.binding.ws.axis2.itests.soap12.QuestionMarkWSDLTestCase)
   Time elapsed: 1.312 sec  <<< ERROR!
  org.osoa.sca.ServiceRuntimeException:
  org.osoa.sca.ServiceRuntimeException: Provided Intent -
  {http://tuscany.apache.org/xmlns/sca/1.0}wsAuthentication not found
  for PolicySet {http://tuscany.apache.org/xmlns/sca/1.0}wsClientAuthenticationPolicy
         at org.apache.tuscany.sca.host.embedded.SCADomain.createNewInstance(SCADomain.java:276)
         at org.apache.tuscany.sca.host.embedded.SCADomain.newInstance(SCADomain.java:70)
         at org.apache.tuscany.sca.binding.ws.axis2.itests.soap12.QuestionMarkWSDLTestCase.setUp(QuestionMarkWSDLTestCase.java:130)
         at junit.framework.TestCase.runBare(TestCase.java:132)
         at junit.framework.TestResult$1.protect(TestResult.java:110)
         at junit.framework.TestResult.runProtected(TestResult.java:128)
         at junit.framework.TestResult.run(TestResult.java:113)
         at junit.framework.TestCase.run(TestCase.java:124)
         at junit.framework.TestSuite.runTest(TestSuite.java:232)
         at junit.framework.TestSuite.run(TestSuite.java:227)
         at org.junit.internal.runners.OldTestClassRunner.run(OldTestClassRunner.java:35)
         at org.apache.maven.surefire.junit4.JUnit4TestSet.execute(JUnit4TestSet.java:62)
         at org.apache.maven.surefire.suite.AbstractDirectoryTestSuite.executeTestSet(AbstractDirectoryTestSuite.java:138)
         at org.apache.maven.surefire.suite.AbstractDirectoryTestSuite.execute(AbstractDirectoryTestSuite.java:125)
         at org.apache.maven.surefire.Surefire.run(Surefire.java:132)
         at sun.reflect.NativeMethodAccessorImpl.invoke0(Native Method)
         at sun.reflect.NativeMethodAccessorImpl.invoke(NativeMethodAccessorImpl.java:39)
         at sun.reflect.DelegatingMethodAccessorImpl.invoke(DelegatingMethodAccessorImpl.java:25)
         at java.lang.reflect.Method.invoke(Method.java:585)
         at org.apache.maven.surefire.booter.SurefireBooter.runSuitesInProcess(SurefireBooter.java:290)
         at org.apache.maven.surefire.booter.SurefireBooter.main(SurefireBooter.java:818)
  Caused by: org.osoa.sca.ServiceRuntimeException: Provided Intent -
  {http://tuscany.apache.org/xmlns/sca/1.0}wsAuthentication not found
  for PolicySet {http://tuscany.apache.org/xmlns/sca/1.0}wsClientAuthenticationPolicy
         at org.apache.tuscany.sca.host.embedded.impl.DefaultSCADomain.analyseProblems(DefaultSCADomain.java:309)
         at org.apache.tuscany.sca.host.embedded.impl.DefaultSCADomain.addContribution(DefaultSCADomain.java:334)
         at org.apache.tuscany.sca.host.embedded.impl.DefaultSCADomain.init(DefaultSCADomain.java:183)
         at org.apache.tuscany.sca.host.embedded.impl.DefaultSCADomain.<init>(DefaultSCADomain.java:120)
         at org.apache.tuscany.sca.host.embedded.SCADomain.createNewInstance(SCADomain.java:242)
         ... 20 more

  testSOAP12Endpoint(org.apache.tuscany.sca.binding.ws.axis2.itests.soap12.QuestionMarkWSDLTestCase)
   Time elapsed: 1.26 sec  <<< ERROR!
  org.osoa.sca.ServiceRuntimeException:
  org.osoa.sca.ServiceRuntimeException: Provided Intent -
  {http://tuscany.apache.org/xmlns/sca/1.0}wsAuthentication not found
  for PolicySet {http://tuscany.apache.org/xmlns/sca/1.0}wsClientAuthenticationPolicy
         at org.apache.tuscany.sca.host.embedded.SCADomain.createNewInstance(SCADomain.java:276)
         at org.apache.tuscany.sca.host.embedded.SCADomain.newInstance(SCADomain.java:70)
         at org.apache.tuscany.sca.binding.ws.axis2.itests.soap12.QuestionMarkWSDLTestCase.setUp(QuestionMarkWSDLTestCase.java:130)
         at junit.framework.TestCase.runBare(TestCase.java:132)
         at junit.framework.TestResult$1.protect(TestResult.java:110)
         at junit.framework.TestResult.runProtected(TestResult.java:128)
         at junit.framework.TestResult.run(TestResult.java:113)
         at junit.framework.TestCase.run(TestCase.java:124)
         at junit.framework.TestSuite.runTest(TestSuite.java:232)
         at junit.framework.TestSuite.run(TestSuite.java:227)
         at org.junit.internal.runners.OldTestClassRunner.run(OldTestClassRunner.java:35)
         at org.apache.maven.surefire.junit4.JUnit4TestSet.execute(JUnit4TestSet.java:62)
         at org.apache.maven.surefire.suite.AbstractDirectoryTestSuite.executeTestSet(AbstractDirectoryTestSuite.java:138)
         at org.apache.maven.surefire.suite.AbstractDirectoryTestSuite.execute(AbstractDirectoryTestSuite.java:125)
         at org.apache.maven.surefire.Surefire.run(Surefire.java:132)
         at sun.reflect.NativeMethodAccessorImpl.invoke0(Native Method)
         at sun.reflect.NativeMethodAccessorImpl.invoke(NativeMethodAccessorImpl.java:39)
         at sun.reflect.DelegatingMethodAccessorImpl.invoke(DelegatingMethodAccessorImpl.java:25)
         at java.lang.reflect.Method.invoke(Method.java:585)
         at org.apache.maven.surefire.booter.SurefireBooter.runSuitesInProcess(SurefireBooter.java:290)
         at org.apache.maven.surefire.booter.SurefireBooter.main(SurefireBooter.java:818)
  Caused by: org.osoa.sca.ServiceRuntimeException: Provided Intent -
  {http://tuscany.apache.org/xmlns/sca/1.0}wsAuthentication not found
  for PolicySet {http://tuscany.apache.org/xmlns/sca/1.0}wsClientAuthenticationPolicy
         at org.apache.tuscany.sca.host.embedded.impl.DefaultSCADomain.analyseProblems(DefaultSCADomain.java:309)
         at org.apache.tuscany.sca.host.embedded.impl.DefaultSCADomain.addContribution(DefaultSCADomain.java:334)
         at org.apache.tuscany.sca.host.embedded.impl.DefaultSCADomain.init(DefaultSCADomain.java:183)
         at org.apache.tuscany.sca.host.embedded.impl.DefaultSCADomain.<init>(DefaultSCADomain.java:120)
         at org.apache.tuscany.sca.host.embedded.SCADomain.createNewInstance(SCADomain.java:242)
         ... 20 more

  Running org.apache.tuscany.sca.binding.ws.axis2.Axis2ReferenceTestCase
  Tests run: 2, Failures: 0, Errors: 0, Skipped: 0, Time elapsed: 0.035 sec
  Running org.apache.tuscany.sca.binding.ws.axis2.itests.policy.wspolicy.WSSecurityIntegrityTestCase
  >>>Initializing WSPolicyProcessor
  2-ago-2008 23.55.08 org.apache.tuscany.sca.assembly.xml.CompositeProcessor
  AVVERTENZA: No namespace found: Composite = HelloWorld
  2-ago-2008 23.55.08 org.apache.tuscany.sca.assembly.xml.CompositeProcessor
  AVVERTENZA: No namespace found: Composite = HelloWorldNoWSDL
  2-ago-2008 23.55.08 org.apache.tuscany.sca.assembly.xml.CompositeProcessor
  AVVERTENZA: No namespace found: Composite = endpoint1
  2-ago-2008 23.55.08 org.apache.tuscany.sca.assembly.xml.CompositeProcessor
  AVVERTENZA: No namespace found: Composite = endpoint1
  2-ago-2008 23.55.08 org.apache.tuscany.sca.assembly.xml.CompositeProcessor
  AVVERTENZA: No namespace found: Composite = endpoint3
  2-ago-2008 23.55.09 org.apache.tuscany.sca.assembly.xml.CompositeProcessor
  AVVERTENZA: No namespace found: Composite = endpoint4
  2-ago-2008 23.55.09 org.apache.tuscany.sca.assembly.xml.CompositeProcessor
  AVVERTENZA: No namespace found: Composite = HelloWorld
  2-ago-2008 23.55.09 org.apache.tuscany.sca.assembly.xml.CompositeProcessor
  AVVERTENZA: No namespace found: Composite = HelloWorldOM-Merged
  2-ago-2008 23.55.09 org.apache.tuscany.sca.assembly.xml.CompositeProcessor
  AVVERTENZA: No namespace found: Composite = HelloWorldOM
  2-ago-2008 23.55.09 org.apache.tuscany.sca.assembly.xml.CompositeProcessor
  AVVERTENZA: No namespace found: Composite = HelloWorldPrec
  2-ago-2008 23.55.09 org.apache.tuscany.sca.assembly.xml.CompositeProcessor
  AVVERTENZA: No namespace found: Composite = endpoint3
  2-ago-2008 23.55.09 org.apache.tuscany.sca.assembly.xml.CompositeProcessor
  AVVERTENZA: No namespace found: Composite = endpoint3
  2-ago-2008 23.55.09 org.apache.tuscany.sca.assembly.xml.CompositeProcessor
  AVVERTENZA: No namespace found: Composite = endpoint3
  2-ago-2008 23.55.09 org.apache.tuscany.sca.assembly.xml.CompositeProcessor
  AVVERTENZA: No namespace found: Composite = endpoint3
  2-ago-2008 23.55.09 org.apache.tuscany.sca.assembly.xml.CompositeProcessor
  AVVERTENZA: No namespace found: Composite = endpoint3
  2-ago-2008 23.55.09 org.apache.tuscany.sca.assembly.xml.CompositeProcessor
  AVVERTENZA: No namespace found: Composite = endpoint3
  2-ago-2008 23.55.09 org.apache.tuscany.sca.assembly.xml.CompositeProcessor
  AVVERTENZA: No namespace found: Composite = endpoint3
  2-ago-2008 23.55.09 org.apache.tuscany.sca.assembly.xml.CompositeProcessor
  AVVERTENZA: No namespace found: Composite = QuestionMarkWSDLImport
  2-ago-2008 23.55.09 org.apache.tuscany.sca.assembly.xml.CompositeProcessor
  AVVERTENZA: No namespace found: Composite = QuestionMarkWSDLInclude
  2-ago-2008 23.55.09 org.apache.tuscany.sca.assembly.xml.CompositeProcessor
  AVVERTENZA: No namespace found: Composite = QuestionMarkWSDLTests
  2-ago-2008 23.55.09 org.apache.tuscany.sca.assembly.xml.CompositeProcessor
  AVVERTENZA: No namespace found: Composite = HelloWorld
  2-ago-2008 23.55.09 org.apache.tuscany.sca.assembly.xml.CompositeProcessor
  AVVERTENZA: No namespace found: Composite = QuestionMarkWSDLTests
  2-ago-2008 23.55.09 org.apache.tuscany.sca.policy.xml.PolicySetProcessor
  GRAVE: Provided Intent -
  {http://tuscany.apache.org/xmlns/sca/1.0}wsAuthentication not found
  for PolicySet {http://tuscany.apache.org/xmlns/sca/1.0}wsClientAuthenticationPolicy
  Tests run: 1, Failures: 0, Errors: 1, Skipped: 0, Time elapsed: 1.279
  sec <<< FAILURE!
  testHelloWorld(org.apache.tuscany.sca.binding.ws.axis2.itests.policy.wspolicy.WSSecurityIntegrityTestCase)
   Time elapsed: 1.276 sec  <<< ERROR!
  org.osoa.sca.ServiceRuntimeException:
  org.osoa.sca.ServiceRuntimeException: Provided Intent -
  {http://tuscany.apache.org/xmlns/sca/1.0}wsAuthentication not found
  for PolicySet {http://tuscany.apache.org/xmlns/sca/1.0}wsClientAuthenticationPolicy
         at org.apache.tuscany.sca.host.embedded.SCADomain.createNewInstance(SCADomain.java:276)
         at org.apache.tuscany.sca.host.embedded.SCADomain.newInstance(SCADomain.java:70)
         at org.apache.tuscany.sca.binding.ws.axis2.itests.policy.wspolicy.AbstractHelloWorldOMTestCase.setUp(AbstractHelloWorldOMTestCase.java:50)
         at junit.framework.TestCase.runBare(TestCase.java:132)
         at junit.framework.TestResult$1.protect(TestResult.java:110)
         at junit.framework.TestResult.runProtected(TestResult.java:128)
         at junit.framework.TestResult.run(TestResult.java:113)
         at junit.framework.TestCase.run(TestCase.java:124)
         at junit.framework.TestSuite.runTest(TestSuite.java:232)
         at junit.framework.TestSuite.run(TestSuite.java:227)
         at org.junit.internal.runners.OldTestClassRunner.run(OldTestClassRunner.java:35)
         at org.apache.maven.surefire.junit4.JUnit4TestSet.execute(JUnit4TestSet.java:62)
         at org.apache.maven.surefire.suite.AbstractDirectoryTestSuite.executeTestSet(AbstractDirectoryTestSuite.java:138)
         at org.apache.maven.surefire.suite.AbstractDirectoryTestSuite.execute(AbstractDirectoryTestSuite.java:125)
         at org.apache.maven.surefire.Surefire.run(Surefire.java:132)
         at sun.reflect.NativeMethodAccessorImpl.invoke0(Native Method)
         at sun.reflect.NativeMethodAccessorImpl.invoke(NativeMethodAccessorImpl.java:39)
         at sun.reflect.DelegatingMethodAccessorImpl.invoke(DelegatingMethodAccessorImpl.java:25)
         at java.lang.reflect.Method.invoke(Method.java:585)
         at org.apache.maven.surefire.booter.SurefireBooter.runSuitesInProcess(SurefireBooter.java:290)
         at org.apache.maven.surefire.booter.SurefireBooter.main(SurefireBooter.java:818)
  Caused by: org.osoa.sca.ServiceRuntimeException: Provided Intent -
  {http://tuscany.apache.org/xmlns/sca/1.0}wsAuthentication not found
  for PolicySet {http://tuscany.apache.org/xmlns/sca/1.0}wsClientAuthenticationPolicy
         at org.apache.tuscany.sca.host.embedded.impl.DefaultSCADomain.analyseProblems(DefaultSCADomain.java:309)
         at org.apache.tuscany.sca.host.embedded.impl.DefaultSCADomain.addContribution(DefaultSCADomain.java:334)
         at org.apache.tuscany.sca.host.embedded.impl.DefaultSCADomain.init(DefaultSCADomain.java:183)
         at org.apache.tuscany.sca.host.embedded.impl.DefaultSCADomain.<init>(DefaultSCADomain.java:120)
         at org.apache.tuscany.sca.host.embedded.SCADomain.createNewInstance(SCADomain.java:242)
         ... 20 more

  Running org.apache.tuscany.sca.binding.ws.axis2.itests.QuestionMarkWSDLTestCase
  >>>Initializing WSPolicyProcessor
  2-ago-2008 23.55.10 org.apache.tuscany.sca.assembly.xml.CompositeProcessor
  AVVERTENZA: No namespace found: Composite = HelloWorld
  2-ago-2008 23.55.10 org.apache.tuscany.sca.assembly.xml.CompositeProcessor
  AVVERTENZA: No namespace found: Composite = HelloWorldNoWSDL
  2-ago-2008 23.55.10 org.apache.tuscany.sca.assembly.xml.CompositeProcessor
  AVVERTENZA: No namespace found: Composite = endpoint1
  2-ago-2008 23.55.10 org.apache.tuscany.sca.assembly.xml.CompositeProcessor
  AVVERTENZA: No namespace found: Composite = endpoint1
  2-ago-2008 23.55.10 org.apache.tuscany.sca.assembly.xml.CompositeProcessor
  AVVERTENZA: No namespace found: Composite = endpoint3
  2-ago-2008 23.55.10 org.apache.tuscany.sca.assembly.xml.CompositeProcessor
  AVVERTENZA: No namespace found: Composite = endpoint4
  2-ago-2008 23.55.10 org.apache.tuscany.sca.assembly.xml.CompositeProcessor
  AVVERTENZA: No namespace found: Composite = HelloWorld
  2-ago-2008 23.55.10 org.apache.tuscany.sca.assembly.xml.CompositeProcessor
  AVVERTENZA: No namespace found: Composite = HelloWorldOM-Merged
  2-ago-2008 23.55.10 org.apache.tuscany.sca.assembly.xml.CompositeProcessor
  AVVERTENZA: No namespace found: Composite = HelloWorldOM
  2-ago-2008 23.55.10 org.apache.tuscany.sca.assembly.xml.CompositeProcessor
  AVVERTENZA: No namespace found: Composite = HelloWorldPrec
  2-ago-2008 23.55.10 org.apache.tuscany.sca.assembly.xml.CompositeProcessor
  AVVERTENZA: No namespace found: Composite = endpoint3
  2-ago-2008 23.55.10 org.apache.tuscany.sca.assembly.xml.CompositeProcessor
  AVVERTENZA: No namespace found: Composite = endpoint3
  2-ago-2008 23.55.10 org.apache.tuscany.sca.assembly.xml.CompositeProcessor
  AVVERTENZA: No namespace found: Composite = endpoint3
  2-ago-2008 23.55.10 org.apache.tuscany.sca.assembly.xml.CompositeProcessor
  AVVERTENZA: No namespace found: Composite = endpoint3
  2-ago-2008 23.55.10 org.apache.tuscany.sca.assembly.xml.CompositeProcessor
  AVVERTENZA: No namespace found: Composite = endpoint3
  2-ago-2008 23.55.10 org.apache.tuscany.sca.assembly.xml.CompositeProcessor
  AVVERTENZA: No namespace found: Composite = endpoint3
  2-ago-2008 23.55.10 org.apache.tuscany.sca.assembly.xml.CompositeProcessor
  AVVERTENZA: No namespace found: Composite = endpoint3
  2-ago-2008 23.55.10 org.apache.tuscany.sca.assembly.xml.CompositeProcessor
  AVVERTENZA: No namespace found: Composite = QuestionMarkWSDLImport
  2-ago-2008 23.55.10 org.apache.tuscany.sca.assembly.xml.CompositeProcessor
  AVVERTENZA: No namespace found: Composite = QuestionMarkWSDLInclude
  2-ago-2008 23.55.10 org.apache.tuscany.sca.assembly.xml.CompositeProcessor
  AVVERTENZA: No namespace found: Composite = QuestionMarkWSDLTests
  2-ago-2008 23.55.10 org.apache.tuscany.sca.assembly.xml.CompositeProcessor
  AVVERTENZA: No namespace found: Composite = HelloWorld
  2-ago-2008 23.55.10 org.apache.tuscany.sca.assembly.xml.CompositeProcessor
  AVVERTENZA: No namespace found: Composite = QuestionMarkWSDLTests
  2-ago-2008 23.55.10 org.apache.tuscany.sca.policy.xml.PolicySetProcessor
  GRAVE: Provided Intent -
  {http://tuscany.apache.org/xmlns/sca/1.0}wsAuthentication not found
  for PolicySet {http://tuscany.apache.org/xmlns/sca/1.0}wsClientAuthenticationPolicy
  >>>Initializing WSPolicyProcessor
  2-ago-2008 23.55.11 org.apache.tuscany.sca.assembly.xml.CompositeProcessor
  AVVERTENZA: No namespace found: Composite = HelloWorld
  2-ago-2008 23.55.11 org.apache.tuscany.sca.assembly.xml.CompositeProcessor
  AVVERTENZA: No namespace found: Composite = HelloWorldNoWSDL
  2-ago-2008 23.55.11 org.apache.tuscany.sca.assembly.xml.CompositeProcessor
  AVVERTENZA: No namespace found: Composite = endpoint1
  2-ago-2008 23.55.11 org.apache.tuscany.sca.assembly.xml.CompositeProcessor
  AVVERTENZA: No namespace found: Composite = endpoint1
  2-ago-2008 23.55.11 org.apache.tuscany.sca.assembly.xml.CompositeProcessor
  AVVERTENZA: No namespace found: Composite = endpoint3
  2-ago-2008 23.55.11 org.apache.tuscany.sca.assembly.xml.CompositeProcessor
  AVVERTENZA: No namespace found: Composite = endpoint4
  2-ago-2008 23.55.11 org.apache.tuscany.sca.assembly.xml.CompositeProcessor
  AVVERTENZA: No namespace found: Composite = HelloWorld
  2-ago-2008 23.55.11 org.apache.tuscany.sca.assembly.xml.CompositeProcessor
  AVVERTENZA: No namespace found: Composite = HelloWorldOM-Merged
  2-ago-2008 23.55.11 org.apache.tuscany.sca.assembly.xml.CompositeProcessor
  AVVERTENZA: No namespace found: Composite = HelloWorldOM
  2-ago-2008 23.55.11 org.apache.tuscany.sca.assembly.xml.CompositeProcessor
  AVVERTENZA: No namespace found: Composite = HelloWorldPrec
  2-ago-2008 23.55.11 org.apache.tuscany.sca.assembly.xml.CompositeProcessor
  AVVERTENZA: No namespace found: Composite = endpoint3
  2-ago-2008 23.55.11 org.apache.tuscany.sca.assembly.xml.CompositeProcessor
  AVVERTENZA: No namespace found: Composite = endpoint3
  2-ago-2008 23.55.11 org.apache.tuscany.sca.assembly.xml.CompositeProcessor
  AVVERTENZA: No namespace found: Composite = endpoint3
  2-ago-2008 23.55.11 org.apache.tuscany.sca.assembly.xml.CompositeProcessor
  AVVERTENZA: No namespace found: Composite = endpoint3
  2-ago-2008 23.55.11 org.apache.tuscany.sca.assembly.xml.CompositeProcessor
  AVVERTENZA: No namespace found: Composite = endpoint3
  2-ago-2008 23.55.11 org.apache.tuscany.sca.assembly.xml.CompositeProcessor
  AVVERTENZA: No namespace found: Composite = endpoint3
  2-ago-2008 23.55.11 org.apache.tuscany.sca.assembly.xml.CompositeProcessor
  AVVERTENZA: No namespace found: Composite = endpoint3
  2-ago-2008 23.55.11 org.apache.tuscany.sca.assembly.xml.CompositeProcessor
  AVVERTENZA: No namespace found: Composite = QuestionMarkWSDLImport
  2-ago-2008 23.55.11 org.apache.tuscany.sca.assembly.xml.CompositeProcessor
  AVVERTENZA: No namespace found: Composite = QuestionMarkWSDLInclude
  2-ago-2008 23.55.12 org.apache.tuscany.sca.assembly.xml.CompositeProcessor
  AVVERTENZA: No namespace found: Composite = QuestionMarkWSDLTests
  2-ago-2008 23.55.12 org.apache.tuscany.sca.assembly.xml.CompositeProcessor
  AVVERTENZA: No namespace found: Composite = HelloWorld
  2-ago-2008 23.55.12 org.apache.tuscany.sca.assembly.xml.CompositeProcessor
  AVVERTENZA: No namespace found: Composite = QuestionMarkWSDLTests
  2-ago-2008 23.55.12 org.apache.tuscany.sca.policy.xml.PolicySetProcessor
  GRAVE: Provided Intent -
  {http://tuscany.apache.org/xmlns/sca/1.0}wsAuthentication not found
  for PolicySet {http://tuscany.apache.org/xmlns/sca/1.0}wsClientAuthenticationPolicy
  Tests run: 2, Failures: 0, Errors: 2, Skipped: 0, Time elapsed: 2.407
  sec <<< FAILURE!
  testWSDLPortEndpoint(org.apache.tuscany.sca.binding.ws.axis2.itests.QuestionMarkWSDLTestCase)
   Time elapsed: 1.22 sec  <<< ERROR!
  org.osoa.sca.ServiceRuntimeException:
  org.osoa.sca.ServiceRuntimeException: Provided Intent -
  {http://tuscany.apache.org/xmlns/sca/1.0}wsAuthentication not found
  for PolicySet {http://tuscany.apache.org/xmlns/sca/1.0}wsClientAuthenticationPolicy
         at org.apache.tuscany.sca.host.embedded.SCADomain.createNewInstance(SCADomain.java:276)
         at org.apache.tuscany.sca.host.embedded.SCADomain.newInstance(SCADomain.java:70)
         at org.apache.tuscany.sca.binding.ws.axis2.itests.QuestionMarkWSDLTestCase.setUp(QuestionMarkWSDLTestCase.java:116)
         at junit.framework.TestCase.runBare(TestCase.java:132)
         at junit.framework.TestResult$1.protect(TestResult.java:110)
         at junit.framework.TestResult.runProtected(TestResult.java:128)
         at junit.framework.TestResult.run(TestResult.java:113)
         at junit.framework.TestCase.run(TestCase.java:124)
         at junit.framework.TestSuite.runTest(TestSuite.java:232)
         at junit.framework.TestSuite.run(TestSuite.java:227)
         at org.junit.internal.runners.OldTestClassRunner.run(OldTestClassRunner.java:35)
         at org.apache.maven.surefire.junit4.JUnit4TestSet.execute(JUnit4TestSet.java:62)
         at org.apache.maven.surefire.suite.AbstractDirectoryTestSuite.executeTestSet(AbstractDirectoryTestSuite.java:138)
         at org.apache.maven.surefire.suite.AbstractDirectoryTestSuite.execute(AbstractDirectoryTestSuite.java:125)
         at org.apache.maven.surefire.Surefire.run(Surefire.java:132)
         at sun.reflect.NativeMethodAccessorImpl.invoke0(Native Method)
         at sun.reflect.NativeMethodAccessorImpl.invoke(NativeMethodAccessorImpl.java:39)
         at sun.reflect.DelegatingMethodAccessorImpl.invoke(DelegatingMethodAccessorImpl.java:25)
         at java.lang.reflect.Method.invoke(Method.java:585)
         at org.apache.maven.surefire.booter.SurefireBooter.runSuitesInProcess(SurefireBooter.java:290)
         at org.apache.maven.surefire.booter.SurefireBooter.main(SurefireBooter.java:818)
  Caused by: org.osoa.sca.ServiceRuntimeException: Provided Intent -
  {http://tuscany.apache.org/xmlns/sca/1.0}wsAuthentication not found
  for PolicySet {http://tuscany.apache.org/xmlns/sca/1.0}wsClientAuthenticationPolicy
         at org.apache.tuscany.sca.host.embedded.impl.DefaultSCADomain.analyseProblems(DefaultSCADomain.java:309)
         at org.apache.tuscany.sca.host.embedded.impl.DefaultSCADomain.addContribution(DefaultSCADomain.java:334)
         at org.apache.tuscany.sca.host.embedded.impl.DefaultSCADomain.init(DefaultSCADomain.java:183)
         at org.apache.tuscany.sca.host.embedded.impl.DefaultSCADomain.<init>(DefaultSCADomain.java:120)
         at org.apache.tuscany.sca.host.embedded.SCADomain.createNewInstance(SCADomain.java:242)
         ... 20 more

  testCustomEndpoint(org.apache.tuscany.sca.binding.ws.axis2.itests.QuestionMarkWSDLTestCase)
   Time elapsed: 1.18 sec  <<< ERROR!
  org.osoa.sca.ServiceRuntimeException:
  org.osoa.sca.ServiceRuntimeException: Provided Intent -
  {http://tuscany.apache.org/xmlns/sca/1.0}wsAuthentication not found
  for PolicySet {http://tuscany.apache.org/xmlns/sca/1.0}wsClientAuthenticationPolicy
         at org.apache.tuscany.sca.host.embedded.SCADomain.createNewInstance(SCADomain.java:276)
         at org.apache.tuscany.sca.host.embedded.SCADomain.newInstance(SCADomain.java:70)
         at org.apache.tuscany.sca.binding.ws.axis2.itests.QuestionMarkWSDLTestCase.setUp(QuestionMarkWSDLTestCase.java:116)
         at junit.framework.TestCase.runBare(TestCase.java:132)
         at junit.framework.TestResult$1.protect(TestResult.java:110)
         at junit.framework.TestResult.runProtected(TestResult.java:128)
         at junit.framework.TestResult.run(TestResult.java:113)
         at junit.framework.TestCase.run(TestCase.java:124)
         at junit.framework.TestSuite.runTest(TestSuite.java:232)
         at junit.framework.TestSuite.run(TestSuite.java:227)
         at org.junit.internal.runners.OldTestClassRunner.run(OldTestClassRunner.java:35)
         at org.apache.maven.surefire.junit4.JUnit4TestSet.execute(JUnit4TestSet.java:62)
         at org.apache.maven.surefire.suite.AbstractDirectoryTestSuite.executeTestSet(AbstractDirectoryTestSuite.java:138)
         at org.apache.maven.surefire.suite.AbstractDirectoryTestSuite.execute(AbstractDirectoryTestSuite.java:125)
         at org.apache.maven.surefire.Surefire.run(Surefire.java:132)
         at sun.reflect.NativeMethodAccessorImpl.invoke0(Native Method)
         at sun.reflect.NativeMethodAccessorImpl.invoke(NativeMethodAccessorImpl.java:39)
         at sun.reflect.DelegatingMethodAccessorImpl.invoke(DelegatingMethodAccessorImpl.java:25)
         at java.lang.reflect.Method.invoke(Method.java:585)
         at org.apache.maven.surefire.booter.SurefireBooter.runSuitesInProcess(SurefireBooter.java:290)
         at org.apache.maven.surefire.booter.SurefireBooter.main(SurefireBooter.java:818)
  Caused by: org.osoa.sca.ServiceRuntimeException: Provided Intent -
  {http://tuscany.apache.org/xmlns/sca/1.0}wsAuthentication not found
  for PolicySet {http://tuscany.apache.org/xmlns/sca/1.0}wsClientAuthenticationPolicy
         at org.apache.tuscany.sca.host.embedded.impl.DefaultSCADomain.analyseProblems(DefaultSCADomain.java:309)
         at org.apache.tuscany.sca.host.embedded.impl.DefaultSCADomain.addContribution(DefaultSCADomain.java:334)
         at org.apache.tuscany.sca.host.embedded.impl.DefaultSCADomain.init(DefaultSCADomain.java:183)
         at org.apache.tuscany.sca.host.embedded.impl.DefaultSCADomain.<init>(DefaultSCADomain.java:120)
         at org.apache.tuscany.sca.host.embedded.SCADomain.createNewInstance(SCADomain.java:242)
         ... 20 more

  Running org.apache.tuscany.sca.binding.ws.axis2.itests.policy.wspolicy.WSSecurityAuthenticationTestCase
  >>>Initializing WSPolicyProcessor
  2-ago-2008 23.55.12 org.apache.tuscany.sca.assembly.xml.CompositeProcessor
  AVVERTENZA: No namespace found: Composite = HelloWorld
  2-ago-2008 23.55.12 org.apache.tuscany.sca.assembly.xml.CompositeProcessor
  AVVERTENZA: No namespace found: Composite = HelloWorldNoWSDL
  2-ago-2008 23.55.12 org.apache.tuscany.sca.assembly.xml.CompositeProcessor
  AVVERTENZA: No namespace found: Composite = endpoint1
  2-ago-2008 23.55.12 org.apache.tuscany.sca.assembly.xml.CompositeProcessor
  AVVERTENZA: No namespace found: Composite = endpoint1
  2-ago-2008 23.55.12 org.apache.tuscany.sca.assembly.xml.CompositeProcessor
  AVVERTENZA: No namespace found: Composite = endpoint3
  2-ago-2008 23.55.12 org.apache.tuscany.sca.assembly.xml.CompositeProcessor
  AVVERTENZA: No namespace found: Composite = endpoint4
  2-ago-2008 23.55.12 org.apache.tuscany.sca.assembly.xml.CompositeProcessor
  AVVERTENZA: No namespace found: Composite = HelloWorld
  2-ago-2008 23.55.12 org.apache.tuscany.sca.assembly.xml.CompositeProcessor
  AVVERTENZA: No namespace found: Composite = HelloWorldOM-Merged
  2-ago-2008 23.55.12 org.apache.tuscany.sca.assembly.xml.CompositeProcessor
  AVVERTENZA: No namespace found: Composite = HelloWorldOM
  2-ago-2008 23.55.12 org.apache.tuscany.sca.assembly.xml.CompositeProcessor
  AVVERTENZA: No namespace found: Composite = HelloWorldPrec
  2-ago-2008 23.55.12 org.apache.tuscany.sca.assembly.xml.CompositeProcessor
  AVVERTENZA: No namespace found: Composite = endpoint3
  2-ago-2008 23.55.12 org.apache.tuscany.sca.assembly.xml.CompositeProcessor
  AVVERTENZA: No namespace found: Composite = endpoint3
  2-ago-2008 23.55.12 org.apache.tuscany.sca.assembly.xml.CompositeProcessor
  AVVERTENZA: No namespace found: Composite = endpoint3
  2-ago-2008 23.55.13 org.apache.tuscany.sca.assembly.xml.CompositeProcessor
  AVVERTENZA: No namespace found: Composite = endpoint3
  2-ago-2008 23.55.13 org.apache.tuscany.sca.assembly.xml.CompositeProcessor
  AVVERTENZA: No namespace found: Composite = endpoint3
  2-ago-2008 23.55.13 org.apache.tuscany.sca.assembly.xml.CompositeProcessor
  AVVERTENZA: No namespace found: Composite = endpoint3
  2-ago-2008 23.55.13 org.apache.tuscany.sca.assembly.xml.CompositeProcessor
  AVVERTENZA: No namespace found: Composite = endpoint3
  2-ago-2008 23.55.13 org.apache.tuscany.sca.assembly.xml.CompositeProcessor
  AVVERTENZA: No namespace found: Composite = QuestionMarkWSDLImport
  2-ago-2008 23.55.13 org.apache.tuscany.sca.assembly.xml.CompositeProcessor
  AVVERTENZA: No namespace found: Composite = QuestionMarkWSDLInclude
  2-ago-2008 23.55.13 org.apache.tuscany.sca.assembly.xml.CompositeProcessor
  AVVERTENZA: No namespace found: Composite = QuestionMarkWSDLTests
  2-ago-2008 23.55.13 org.apache.tuscany.sca.assembly.xml.CompositeProcessor
  AVVERTENZA: No namespace found: Composite = HelloWorld
  2-ago-2008 23.55.13 org.apache.tuscany.sca.assembly.xml.CompositeProcessor
  AVVERTENZA: No namespace found: Composite = QuestionMarkWSDLTests
  2-ago-2008 23.55.13 org.apache.tuscany.sca.policy.xml.PolicySetProcessor
  GRAVE: Provided Intent -
  {http://tuscany.apache.org/xmlns/sca/1.0}wsAuthentication not found
  for PolicySet {http://tuscany.apache.org/xmlns/sca/1.0}wsClientAuthenticationPolicy
  Tests run: 1, Failures: 0, Errors: 1, Skipped: 0, Time elapsed: 1.303
  sec <<< FAILURE!
  testHelloWorld(org.apache.tuscany.sca.binding.ws.axis2.itests.policy.wspolicy.WSSecurityAuthenticationTestCase)
   Time elapsed: 1.296 sec  <<< ERROR!
  org.osoa.sca.ServiceRuntimeException:
  org.osoa.sca.ServiceRuntimeException: Provided Intent -
  {http://tuscany.apache.org/xmlns/sca/1.0}wsAuthentication not found
  for PolicySet {http://tuscany.apache.org/xmlns/sca/1.0}wsClientAuthenticationPolicy
         at org.apache.tuscany.sca.host.embedded.SCADomain.createNewInstance(SCADomain.java:276)
         at org.apache.tuscany.sca.host.embedded.SCADomain.newInstance(SCADomain.java:70)
         at org.apache.tuscany.sca.binding.ws.axis2.itests.policy.wspolicy.AbstractHelloWorldOMTestCase.setUp(AbstractHelloWorldOMTestCase.java:50)
         at junit.framework.TestCase.runBare(TestCase.java:132)
         at junit.framework.TestResult$1.protect(TestResult.java:110)
         at junit.framework.TestResult.runProtected(TestResult.java:128)
         at junit.framework.TestResult.run(TestResult.java:113)
         at junit.framework.TestCase.run(TestCase.java:124)
         at junit.framework.TestSuite.runTest(TestSuite.java:232)
         at junit.framework.TestSuite.run(TestSuite.java:227)
         at org.junit.internal.runners.OldTestClassRunner.run(OldTestClassRunner.java:35)
         at org.apache.maven.surefire.junit4.JUnit4TestSet.execute(JUnit4TestSet.java:62)
         at org.apache.maven.surefire.suite.AbstractDirectoryTestSuite.executeTestSet(AbstractDirectoryTestSuite.java:138)
         at org.apache.maven.surefire.suite.AbstractDirectoryTestSuite.execute(AbstractDirectoryTestSuite.java:125)
         at org.apache.maven.surefire.Surefire.run(Surefire.java:132)
         at sun.reflect.NativeMethodAccessorImpl.invoke0(Native Method)
         at sun.reflect.NativeMethodAccessorImpl.invoke(NativeMethodAccessorImpl.java:39)
         at sun.reflect.DelegatingMethodAccessorImpl.invoke(DelegatingMethodAccessorImpl.java:25)
         at java.lang.reflect.Method.invoke(Method.java:585)
         at org.apache.maven.surefire.booter.SurefireBooter.runSuitesInProcess(SurefireBooter.java:290)
         at org.apache.maven.surefire.booter.SurefireBooter.main(SurefireBooter.java:818)
  Caused by: org.osoa.sca.ServiceRuntimeException: Provided Intent -
  {http://tuscany.apache.org/xmlns/sca/1.0}wsAuthentication not found
  for PolicySet {http://tuscany.apache.org/xmlns/sca/1.0}wsClientAuthenticationPolicy
         at org.apache.tuscany.sca.host.embedded.impl.DefaultSCADomain.analyseProblems(DefaultSCADomain.java:309)
         at org.apache.tuscany.sca.host.embedded.impl.DefaultSCADomain.addContribution(DefaultSCADomain.java:334)
         at org.apache.tuscany.sca.host.embedded.impl.DefaultSCADomain.init(DefaultSCADomain.java:183)
         at org.apache.tuscany.sca.host.embedded.impl.DefaultSCADomain.<init>(DefaultSCADomain.java:120)
         at org.apache.tuscany.sca.host.embedded.SCADomain.createNewInstance(SCADomain.java:242)
         ... 20 more

  Running org.apache.tuscany.sca.binding.ws.axis2.itests.soap12.HelloWorldSOAP12TestCase
  >>>Initializing WSPolicyProcessor
  2-ago-2008 23.55.13 org.apache.tuscany.sca.assembly.xml.CompositeProcessor
  AVVERTENZA: No namespace found: Composite = HelloWorld
  2-ago-2008 23.55.13 org.apache.tuscany.sca.assembly.xml.CompositeProcessor
  AVVERTENZA: No namespace found: Composite = HelloWorldNoWSDL
  2-ago-2008 23.55.13 org.apache.tuscany.sca.assembly.xml.CompositeProcessor
  AVVERTENZA: No namespace found: Composite = endpoint1
  2-ago-2008 23.55.13 org.apache.tuscany.sca.assembly.xml.CompositeProcessor
  AVVERTENZA: No namespace found: Composite = endpoint1
  2-ago-2008 23.55.13 org.apache.tuscany.sca.assembly.xml.CompositeProcessor
  AVVERTENZA: No namespace found: Composite = endpoint3
  2-ago-2008 23.55.13 org.apache.tuscany.sca.assembly.xml.CompositeProcessor
  AVVERTENZA: No namespace found: Composite = endpoint4
  2-ago-2008 23.55.13 org.apache.tuscany.sca.assembly.xml.CompositeProcessor
  AVVERTENZA: No namespace found: Composite = HelloWorld
  2-ago-2008 23.55.13 org.apache.tuscany.sca.assembly.xml.CompositeProcessor
  AVVERTENZA: No namespace found: Composite = HelloWorldOM-Merged
  2-ago-2008 23.55.13 org.apache.tuscany.sca.assembly.xml.CompositeProcessor
  AVVERTENZA: No namespace found: Composite = HelloWorldOM
  2-ago-2008 23.55.14 org.apache.tuscany.sca.assembly.xml.CompositeProcessor
  AVVERTENZA: No namespace found: Composite = HelloWorldPrec
  2-ago-2008 23.55.14 org.apache.tuscany.sca.assembly.xml.CompositeProcessor
  AVVERTENZA: No namespace found: Composite = endpoint3
  2-ago-2008 23.55.14 org.apache.tuscany.sca.assembly.xml.CompositeProcessor
  AVVERTENZA: No namespace found: Composite = endpoint3
  2-ago-2008 23.55.14 org.apache.tuscany.sca.assembly.xml.CompositeProcessor
  AVVERTENZA: No namespace found: Composite = endpoint3
  2-ago-2008 23.55.14 org.apache.tuscany.sca.assembly.xml.CompositeProcessor
  AVVERTENZA: No namespace found: Composite = endpoint3
  2-ago-2008 23.55.14 org.apache.tuscany.sca.assembly.xml.CompositeProcessor
  AVVERTENZA: No namespace found: Composite = endpoint3
  2-ago-2008 23.55.14 org.apache.tuscany.sca.assembly.xml.CompositeProcessor
  AVVERTENZA: No namespace found: Composite = endpoint3
  2-ago-2008 23.55.14 org.apache.tuscany.sca.assembly.xml.CompositeProcessor
  AVVERTENZA: No namespace found: Composite = endpoint3
  2-ago-2008 23.55.14 org.apache.tuscany.sca.assembly.xml.CompositeProcessor
  AVVERTENZA: No namespace found: Composite = QuestionMarkWSDLImport
  2-ago-2008 23.55.14 org.apache.tuscany.sca.assembly.xml.CompositeProcessor
  AVVERTENZA: No namespace found: Composite = QuestionMarkWSDLInclude
  2-ago-2008 23.55.14 org.apache.tuscany.sca.assembly.xml.CompositeProcessor
  AVVERTENZA: No namespace found: Composite = QuestionMarkWSDLTests
  2-ago-2008 23.55.14 org.apache.tuscany.sca.assembly.xml.CompositeProcessor
  AVVERTENZA: No namespace found: Composite = HelloWorld
  2-ago-2008 23.55.14 org.apache.tuscany.sca.assembly.xml.CompositeProcessor
  AVVERTENZA: No namespace found: Composite = QuestionMarkWSDLTests
  2-ago-2008 23.55.14 org.apache.tuscany.sca.policy.xml.PolicySetProcessor
  GRAVE: Provided Intent -
  {http://tuscany.apache.org/xmlns/sca/1.0}wsAuthentication not found
  for PolicySet {http://tuscany.apache.org/xmlns/sca/1.0}wsClientAuthenticationPolicy
  >>>Initializing WSPolicyProcessor
  2-ago-2008 23.55.15 org.apache.tuscany.sca.assembly.xml.CompositeProcessor
  AVVERTENZA: No namespace found: Composite = HelloWorld
  2-ago-2008 23.55.15 org.apache.tuscany.sca.assembly.xml.CompositeProcessor
  AVVERTENZA: No namespace found: Composite = HelloWorldNoWSDL
  2-ago-2008 23.55.15 org.apache.tuscany.sca.assembly.xml.CompositeProcessor
  AVVERTENZA: No namespace found: Composite = endpoint1
  2-ago-2008 23.55.15 org.apache.tuscany.sca.assembly.xml.CompositeProcessor
  AVVERTENZA: No namespace found: Composite = endpoint1
  2-ago-2008 23.55.15 org.apache.tuscany.sca.assembly.xml.CompositeProcessor
  AVVERTENZA: No namespace found: Composite = endpoint3
  2-ago-2008 23.55.15 org.apache.tuscany.sca.assembly.xml.CompositeProcessor
  AVVERTENZA: No namespace found: Composite = endpoint4
  2-ago-2008 23.55.15 org.apache.tuscany.sca.assembly.xml.CompositeProcessor
  AVVERTENZA: No namespace found: Composite = HelloWorld
  2-ago-2008 23.55.15 org.apache.tuscany.sca.assembly.xml.CompositeProcessor
  AVVERTENZA: No namespace found: Composite = HelloWorldOM-Merged
  2-ago-2008 23.55.15 org.apache.tuscany.sca.assembly.xml.CompositeProcessor
  AVVERTENZA: No namespace found: Composite = HelloWorldOM
  2-ago-2008 23.55.15 org.apache.tuscany.sca.assembly.xml.CompositeProcessor
  AVVERTENZA: No namespace found: Composite = HelloWorldPrec
  2-ago-2008 23.55.15 org.apache.tuscany.sca.assembly.xml.CompositeProcessor
  AVVERTENZA: No namespace found: Composite = endpoint3
  2-ago-2008 23.55.15 org.apache.tuscany.sca.assembly.xml.CompositeProcessor
  AVVERTENZA: No namespace found: Composite = endpoint3
  2-ago-2008 23.55.15 org.apache.tuscany.sca.assembly.xml.CompositeProcessor
  AVVERTENZA: No namespace found: Composite = endpoint3
  2-ago-2008 23.55.15 org.apache.tuscany.sca.assembly.xml.CompositeProcessor
  AVVERTENZA: No namespace found: Composite = endpoint3
  2-ago-2008 23.55.15 org.apache.tuscany.sca.assembly.xml.CompositeProcessor
  AVVERTENZA: No namespace found: Composite = endpoint3
  2-ago-2008 23.55.15 org.apache.tuscany.sca.assembly.xml.CompositeProcessor
  AVVERTENZA: No namespace found: Composite = endpoint3
  2-ago-2008 23.55.15 org.apache.tuscany.sca.assembly.xml.CompositeProcessor
  AVVERTENZA: No namespace found: Composite = endpoint3
  2-ago-2008 23.55.15 org.apache.tuscany.sca.assembly.xml.CompositeProcessor
  AVVERTENZA: No namespace found: Composite = QuestionMarkWSDLImport
  2-ago-2008 23.55.15 org.apache.tuscany.sca.assembly.xml.CompositeProcessor
  AVVERTENZA: No namespace found: Composite = QuestionMarkWSDLInclude
  2-ago-2008 23.55.15 org.apache.tuscany.sca.assembly.xml.CompositeProcessor
  AVVERTENZA: No namespace found: Composite = QuestionMarkWSDLTests
  2-ago-2008 23.55.15 org.apache.tuscany.sca.assembly.xml.CompositeProcessor
  AVVERTENZA: No namespace found: Composite = HelloWorld
  2-ago-2008 23.55.15 org.apache.tuscany.sca.assembly.xml.CompositeProcessor
  AVVERTENZA: No namespace found: Composite = QuestionMarkWSDLTests
  2-ago-2008 23.55.15 org.apache.tuscany.sca.policy.xml.PolicySetProcessor
  GRAVE: Provided Intent -
  {http://tuscany.apache.org/xmlns/sca/1.0}wsAuthentication not found
  for PolicySet {http://tuscany.apache.org/xmlns/sca/1.0}wsClientAuthenticationPolicy
  >>>Initializing WSPolicyProcessor
  2-ago-2008 23.55.16 org.apache.tuscany.sca.assembly.xml.CompositeProcessor
  AVVERTENZA: No namespace found: Composite = HelloWorld
  2-ago-2008 23.55.16 org.apache.tuscany.sca.assembly.xml.CompositeProcessor
  AVVERTENZA: No namespace found: Composite = HelloWorldNoWSDL
  2-ago-2008 23.55.16 org.apache.tuscany.sca.assembly.xml.CompositeProcessor
  AVVERTENZA: No namespace found: Composite = endpoint1
  2-ago-2008 23.55.16 org.apache.tuscany.sca.assembly.xml.CompositeProcessor
  AVVERTENZA: No namespace found: Composite = endpoint1
  2-ago-2008 23.55.16 org.apache.tuscany.sca.assembly.xml.CompositeProcessor
  AVVERTENZA: No namespace found: Composite = endpoint3
  2-ago-2008 23.55.16 org.apache.tuscany.sca.assembly.xml.CompositeProcessor
  AVVERTENZA: No namespace found: Composite = endpoint4
  2-ago-2008 23.55.16 org.apache.tuscany.sca.assembly.xml.CompositeProcessor
  AVVERTENZA: No namespace found: Composite = HelloWorld
  2-ago-2008 23.55.16 org.apache.tuscany.sca.assembly.xml.CompositeProcessor
  AVVERTENZA: No namespace found: Composite = HelloWorldOM-Merged
  2-ago-2008 23.55.16 org.apache.tuscany.sca.assembly.xml.CompositeProcessor
  AVVERTENZA: No namespace found: Composite = HelloWorldOM
  2-ago-2008 23.55.16 org.apache.tuscany.sca.assembly.xml.CompositeProcessor
  AVVERTENZA: No namespace found: Composite = HelloWorldPrec
  2-ago-2008 23.55.16 org.apache.tuscany.sca.assembly.xml.CompositeProcessor
  AVVERTENZA: No namespace found: Composite = endpoint3
  2-ago-2008 23.55.16 org.apache.tuscany.sca.assembly.xml.CompositeProcessor
  AVVERTENZA: No namespace found: Composite = endpoint3
  2-ago-2008 23.55.16 org.apache.tuscany.sca.assembly.xml.CompositeProcessor
  AVVERTENZA: No namespace found: Composite = endpoint3
  2-ago-2008 23.55.16 org.apache.tuscany.sca.assembly.xml.CompositeProcessor
  AVVERTENZA: No namespace found: Composite = endpoint3
  2-ago-2008 23.55.16 org.apache.tuscany.sca.assembly.xml.CompositeProcessor
  AVVERTENZA: No namespace found: Composite = endpoint3
  2-ago-2008 23.55.16 org.apache.tuscany.sca.assembly.xml.CompositeProcessor
  AVVERTENZA: No namespace found: Composite = endpoint3
  2-ago-2008 23.55.16 org.apache.tuscany.sca.assembly.xml.CompositeProcessor
  AVVERTENZA: No namespace found: Composite = endpoint3
  2-ago-2008 23.55.16 org.apache.tuscany.sca.assembly.xml.CompositeProcessor
  AVVERTENZA: No namespace found: Composite = QuestionMarkWSDLImport
  2-ago-2008 23.55.16 org.apache.tuscany.sca.assembly.xml.CompositeProcessor
  AVVERTENZA: No namespace found: Composite = QuestionMarkWSDLInclude
  2-ago-2008 23.55.16 org.apache.tuscany.sca.assembly.xml.CompositeProcessor
  AVVERTENZA: No namespace found: Composite = QuestionMarkWSDLTests
  2-ago-2008 23.55.16 org.apache.tuscany.sca.assembly.xml.CompositeProcessor
  AVVERTENZA: No namespace found: Composite = HelloWorld
  2-ago-2008 23.55.17 org.apache.tuscany.sca.assembly.xml.CompositeProcessor
  AVVERTENZA: No namespace found: Composite = QuestionMarkWSDLTests
  2-ago-2008 23.55.17 org.apache.tuscany.sca.policy.xml.PolicySetProcessor
  GRAVE: Provided Intent -
  {http://tuscany.apache.org/xmlns/sca/1.0}wsAuthentication not found
  for PolicySet {http://tuscany.apache.org/xmlns/sca/1.0}wsClientAuthenticationPolicy
  >>>Initializing WSPolicyProcessor
  2-ago-2008 23.55.17 org.apache.tuscany.sca.assembly.xml.CompositeProcessor
  AVVERTENZA: No namespace found: Composite = HelloWorld
  2-ago-2008 23.55.17 org.apache.tuscany.sca.assembly.xml.CompositeProcessor
  AVVERTENZA: No namespace found: Composite = HelloWorldNoWSDL
  2-ago-2008 23.55.17 org.apache.tuscany.sca.assembly.xml.CompositeProcessor
  AVVERTENZA: No namespace found: Composite = endpoint1
  2-ago-2008 23.55.17 org.apache.tuscany.sca.assembly.xml.CompositeProcessor
  AVVERTENZA: No namespace found: Composite = endpoint1
  2-ago-2008 23.55.17 org.apache.tuscany.sca.assembly.xml.CompositeProcessor
  AVVERTENZA: No namespace found: Composite = endpoint3
  2-ago-2008 23.55.17 org.apache.tuscany.sca.assembly.xml.CompositeProcessor
  AVVERTENZA: No namespace found: Composite = endpoint4
  2-ago-2008 23.55.17 org.apache.tuscany.sca.assembly.xml.CompositeProcessor
  AVVERTENZA: No namespace found: Composite = HelloWorld
  2-ago-2008 23.55.17 org.apache.tuscany.sca.assembly.xml.CompositeProcessor
  AVVERTENZA: No namespace found: Composite = HelloWorldOM-Merged
  2-ago-2008 23.55.17 org.apache.tuscany.sca.assembly.xml.CompositeProcessor
  AVVERTENZA: No namespace found: Composite = HelloWorldOM
  2-ago-2008 23.55.17 org.apache.tuscany.sca.assembly.xml.CompositeProcessor
  AVVERTENZA: No namespace found: Composite = HelloWorldPrec
  2-ago-2008 23.55.17 org.apache.tuscany.sca.assembly.xml.CompositeProcessor
  AVVERTENZA: No namespace found: Composite = endpoint3
  2-ago-2008 23.55.17 org.apache.tuscany.sca.assembly.xml.CompositeProcessor
  AVVERTENZA: No namespace found: Composite = endpoint3
  2-ago-2008 23.55.17 org.apache.tuscany.sca.assembly.xml.CompositeProcessor
  AVVERTENZA: No namespace found: Composite = endpoint3
  2-ago-2008 23.55.17 org.apache.tuscany.sca.assembly.xml.CompositeProcessor
  AVVERTENZA: No namespace found: Composite = endpoint3
  2-ago-2008 23.55.18 org.apache.tuscany.sca.assembly.xml.CompositeProcessor
  AVVERTENZA: No namespace found: Composite = endpoint3
  2-ago-2008 23.55.18 org.apache.tuscany.sca.assembly.xml.CompositeProcessor
  AVVERTENZA: No namespace found: Composite = endpoint3
  2-ago-2008 23.55.18 org.apache.tuscany.sca.assembly.xml.CompositeProcessor
  AVVERTENZA: No namespace found: Composite = endpoint3
  2-ago-2008 23.55.18 org.apache.tuscany.sca.assembly.xml.CompositeProcessor
  AVVERTENZA: No namespace found: Composite = QuestionMarkWSDLImport
  2-ago-2008 23.55.18 org.apache.tuscany.sca.assembly.xml.CompositeProcessor
  AVVERTENZA: No namespace found: Composite = QuestionMarkWSDLInclude
  2-ago-2008 23.55.18 org.apache.tuscany.sca.assembly.xml.CompositeProcessor
  AVVERTENZA: No namespace found: Composite = QuestionMarkWSDLTests
  2-ago-2008 23.55.18 org.apache.tuscany.sca.assembly.xml.CompositeProcessor
  AVVERTENZA: No namespace found: Composite = HelloWorld
  2-ago-2008 23.55.18 org.apache.tuscany.sca.assembly.xml.CompositeProcessor
  AVVERTENZA: No namespace found: Composite = QuestionMarkWSDLTests
  2-ago-2008 23.55.18 org.apache.tuscany.sca.policy.xml.PolicySetProcessor
  GRAVE: Provided Intent -
  {http://tuscany.apache.org/xmlns/sca/1.0}wsAuthentication not found
  for PolicySet {http://tuscany.apache.org/xmlns/sca/1.0}wsClientAuthenticationPolicy
  Tests run: 4, Failures: 0, Errors: 4, Skipped: 0, Time elapsed: 4.888
  sec <<< FAILURE!
  testHelloWorld(org.apache.tuscany.sca.binding.ws.axis2.itests.soap12.HelloWorldSOAP12TestCase)
   Time elapsed: 1.214 sec  <<< ERROR!
  org.osoa.sca.ServiceRuntimeException:
  org.osoa.sca.ServiceRuntimeException: Provided Intent -
  {http://tuscany.apache.org/xmlns/sca/1.0}wsAuthentication not found
  for PolicySet {http://tuscany.apache.org/xmlns/sca/1.0}wsClientAuthenticationPolicy
         at org.apache.tuscany.sca.host.embedded.SCADomain.createNewInstance(SCADomain.java:276)
         at org.apache.tuscany.sca.host.embedded.SCADomain.newInstance(SCADomain.java:70)
         at org.apache.tuscany.sca.binding.ws.axis2.itests.soap12.HelloWorldSOAP12TestCase.setUp(HelloWorldSOAP12TestCase.java:50)
         at junit.framework.TestCase.runBare(TestCase.java:132)
         at junit.framework.TestResult$1.protect(TestResult.java:110)
         at junit.framework.TestResult.runProtected(TestResult.java:128)
         at junit.framework.TestResult.run(TestResult.java:113)
         at junit.framework.TestCase.run(TestCase.java:124)
         at junit.framework.TestSuite.runTest(TestSuite.java:232)
         at junit.framework.TestSuite.run(TestSuite.java:227)
         at org.junit.internal.runners.OldTestClassRunner.run(OldTestClassRunner.java:35)
         at org.apache.maven.surefire.junit4.JUnit4TestSet.execute(JUnit4TestSet.java:62)
         at org.apache.maven.surefire.suite.AbstractDirectoryTestSuite.executeTestSet(AbstractDirectoryTestSuite.java:138)
         at org.apache.maven.surefire.suite.AbstractDirectoryTestSuite.execute(AbstractDirectoryTestSuite.java:125)
         at org.apache.maven.surefire.Surefire.run(Surefire.java:132)
         at sun.reflect.NativeMethodAccessorImpl.invoke0(Native Method)
         at sun.reflect.NativeMethodAccessorImpl.invoke(NativeMethodAccessorImpl.java:39)
         at sun.reflect.DelegatingMethodAccessorImpl.invoke(DelegatingMethodAccessorImpl.java:25)
         at java.lang.reflect.Method.invoke(Method.java:585)
         at org.apache.maven.surefire.booter.SurefireBooter.runSuitesInProcess(SurefireBooter.java:290)
         at org.apache.maven.surefire.booter.SurefireBooter.main(SurefireBooter.java:818)
  Caused by: org.osoa.sca.ServiceRuntimeException: Provided Intent -
  {http://tuscany.apache.org/xmlns/sca/1.0}wsAuthentication not found
  for PolicySet {http://tuscany.apache.org/xmlns/sca/1.0}wsClientAuthenticationPolicy
         at org.apache.tuscany.sca.host.embedded.impl.DefaultSCADomain.analyseProblems(DefaultSCADomain.java:309)
         at org.apache.tuscany.sca.host.embedded.impl.DefaultSCADomain.addContribution(DefaultSCADomain.java:334)
         at org.apache.tuscany.sca.host.embedded.impl.DefaultSCADomain.init(DefaultSCADomain.java:183)
         at org.apache.tuscany.sca.host.embedded.impl.DefaultSCADomain.<init>(DefaultSCADomain.java:120)
         at org.apache.tuscany.sca.host.embedded.SCADomain.createNewInstance(SCADomain.java:242)
         ... 20 more

  testHelloWorldSOAP(org.apache.tuscany.sca.binding.ws.axis2.itests.soap12.HelloWorldSOAP12TestCase)
   Time elapsed: 1.208 sec  <<< ERROR!
  org.osoa.sca.ServiceRuntimeException:
  org.osoa.sca.ServiceRuntimeException: Provided Intent -
  {http://tuscany.apache.org/xmlns/sca/1.0}wsAuthentication not found
  for PolicySet {http://tuscany.apache.org/xmlns/sca/1.0}wsClientAuthenticationPolicy
         at org.apache.tuscany.sca.host.embedded.SCADomain.createNewInstance(SCADomain.java:276)
         at org.apache.tuscany.sca.host.embedded.SCADomain.newInstance(SCADomain.java:70)
         at org.apache.tuscany.sca.binding.ws.axis2.itests.soap12.HelloWorldSOAP12TestCase.setUp(HelloWorldSOAP12TestCase.java:50)
         at junit.framework.TestCase.runBare(TestCase.java:132)
         at junit.framework.TestResult$1.protect(TestResult.java:110)
         at junit.framework.TestResult.runProtected(TestResult.java:128)
         at junit.framework.TestResult.run(TestResult.java:113)
         at junit.framework.TestCase.run(TestCase.java:124)
         at junit.framework.TestSuite.runTest(TestSuite.java:232)
         at junit.framework.TestSuite.run(TestSuite.java:227)
         at org.junit.internal.runners.OldTestClassRunner.run(OldTestClassRunner.java:35)
         at org.apache.maven.surefire.junit4.JUnit4TestSet.execute(JUnit4TestSet.java:62)
         at org.apache.maven.surefire.suite.AbstractDirectoryTestSuite.executeTestSet(AbstractDirectoryTestSuite.java:138)
         at org.apache.maven.surefire.suite.AbstractDirectoryTestSuite.execute(AbstractDirectoryTestSuite.java:125)
         at org.apache.maven.surefire.Surefire.run(Surefire.java:132)
         at sun.reflect.NativeMethodAccessorImpl.invoke0(Native Method)
         at sun.reflect.NativeMethodAccessorImpl.invoke(NativeMethodAccessorImpl.java:39)
         at sun.reflect.DelegatingMethodAccessorImpl.invoke(DelegatingMethodAccessorImpl.java:25)
         at java.lang.reflect.Method.invoke(Method.java:585)
         at org.apache.maven.surefire.booter.SurefireBooter.runSuitesInProcess(SurefireBooter.java:290)
         at org.apache.maven.surefire.booter.SurefireBooter.main(SurefireBooter.java:818)
  Caused by: org.osoa.sca.ServiceRuntimeException: Provided Intent -
  {http://tuscany.apache.org/xmlns/sca/1.0}wsAuthentication not found
  for PolicySet {http://tuscany.apache.org/xmlns/sca/1.0}wsClientAuthenticationPolicy
         at org.apache.tuscany.sca.host.embedded.impl.DefaultSCADomain.analyseProblems(DefaultSCADomain.java:309)
         at org.apache.tuscany.sca.host.embedded.impl.DefaultSCADomain.addContribution(DefaultSCADomain.java:334)
         at org.apache.tuscany.sca.host.embedded.impl.DefaultSCADomain.init(DefaultSCADomain.java:183)
         at org.apache.tuscany.sca.host.embedded.impl.DefaultSCADomain.<init>(DefaultSCADomain.java:120)
         at org.apache.tuscany.sca.host.embedded.SCADomain.createNewInstance(SCADomain.java:242)
         ... 20 more

  testHelloWorldSOAP11(org.apache.tuscany.sca.binding.ws.axis2.itests.soap12.HelloWorldSOAP12TestCase)
   Time elapsed: 1.276 sec  <<< ERROR!
  org.osoa.sca.ServiceRuntimeException:
  org.osoa.sca.ServiceRuntimeException: Provided Intent -
  {http://tuscany.apache.org/xmlns/sca/1.0}wsAuthentication not found
  for PolicySet {http://tuscany.apache.org/xmlns/sca/1.0}wsClientAuthenticationPolicy
         at org.apache.tuscany.sca.host.embedded.SCADomain.createNewInstance(SCADomain.java:276)
         at org.apache.tuscany.sca.host.embedded.SCADomain.newInstance(SCADomain.java:70)
         at org.apache.tuscany.sca.binding.ws.axis2.itests.soap12.HelloWorldSOAP12TestCase.setUp(HelloWorldSOAP12TestCase.java:50)
         at junit.framework.TestCase.runBare(TestCase.java:132)
         at junit.framework.TestResult$1.protect(TestResult.java:110)
         at junit.framework.TestResult.runProtected(TestResult.java:128)
         at junit.framework.TestResult.run(TestResult.java:113)
         at junit.framework.TestCase.run(TestCase.java:124)
         at junit.framework.TestSuite.runTest(TestSuite.java:232)
         at junit.framework.TestSuite.run(TestSuite.java:227)
         at org.junit.internal.runners.OldTestClassRunner.run(OldTestClassRunner.java:35)
         at org.apache.maven.surefire.junit4.JUnit4TestSet.execute(JUnit4TestSet.java:62)
         at org.apache.maven.surefire.suite.AbstractDirectoryTestSuite.executeTestSet(AbstractDirectoryTestSuite.java:138)
         at org.apache.maven.surefire.suite.AbstractDirectoryTestSuite.execute(AbstractDirectoryTestSuite.java:125)
         at org.apache.maven.surefire.Surefire.run(Surefire.java:132)
         at sun.reflect.NativeMethodAccessorImpl.invoke0(Native Method)
         at sun.reflect.NativeMethodAccessorImpl.invoke(NativeMethodAccessorImpl.java:39)
         at sun.reflect.DelegatingMethodAccessorImpl.invoke(DelegatingMethodAccessorImpl.java:25)
         at java.lang.reflect.Method.invoke(Method.java:585)
         at org.apache.maven.surefire.booter.SurefireBooter.runSuitesInProcess(SurefireBooter.java:290)
         at org.apache.maven.surefire.booter.SurefireBooter.main(SurefireBooter.java:818)
  Caused by: org.osoa.sca.ServiceRuntimeException: Provided Intent -
  {http://tuscany.apache.org/xmlns/sca/1.0}wsAuthentication not found
  for PolicySet {http://tuscany.apache.org/xmlns/sca/1.0}wsClientAuthenticationPolicy
         at org.apache.tuscany.sca.host.embedded.impl.DefaultSCADomain.analyseProblems(DefaultSCADomain.java:309)
         at org.apache.tuscany.sca.host.embedded.impl.DefaultSCADomain.addContribution(DefaultSCADomain.java:334)
         at org.apache.tuscany.sca.host.embedded.impl.DefaultSCADomain.init(DefaultSCADomain.java:183)
         at org.apache.tuscany.sca.host.embedded.impl.DefaultSCADomain.<init>(DefaultSCADomain.java:120)
         at org.apache.tuscany.sca.host.embedded.SCADomain.createNewInstance(SCADomain.java:242)
         ... 20 more

  testHelloWorldSOAP12(org.apache.tuscany.sca.binding.ws.axis2.itests.soap12.HelloWorldSOAP12TestCase)
   Time elapsed: 1.184 sec  <<< ERROR!
  org.osoa.sca.ServiceRuntimeException:
  org.osoa.sca.ServiceRuntimeException: Provided Intent -
  {http://tuscany.apache.org/xmlns/sca/1.0}wsAuthentication not found
  for PolicySet {http://tuscany.apache.org/xmlns/sca/1.0}wsClientAuthenticationPolicy
         at org.apache.tuscany.sca.host.embedded.SCADomain.createNewInstance(SCADomain.java:276)
         at org.apache.tuscany.sca.host.embedded.SCADomain.newInstance(SCADomain.java:70)
         at org.apache.tuscany.sca.binding.ws.axis2.itests.soap12.HelloWorldSOAP12TestCase.setUp(HelloWorldSOAP12TestCase.java:50)
         at junit.framework.TestCase.runBare(TestCase.java:132)
         at junit.framework.TestResult$1.protect(TestResult.java:110)
         at junit.framework.TestResult.runProtected(TestResult.java:128)
         at junit.framework.TestResult.run(TestResult.java:113)
         at junit.framework.TestCase.run(TestCase.java:124)
         at junit.framework.TestSuite.runTest(TestSuite.java:232)
         at junit.framework.TestSuite.run(TestSuite.java:227)
         at org.junit.internal.runners.OldTestClassRunner.run(OldTestClassRunner.java:35)
         at org.apache.maven.surefire.junit4.JUnit4TestSet.execute(JUnit4TestSet.java:62)
         at org.apache.maven.surefire.suite.AbstractDirectoryTestSuite.executeTestSet(AbstractDirectoryTestSuite.java:138)
         at org.apache.maven.surefire.suite.AbstractDirectoryTestSuite.execute(AbstractDirectoryTestSuite.java:125)
         at org.apache.maven.surefire.Surefire.run(Surefire.java:132)
         at sun.reflect.NativeMethodAccessorImpl.invoke0(Native Method)
         at sun.reflect.NativeMethodAccessorImpl.invoke(NativeMethodAccessorImpl.java:39)
         at sun.reflect.DelegatingMethodAccessorImpl.invoke(DelegatingMethodAccessorImpl.java:25)
         at java.lang.reflect.Method.invoke(Method.java:585)
         at org.apache.maven.surefire.booter.SurefireBooter.runSuitesInProcess(SurefireBooter.java:290)
         at org.apache.maven.surefire.booter.SurefireBooter.main(SurefireBooter.java:818)
  Caused by: org.osoa.sca.ServiceRuntimeException: Provided Intent -
  {http://tuscany.apache.org/xmlns/sca/1.0}wsAuthentication not found
  for PolicySet {http://tuscany.apache.org/xmlns/sca/1.0}wsClientAuthenticationPolicy
         at org.apache.tuscany.sca.host.embedded.impl.DefaultSCADomain.analyseProblems(DefaultSCADomain.java:309)
         at org.apache.tuscany.sca.host.embedded.impl.DefaultSCADomain.addContribution(DefaultSCADomain.java:334)
         at org.apache.tuscany.sca.host.embedded.impl.DefaultSCADomain.init(DefaultSCADomain.java:183)
         at org.apache.tuscany.sca.host.embedded.impl.DefaultSCADomain.<init>(DefaultSCADomain.java:120)
         at org.apache.tuscany.sca.host.embedded.SCADomain.createNewInstance(SCADomain.java:242)
         ... 20 more

  Running org.apache.tuscany.sca.binding.ws.axis2.itests.HelloWorldNoWSDLTestCase
  >>>Initializing WSPolicyProcessor
  2-ago-2008 23.55.18 org.apache.tuscany.sca.assembly.xml.CompositeProcessor
  AVVERTENZA: No namespace found: Composite = HelloWorld
  2-ago-2008 23.55.18 org.apache.tuscany.sca.assembly.xml.CompositeProcessor
  AVVERTENZA: No namespace found: Composite = HelloWorldNoWSDL
  2-ago-2008 23.55.18 org.apache.tuscany.sca.assembly.xml.CompositeProcessor
  AVVERTENZA: No namespace found: Composite = endpoint1
  2-ago-2008 23.55.18 org.apache.tuscany.sca.assembly.xml.CompositeProcessor
  AVVERTENZA: No namespace found: Composite = endpoint1
  2-ago-2008 23.55.18 org.apache.tuscany.sca.assembly.xml.CompositeProcessor
  AVVERTENZA: No namespace found: Composite = endpoint3
  2-ago-2008 23.55.18 org.apache.tuscany.sca.assembly.xml.CompositeProcessor
  AVVERTENZA: No namespace found: Composite = endpoint4
  2-ago-2008 23.55.18 org.apache.tuscany.sca.assembly.xml.CompositeProcessor
  AVVERTENZA: No namespace found: Composite = HelloWorld
  2-ago-2008 23.55.18 org.apache.tuscany.sca.assembly.xml.CompositeProcessor
  AVVERTENZA: No namespace found: Composite = HelloWorldOM-Merged
  2-ago-2008 23.55.18 org.apache.tuscany.sca.assembly.xml.CompositeProcessor
  AVVERTENZA: No namespace found: Composite = HelloWorldOM
  2-ago-2008 23.55.18 org.apache.tuscany.sca.assembly.xml.CompositeProcessor
  AVVERTENZA: No namespace found: Composite = HelloWorldPrec
  2-ago-2008 23.55.19 org.apache.tuscany.sca.assembly.xml.CompositeProcessor
  AVVERTENZA: No namespace found: Composite = endpoint3
  2-ago-2008 23.55.19 org.apache.tuscany.sca.assembly.xml.CompositeProcessor
  AVVERTENZA: No namespace found: Composite = endpoint3
  2-ago-2008 23.55.19 org.apache.tuscany.sca.assembly.xml.CompositeProcessor
  AVVERTENZA: No namespace found: Composite = endpoint3
  2-ago-2008 23.55.19 org.apache.tuscany.sca.assembly.xml.CompositeProcessor
  AVVERTENZA: No namespace found: Composite = endpoint3
  2-ago-2008 23.55.19 org.apache.tuscany.sca.assembly.xml.CompositeProcessor
  AVVERTENZA: No namespace found: Composite = endpoint3
  2-ago-2008 23.55.19 org.apache.tuscany.sca.assembly.xml.CompositeProcessor
  AVVERTENZA: No namespace found: Composite = endpoint3
  2-ago-2008 23.55.19 org.apache.tuscany.sca.assembly.xml.CompositeProcessor
  AVVERTENZA: No namespace found: Composite = endpoint3
  2-ago-2008 23.55.19 org.apache.tuscany.sca.assembly.xml.CompositeProcessor
  AVVERTENZA: No namespace found: Composite = QuestionMarkWSDLImport
  2-ago-2008 23.55.19 org.apache.tuscany.sca.assembly.xml.CompositeProcessor
  AVVERTENZA: No namespace found: Composite = QuestionMarkWSDLInclude
  2-ago-2008 23.55.19 org.apache.tuscany.sca.assembly.xml.CompositeProcessor
  AVVERTENZA: No namespace found: Composite = QuestionMarkWSDLTests
  2-ago-2008 23.55.19 org.apache.tuscany.sca.assembly.xml.CompositeProcessor
  AVVERTENZA: No namespace found: Composite = HelloWorld
  2-ago-2008 23.55.19 org.apache.tuscany.sca.assembly.xml.CompositeProcessor
  AVVERTENZA: No namespace found: Composite = QuestionMarkWSDLTests
  2-ago-2008 23.55.19 org.apache.tuscany.sca.policy.xml.PolicySetProcessor
  GRAVE: Provided Intent -
  {http://tuscany.apache.org/xmlns/sca/1.0}wsAuthentication not found
  for PolicySet {http://tuscany.apache.org/xmlns/sca/1.0}wsClientAuthenticationPolicy
  >>>Initializing WSPolicyProcessor
  2-ago-2008 23.55.19 org.apache.tuscany.sca.assembly.xml.CompositeProcessor
  AVVERTENZA: No namespace found: Composite = HelloWorld
  2-ago-2008 23.55.19 org.apache.tuscany.sca.assembly.xml.CompositeProcessor
  AVVERTENZA: No namespace found: Composite = HelloWorldNoWSDL
  2-ago-2008 23.55.19 org.apache.tuscany.sca.assembly.xml.CompositeProcessor
  AVVERTENZA: No namespace found: Composite = endpoint1
  2-ago-2008 23.55.19 org.apache.tuscany.sca.assembly.xml.CompositeProcessor
  AVVERTENZA: No namespace found: Composite = endpoint1
  2-ago-2008 23.55.20 org.apache.tuscany.sca.assembly.xml.CompositeProcessor
  AVVERTENZA: No namespace found: Composite = endpoint3
  2-ago-2008 23.55.20 org.apache.tuscany.sca.assembly.xml.CompositeProcessor
  AVVERTENZA: No namespace found: Composite = endpoint4
  2-ago-2008 23.55.20 org.apache.tuscany.sca.assembly.xml.CompositeProcessor
  AVVERTENZA: No namespace found: Composite = HelloWorld
  2-ago-2008 23.55.20 org.apache.tuscany.sca.assembly.xml.CompositeProcessor
  AVVERTENZA: No namespace found: Composite = HelloWorldOM-Merged
  2-ago-2008 23.55.20 org.apache.tuscany.sca.assembly.xml.CompositeProcessor
  AVVERTENZA: No namespace found: Composite = HelloWorldOM
  2-ago-2008 23.55.20 org.apache.tuscany.sca.assembly.xml.CompositeProcessor
  AVVERTENZA: No namespace found: Composite = HelloWorldPrec
  2-ago-2008 23.55.20 org.apache.tuscany.sca.assembly.xml.CompositeProcessor
  AVVERTENZA: No namespace found: Composite = endpoint3
  2-ago-2008 23.55.20 org.apache.tuscany.sca.assembly.xml.CompositeProcessor
  AVVERTENZA: No namespace found: Composite = endpoint3
  2-ago-2008 23.55.20 org.apache.tuscany.sca.assembly.xml.CompositeProcessor
  AVVERTENZA: No namespace found: Composite = endpoint3
  2-ago-2008 23.55.20 org.apache.tuscany.sca.assembly.xml.CompositeProcessor
  AVVERTENZA: No namespace found: Composite = endpoint3
  2-ago-2008 23.55.20 org.apache.tuscany.sca.assembly.xml.CompositeProcessor
  AVVERTENZA: No namespace found: Composite = endpoint3
  2-ago-2008 23.55.20 org.apache.tuscany.sca.assembly.xml.CompositeProcessor
  AVVERTENZA: No namespace found: Composite = endpoint3
  2-ago-2008 23.55.20 org.apache.tuscany.sca.assembly.xml.CompositeProcessor
  AVVERTENZA: No namespace found: Composite = endpoint3
  2-ago-2008 23.55.20 org.apache.tuscany.sca.assembly.xml.CompositeProcessor
  AVVERTENZA: No namespace found: Composite = QuestionMarkWSDLImport
  2-ago-2008 23.55.20 org.apache.tuscany.sca.assembly.xml.CompositeProcessor
  AVVERTENZA: No namespace found: Composite = QuestionMarkWSDLInclude
  2-ago-2008 23.55.20 org.apache.tuscany.sca.assembly.xml.CompositeProcessor
  AVVERTENZA: No namespace found: Composite = QuestionMarkWSDLTests
  2-ago-2008 23.55.20 org.apache.tuscany.sca.assembly.xml.CompositeProcessor
  AVVERTENZA: No namespace found: Composite = HelloWorld
  2-ago-2008 23.55.20 org.apache.tuscany.sca.assembly.xml.CompositeProcessor
  AVVERTENZA: No namespace found: Composite = QuestionMarkWSDLTests
  2-ago-2008 23.55.20 org.apache.tuscany.sca.policy.xml.PolicySetProcessor
  GRAVE: Provided Intent -
  {http://tuscany.apache.org/xmlns/sca/1.0}wsAuthentication not found
  for PolicySet {http://tuscany.apache.org/xmlns/sca/1.0}wsClientAuthenticationPolicy
  Tests run: 2, Failures: 0, Errors: 2, Skipped: 0, Time elapsed: 2.444
  sec <<< FAILURE!
  testHelloWorld(org.apache.tuscany.sca.binding.ws.axis2.itests.HelloWorldNoWSDLTestCase)
   Time elapsed: 1.261 sec  <<< ERROR!
  org.osoa.sca.ServiceRuntimeException:
  org.osoa.sca.ServiceRuntimeException: Provided Intent -
  {http://tuscany.apache.org/xmlns/sca/1.0}wsAuthentication not found
  for PolicySet {http://tuscany.apache.org/xmlns/sca/1.0}wsClientAuthenticationPolicy
         at org.apache.tuscany.sca.host.embedded.SCADomain.createNewInstance(SCADomain.java:276)
         at org.apache.tuscany.sca.host.embedded.SCADomain.newInstance(SCADomain.java:70)
         at org.apache.tuscany.sca.binding.ws.axis2.itests.HelloWorldNoWSDLTestCase.setUp(HelloWorldNoWSDLTestCase.java:69)
         at junit.framework.TestCase.runBare(TestCase.java:132)
         at junit.framework.TestResult$1.protect(TestResult.java:110)
         at junit.framework.TestResult.runProtected(TestResult.java:128)
         at junit.framework.TestResult.run(TestResult.java:113)
         at junit.framework.TestCase.run(TestCase.java:124)
         at junit.framework.TestSuite.runTest(TestSuite.java:232)
         at junit.framework.TestSuite.run(TestSuite.java:227)
         at org.junit.internal.runners.OldTestClassRunner.run(OldTestClassRunner.java:35)
         at org.apache.maven.surefire.junit4.JUnit4TestSet.execute(JUnit4TestSet.java:62)
         at org.apache.maven.surefire.suite.AbstractDirectoryTestSuite.executeTestSet(AbstractDirectoryTestSuite.java:138)
         at org.apache.maven.surefire.suite.AbstractDirectoryTestSuite.execute(AbstractDirectoryTestSuite.java:125)
         at org.apache.maven.surefire.Surefire.run(Surefire.java:132)
         at sun.reflect.NativeMethodAccessorImpl.invoke0(Native Method)
         at sun.reflect.NativeMethodAccessorImpl.invoke(NativeMethodAccessorImpl.java:39)
         at sun.reflect.DelegatingMethodAccessorImpl.invoke(DelegatingMethodAccessorImpl.java:25)
         at java.lang.reflect.Method.invoke(Method.java:585)
         at org.apache.maven.surefire.booter.SurefireBooter.runSuitesInProcess(SurefireBooter.java:290)
         at org.apache.maven.surefire.booter.SurefireBooter.main(SurefireBooter.java:818)
  Caused by: org.osoa.sca.ServiceRuntimeException: Provided Intent -
  {http://tuscany.apache.org/xmlns/sca/1.0}wsAuthentication not found
  for PolicySet {http://tuscany.apache.org/xmlns/sca/1.0}wsClientAuthenticationPolicy
         at org.apache.tuscany.sca.host.embedded.impl.DefaultSCADomain.analyseProblems(DefaultSCADomain.java:309)
         at org.apache.tuscany.sca.host.embedded.impl.DefaultSCADomain.addContribution(DefaultSCADomain.java:334)
         at org.apache.tuscany.sca.host.embedded.impl.DefaultSCADomain.init(DefaultSCADomain.java:183)
         at org.apache.tuscany.sca.host.embedded.impl.DefaultSCADomain.<init>(DefaultSCADomain.java:120)
         at org.apache.tuscany.sca.host.embedded.SCADomain.createNewInstance(SCADomain.java:242)
         ... 20 more

  testEchoFoo(org.apache.tuscany.sca.binding.ws.axis2.itests.HelloWorldNoWSDLTestCase)
   Time elapsed: 1.177 sec  <<< ERROR!
  org.osoa.sca.ServiceRuntimeException:
  org.osoa.sca.ServiceRuntimeException: Provided Intent -
  {http://tuscany.apache.org/xmlns/sca/1.0}wsAuthentication not found
  for PolicySet {http://tuscany.apache.org/xmlns/sca/1.0}wsClientAuthenticationPolicy
         at org.apache.tuscany.sca.host.embedded.SCADomain.createNewInstance(SCADomain.java:276)
         at org.apache.tuscany.sca.host.embedded.SCADomain.newInstance(SCADomain.java:70)
         at org.apache.tuscany.sca.binding.ws.axis2.itests.HelloWorldNoWSDLTestCase.setUp(HelloWorldNoWSDLTestCase.java:69)
         at junit.framework.TestCase.runBare(TestCase.java:132)
         at junit.framework.TestResult$1.protect(TestResult.java:110)
         at junit.framework.TestResult.runProtected(TestResult.java:128)
         at junit.framework.TestResult.run(TestResult.java:113)
         at junit.framework.TestCase.run(TestCase.java:124)
         at junit.framework.TestSuite.runTest(TestSuite.java:232)
         at junit.framework.TestSuite.run(TestSuite.java:227)
         at org.junit.internal.runners.OldTestClassRunner.run(OldTestClassRunner.java:35)
         at org.apache.maven.surefire.junit4.JUnit4TestSet.execute(JUnit4TestSet.java:62)
         at org.apache.maven.surefire.suite.AbstractDirectoryTestSuite.executeTestSet(AbstractDirectoryTestSuite.java:138)
         at org.apache.maven.surefire.suite.AbstractDirectoryTestSuite.execute(AbstractDirectoryTestSuite.java:125)
         at org.apache.maven.surefire.Surefire.run(Surefire.java:132)
         at sun.reflect.NativeMethodAccessorImpl.invoke0(Native Method)
         at sun.reflect.NativeMethodAccessorImpl.invoke(NativeMethodAccessorImpl.java:39)
         at sun.reflect.DelegatingMethodAccessorImpl.invoke(DelegatingMethodAccessorImpl.java:25)
         at java.lang.reflect.Method.invoke(Method.java:585)
         at org.apache.maven.surefire.booter.SurefireBooter.runSuitesInProcess(SurefireBooter.java:290)
         at org.apache.maven.surefire.booter.SurefireBooter.main(SurefireBooter.java:818)
  Caused by: org.osoa.sca.ServiceRuntimeException: Provided Intent -
  {http://tuscany.apache.org/xmlns/sca/1.0}wsAuthentication not found
  for PolicySet {http://tuscany.apache.org/xmlns/sca/1.0}wsClientAuthenticationPolicy
         at org.apache.tuscany.sca.host.embedded.impl.DefaultSCADomain.analyseProblems(DefaultSCADomain.java:309)
         at org.apache.tuscany.sca.host.embedded.impl.DefaultSCADomain.addContribution(DefaultSCADomain.java:334)
         at org.apache.tuscany.sca.host.embedded.impl.DefaultSCADomain.init(DefaultSCADomain.java:183)
         at org.apache.tuscany.sca.host.embedded.impl.DefaultSCADomain.<init>(DefaultSCADomain.java:120)
         at org.apache.tuscany.sca.host.embedded.SCADomain.createNewInstance(SCADomain.java:242)
         ... 20 more

  Running org.apache.tuscany.sca.binding.ws.axis2.itests.QuestionMarkWSDLIncludeTestCase
  >>>Initializing WSPolicyProcessor
  2-ago-2008 23.55.21 org.apache.tuscany.sca.assembly.xml.CompositeProcessor
  AVVERTENZA: No namespace found: Composite = HelloWorld
  2-ago-2008 23.55.21 org.apache.tuscany.sca.assembly.xml.CompositeProcessor
  AVVERTENZA: No namespace found: Composite = HelloWorldNoWSDL
  2-ago-2008 23.55.21 org.apache.tuscany.sca.assembly.xml.CompositeProcessor
  AVVERTENZA: No namespace found: Composite = endpoint1
  2-ago-2008 23.55.21 org.apache.tuscany.sca.assembly.xml.CompositeProcessor
  AVVERTENZA: No namespace found: Composite = endpoint1
  2-ago-2008 23.55.21 org.apache.tuscany.sca.assembly.xml.CompositeProcessor
  AVVERTENZA: No namespace found: Composite = endpoint3
  2-ago-2008 23.55.21 org.apache.tuscany.sca.assembly.xml.CompositeProcessor
  AVVERTENZA: No namespace found: Composite = endpoint4
  2-ago-2008 23.55.21 org.apache.tuscany.sca.assembly.xml.CompositeProcessor
  AVVERTENZA: No namespace found: Composite = HelloWorld
  2-ago-2008 23.55.21 org.apache.tuscany.sca.assembly.xml.CompositeProcessor
  AVVERTENZA: No namespace found: Composite = HelloWorldOM-Merged
  2-ago-2008 23.55.21 org.apache.tuscany.sca.assembly.xml.CompositeProcessor
  AVVERTENZA: No namespace found: Composite = HelloWorldOM
  2-ago-2008 23.55.21 org.apache.tuscany.sca.assembly.xml.CompositeProcessor
  AVVERTENZA: No namespace found: Composite = HelloWorldPrec
  2-ago-2008 23.55.21 org.apache.tuscany.sca.assembly.xml.CompositeProcessor
  AVVERTENZA: No namespace found: Composite = endpoint3
  2-ago-2008 23.55.21 org.apache.tuscany.sca.assembly.xml.CompositeProcessor
  AVVERTENZA: No namespace found: Composite = endpoint3
  2-ago-2008 23.55.21 org.apache.tuscany.sca.assembly.xml.CompositeProcessor
  AVVERTENZA: No namespace found: Composite = endpoint3
  2-ago-2008 23.55.21 org.apache.tuscany.sca.assembly.xml.CompositeProcessor
  AVVERTENZA: No namespace found: Composite = endpoint3
  2-ago-2008 23.55.21 org.apache.tuscany.sca.assembly.xml.CompositeProcessor
  AVVERTENZA: No namespace found: Composite = endpoint3
  2-ago-2008 23.55.21 org.apache.tuscany.sca.assembly.xml.CompositeProcessor
  AVVERTENZA: No namespace found: Composite = endpoint3
  2-ago-2008 23.55.21 org.apache.tuscany.sca.assembly.xml.CompositeProcessor
  AVVERTENZA: No namespace found: Composite = endpoint3
  2-ago-2008 23.55.21 org.apache.tuscany.sca.assembly.xml.CompositeProcessor
  AVVERTENZA: No namespace found: Composite = QuestionMarkWSDLImport
  2-ago-2008 23.55.21 org.apache.tuscany.sca.assembly.xml.CompositeProcessor
  AVVERTENZA: No namespace found: Composite = QuestionMarkWSDLInclude
  2-ago-2008 23.55.21 org.apache.tuscany.sca.assembly.xml.CompositeProcessor
  AVVERTENZA: No namespace found: Composite = QuestionMarkWSDLTests
  2-ago-2008 23.55.21 org.apache.tuscany.sca.assembly.xml.CompositeProcessor
  AVVERTENZA: No namespace found: Composite = HelloWorld
  2-ago-2008 23.55.21 org.apache.tuscany.sca.assembly.xml.CompositeProcessor
  AVVERTENZA: No namespace found: Composite = QuestionMarkWSDLTests
  2-ago-2008 23.55.21 org.apache.tuscany.sca.policy.xml.PolicySetProcessor
  GRAVE: Provided Intent -
  {http://tuscany.apache.org/xmlns/sca/1.0}wsAuthentication not found
  for PolicySet {http://tuscany.apache.org/xmlns/sca/1.0}wsClientAuthenticationPolicy
  Tests run: 1, Failures: 0, Errors: 1, Skipped: 0, Time elapsed: 1.195
  sec <<< FAILURE!
  testWSDLIncludePortEndpoint(org.apache.tuscany.sca.binding.ws.axis2.itests.QuestionMarkWSDLIncludeTestCase)
   Time elapsed: 1.19 sec  <<< ERROR!
  org.osoa.sca.ServiceRuntimeException:
  org.osoa.sca.ServiceRuntimeException: Provided Intent -
  {http://tuscany.apache.org/xmlns/sca/1.0}wsAuthentication not found
  for PolicySet {http://tuscany.apache.org/xmlns/sca/1.0}wsClientAuthenticationPolicy
         at org.apache.tuscany.sca.host.embedded.SCADomain.createNewInstance(SCADomain.java:276)
         at org.apache.tuscany.sca.host.embedded.SCADomain.newInstance(SCADomain.java:70)
         at org.apache.tuscany.sca.binding.ws.axis2.itests.QuestionMarkWSDLIncludeTestCase.setUp(QuestionMarkWSDLIncludeTestCase.java:88)
         at junit.framework.TestCase.runBare(TestCase.java:132)
         at junit.framework.TestResult$1.protect(TestResult.java:110)
         at junit.framework.TestResult.runProtected(TestResult.java:128)
         at junit.framework.TestResult.run(TestResult.java:113)
         at junit.framework.TestCase.run(TestCase.java:124)
         at junit.framework.TestSuite.runTest(TestSuite.java:232)
         at junit.framework.TestSuite.run(TestSuite.java:227)
         at org.junit.internal.runners.OldTestClassRunner.run(OldTestClassRunner.java:35)
         at org.apache.maven.surefire.junit4.JUnit4TestSet.execute(JUnit4TestSet.java:62)
         at org.apache.maven.surefire.suite.AbstractDirectoryTestSuite.executeTestSet(AbstractDirectoryTestSuite.java:138)
         at org.apache.maven.surefire.suite.AbstractDirectoryTestSuite.execute(AbstractDirectoryTestSuite.java:125)
         at org.apache.maven.surefire.Surefire.run(Surefire.java:132)
         at sun.reflect.NativeMethodAccessorImpl.invoke0(Native Method)
         at sun.reflect.NativeMethodAccessorImpl.invoke(NativeMethodAccessorImpl.java:39)
         at sun.reflect.DelegatingMethodAccessorImpl.invoke(DelegatingMethodAccessorImpl.java:25)
         at java.lang.reflect.Method.invoke(Method.java:585)
         at org.apache.maven.surefire.booter.SurefireBooter.runSuitesInProcess(SurefireBooter.java:290)
         at org.apache.maven.surefire.booter.SurefireBooter.main(SurefireBooter.java:818)
  Caused by: org.osoa.sca.ServiceRuntimeException: Provided Intent -
  {http://tuscany.apache.org/xmlns/sca/1.0}wsAuthentication not found
  for PolicySet {http://tuscany.apache.org/xmlns/sca/1.0}wsClientAuthenticationPolicy
         at org.apache.tuscany.sca.host.embedded.impl.DefaultSCADomain.analyseProblems(DefaultSCADomain.java:309)
         at org.apache.tuscany.sca.host.embedded.impl.DefaultSCADomain.addContribution(DefaultSCADomain.java:334)
         at org.apache.tuscany.sca.host.embedded.impl.DefaultSCADomain.init(DefaultSCADomain.java:183)
         at org.apache.tuscany.sca.host.embedded.impl.DefaultSCADomain.<init>(DefaultSCADomain.java:120)
         at org.apache.tuscany.sca.host.embedded.SCADomain.createNewInstance(SCADomain.java:242)
         ... 20 more

  Running org.apache.tuscany.sca.binding.ws.axis2.itests.policy.configparams.WSSecurityIntegrityTestCase
  >>>Initializing WSPolicyProcessor
  2-ago-2008 23.55.22 org.apache.tuscany.sca.assembly.xml.CompositeProcessor
  AVVERTENZA: No namespace found: Composite = HelloWorld
  2-ago-2008 23.55.22 org.apache.tuscany.sca.assembly.xml.CompositeProcessor
  AVVERTENZA: No namespace found: Composite = HelloWorldNoWSDL
  2-ago-2008 23.55.22 org.apache.tuscany.sca.assembly.xml.CompositeProcessor
  AVVERTENZA: No namespace found: Composite = endpoint1
  2-ago-2008 23.55.22 org.apache.tuscany.sca.assembly.xml.CompositeProcessor
  AVVERTENZA: No namespace found: Composite = endpoint1
  2-ago-2008 23.55.22 org.apache.tuscany.sca.assembly.xml.CompositeProcessor
  AVVERTENZA: No namespace found: Composite = endpoint3
  2-ago-2008 23.55.22 org.apache.tuscany.sca.assembly.xml.CompositeProcessor
  AVVERTENZA: No namespace found: Composite = endpoint4
  2-ago-2008 23.55.22 org.apache.tuscany.sca.assembly.xml.CompositeProcessor
  AVVERTENZA: No namespace found: Composite = HelloWorld
  2-ago-2008 23.55.22 org.apache.tuscany.sca.assembly.xml.CompositeProcessor
  AVVERTENZA: No namespace found: Composite = HelloWorldOM-Merged
  2-ago-2008 23.55.22 org.apache.tuscany.sca.assembly.xml.CompositeProcessor
  AVVERTENZA: No namespace found: Composite = HelloWorldOM
  2-ago-2008 23.55.22 org.apache.tuscany.sca.assembly.xml.CompositeProcessor
  AVVERTENZA: No namespace found: Composite = HelloWorldPrec
  2-ago-2008 23.55.22 org.apache.tuscany.sca.assembly.xml.CompositeProcessor
  AVVERTENZA: No namespace found: Composite = endpoint3
  2-ago-2008 23.55.22 org.apache.tuscany.sca.assembly.xml.CompositeProcessor
  AVVERTENZA: No namespace found: Composite = endpoint3
  2-ago-2008 23.55.22 org.apache.tuscany.sca.assembly.xml.CompositeProcessor
  AVVERTENZA: No namespace found: Composite = endpoint3
  2-ago-2008 23.55.22 org.apache.tuscany.sca.assembly.xml.CompositeProcessor
  AVVERTENZA: No namespace found: Composite = endpoint3
  2-ago-2008 23.55.22 org.apache.tuscany.sca.assembly.xml.CompositeProcessor
  AVVERTENZA: No namespace found: Composite = endpoint3
  2-ago-2008 23.55.22 org.apache.tuscany.sca.assembly.xml.CompositeProcessor
  AVVERTENZA: No namespace found: Composite = endpoint3
  2-ago-2008 23.55.22 org.apache.tuscany.sca.assembly.xml.CompositeProcessor
  AVVERTENZA: No namespace found: Composite = endpoint3
  2-ago-2008 23.55.22 org.apache.tuscany.sca.assembly.xml.CompositeProcessor
  AVVERTENZA: No namespace found: Composite = QuestionMarkWSDLImport
  2-ago-2008 23.55.22 org.apache.tuscany.sca.assembly.xml.CompositeProcessor
  AVVERTENZA: No namespace found: Composite = QuestionMarkWSDLInclude
  2-ago-2008 23.55.23 org.apache.tuscany.sca.assembly.xml.CompositeProcessor
  AVVERTENZA: No namespace found: Composite = QuestionMarkWSDLTests
  2-ago-2008 23.55.23 org.apache.tuscany.sca.assembly.xml.CompositeProcessor
  AVVERTENZA: No namespace found: Composite = HelloWorld
  2-ago-2008 23.55.23 org.apache.tuscany.sca.assembly.xml.CompositeProcessor
  AVVERTENZA: No namespace found: Composite = QuestionMarkWSDLTests
  2-ago-2008 23.55.23 org.apache.tuscany.sca.policy.xml.PolicySetProcessor
  GRAVE: Provided Intent -
  {http://tuscany.apache.org/xmlns/sca/1.0}wsAuthentication not found
  for PolicySet {http://tuscany.apache.org/xmlns/sca/1.0}wsClientAuthenticationPolicy
  Tests run: 1, Failures: 0, Errors: 1, Skipped: 0, Time elapsed: 1.207
  sec <<< FAILURE!
  testHelloWorld(org.apache.tuscany.sca.binding.ws.axis2.itests.policy.configparams.WSSecurityIntegrityTestCase)
   Time elapsed: 1.202 sec  <<< ERROR!
  org.osoa.sca.ServiceRuntimeException:
  org.osoa.sca.ServiceRuntimeException: Provided Intent -
  {http://tuscany.apache.org/xmlns/sca/1.0}wsAuthentication not found
  for PolicySet {http://tuscany.apache.org/xmlns/sca/1.0}wsClientAuthenticationPolicy
         at org.apache.tuscany.sca.host.embedded.SCADomain.createNewInstance(SCADomain.java:276)
         at org.apache.tuscany.sca.host.embedded.SCADomain.newInstance(SCADomain.java:70)
         at org.apache.tuscany.sca.binding.ws.axis2.itests.policy.configparams.AbstractHelloWorldOMTestCase.setUp(AbstractHelloWorldOMTestCase.java:50)
         at junit.framework.TestCase.runBare(TestCase.java:132)
         at junit.framework.TestResult$1.protect(TestResult.java:110)
         at junit.framework.TestResult.runProtected(TestResult.java:128)
         at junit.framework.TestResult.run(TestResult.java:113)
         at junit.framework.TestCase.run(TestCase.java:124)
         at junit.framework.TestSuite.runTest(TestSuite.java:232)
         at junit.framework.TestSuite.run(TestSuite.java:227)
         at org.junit.internal.runners.OldTestClassRunner.run(OldTestClassRunner.java:35)
         at org.apache.maven.surefire.junit4.JUnit4TestSet.execute(JUnit4TestSet.java:62)
         at org.apache.maven.surefire.suite.AbstractDirectoryTestSuite.executeTestSet(AbstractDirectoryTestSuite.java:138)
         at org.apache.maven.surefire.suite.AbstractDirectoryTestSuite.execute(AbstractDirectoryTestSuite.java:125)
         at org.apache.maven.surefire.Surefire.run(Surefire.java:132)
         at sun.reflect.NativeMethodAccessorImpl.invoke0(Native Method)
         at sun.reflect.NativeMethodAccessorImpl.invoke(NativeMethodAccessorImpl.java:39)
         at sun.reflect.DelegatingMethodAccessorImpl.invoke(DelegatingMethodAccessorImpl.java:25)
         at java.lang.reflect.Method.invoke(Method.java:585)
         at org.apache.maven.surefire.booter.SurefireBooter.runSuitesInProcess(SurefireBooter.java:290)
         at org.apache.maven.surefire.booter.SurefireBooter.main(SurefireBooter.java:818)
  Caused by: org.osoa.sca.ServiceRuntimeException: Provide...

  [Message clipped]  


Mime
View raw message