tuscany-dev mailing list archives: March 2008

Site index · List index
Message list« Previous · 1 · 2 · 3 · 4 · 5 · 6 · 7 · 8 · 9 · 10 · 11 · 12 · 13 · 14 · 15 · Next »Thread · Author · Date
Dan Becker Re: Tuscany policy file syntax Fri, 14 Mar, 20:29
Lou Amodeo (JIRA) [jira] Created: (TUSCANY-2088) Incorrect ConversationEndedException:Conversation has expired. on reference Fri, 14 Mar, 20:34
Continuum VMBuild Server [continuum] BUILD FAILURE: Apache Tuscany SCA Implementation Project Fri, 14 Mar, 20:54
Continuum VMBuild Server [continuum] BUILD FAILURE: Apache Tuscany SCA Implementation Project Fri, 14 Mar, 20:56
Adriano Crestani Running Tuscany/SCA in Google Android mobile platform Fri, 14 Mar, 21:13
Simon Laws (JIRA) [jira] Assigned: (TUSCANY-2088) Incorrect ConversationEndedException:Conversation has expired. on reference Fri, 14 Mar, 21:34
Raymond Feng Re: Missing class UserPrincipal in samples/calculator-implementation-policies Fri, 14 Mar, 21:36
Continuum VMBuild Server [continuum] BUILD FAILURE: Apache Tuscany SCA Implementation Project Fri, 14 Mar, 22:15
Continuum VMBuild Server [continuum] BUILD FAILURE: Apache Tuscany SCA Implementation Project Fri, 14 Mar, 22:16
Simon Laws Workpool files added from TUSCANY-1863, TUSCANY-1907, Fri, 14 Mar, 22:31
Luciano Resende Re: Running Tuscany/SCA in Google Android mobile platform Fri, 14 Mar, 23:11
Continuum VMBuild Server [continuum] BUILD FAILURE: Apache Tuscany SCA Implementation Project Sat, 15 Mar, 01:18
Continuum VMBuild Server [continuum] BUILD FAILURE: Apache Tuscany SCA Implementation Project Sat, 15 Mar, 01:20
Pinaki Poddar unsubscribe Sat, 15 Mar, 01:22
Continuum VMBuild Server [continuum] BUILD SUCCESSFUL: Apache Tuscany SCA Implementation Project Sat, 15 Mar, 03:19
Luciano Resende Re: [SCA 1.2] Release Branch Sat, 15 Mar, 04:25
Thilina Buddhika GSoC project idea - Tuscany SCA support in the Geronimo Admin console Sat, 15 Mar, 07:21
Continuum VMBuild Server [continuum] BUILD SUCCESSFUL: Apache Tuscany SCA Implementation Project Sat, 15 Mar, 08:13
ant elder (JIRA) [jira] Closed: (TUSCANY-1950) Calculator-script produces etrenuous *sys-package-mgr* output. Sat, 15 Mar, 09:22
Adriano Crestani Re: Running Tuscany/SCA in Google Android mobile platform Sat, 15 Mar, 09:30
Vamsavardhana Reddy (JIRA) [jira] Commented: (TUSCANY-2077) ConversationIds are not always unique Sat, 15 Mar, 09:44
Luciano Resende Re: Running Tuscany/SCA in Google Android mobile platform Sat, 15 Mar, 16:44
Simon Nash Re: Tests for Tuscany running under OSGi Sat, 15 Mar, 22:11
Simon Nash Default build time and space consumption Sat, 15 Mar, 22:41
Continuum VMBuild Server [continuum] BUILD ERROR: Apache Tuscany SCA Implementation Project Sun, 16 Mar, 00:16
Continuum VMBuild Server [continuum] BUILD ERROR: Apache Tuscany SCA Implementation Project Sun, 16 Mar, 00:19
haleh mahbod Re: unsubscribe Sun, 16 Mar, 02:28
ant elder Re: Default build time and space consumption Sun, 16 Mar, 07:20
ant elder Re: Tests for Tuscany running under OSGi Sun, 16 Mar, 07:53
ant elder Re: GSoC project idea - Tuscany SCA support in the Geronimo Admin console Sun, 16 Mar, 08:09
Paul Fremantle Re: GSoC project idea - Tuscany SCA support in the Geronimo Admin console Sun, 16 Mar, 08:52
Simon Laws (JIRA) [jira] Resolved: (TUSCANY-1907) Dynamic Wiring: Adding a new component to a contribution Sun, 16 Mar, 09:54
Simon Laws (JIRA) [jira] Resolved: (TUSCANY-1863) Distributed Workpool Sample over Distributed SCA Bindings Sun, 16 Mar, 09:54
Simon Nash (JIRA) [jira] Commented: (TUSCANY-2077) ConversationIds are not always unique Sun, 16 Mar, 10:12
Continuum VMBuild Server [continuum] BUILD SUCCESSFUL: Apache Tuscany SCA Implementation Project Sun, 16 Mar, 10:18
ant elder Re: Default build time and space consumption Sun, 16 Mar, 10:59
Simon Nash (JIRA) [jira] Assigned: (TUSCANY-2077) ConversationIds are not always unique Sun, 16 Mar, 17:58
Simon Nash (JIRA) [jira] Resolved: (TUSCANY-2077) ConversationIds are not always unique Sun, 16 Mar, 18:06
Simon Nash (JIRA) [jira] Closed: (TUSCANY-1717) Clean up EndpointReference and ReferenceParameters SPI Sun, 16 Mar, 18:14
Simon Nash (JIRA) [jira] Resolved: (TUSCANY-1347) IndexOutOfBoundsException thrown when trying to locate a service that includes a callback Sun, 16 Mar, 19:26
Simon Nash (JIRA) [jira] Resolved: (TUSCANY-1398) Nested Callbacks Fail Sun, 16 Mar, 19:48
Rajini Sivaram (JIRA) [jira] Closed: (TUSCANY-2081) SCATestCaseRunner assumes test class is loaded by the context classloader Sun, 16 Mar, 20:06
Rajini Sivaram (JIRA) [jira] Closed: (TUSCANY-2083) GroovyClassLoader throws NoClassDefFoundError when Tuscany is run inside OSGi Sun, 16 Mar, 20:08
Rajini Sivaram (JIRA) [jira] Closed: (TUSCANY-2087) Tuscany Jaas authentication uses Tuscany classloader to load callback class from contribution Sun, 16 Mar, 20:10
Simon Laws Release checklist and process Sun, 16 Mar, 21:46
Luciano Resende (JIRA) [jira] Created: (TUSCANY-2089) java.lang.NoClassDefFoundError: running sample Calculator using ant script Mon, 17 Mar, 00:58
Luciano Resende (JIRA) [jira] Assigned: (TUSCANY-2089) java.lang.NoClassDefFoundError: running sample Calculator using ant script Mon, 17 Mar, 03:29
Thilina Buddhika Re: GSoC project idea - Tuscany SCA support in the Geronimo Admin console Mon, 17 Mar, 03:42
Continuum VMBuild Server [continuum] BUILD FAILURE: Apache Tuscany SCA Implementation Project Mon, 17 Mar, 04:19
Continuum VMBuild Server [continuum] BUILD FAILURE: Apache Tuscany SCA Implementation Project Mon, 17 Mar, 04:21
Luciano Resende [SCA 1.2] Calculator Sample and OSGI dependencies... Mon, 17 Mar, 04:25
Luciano Resende (JIRA) [jira] Commented: (TUSCANY-2089) java.lang.NoClassDefFoundError: running sample Calculator using ant script Mon, 17 Mar, 04:29
Continuum VMBuild Server [continuum] BUILD FAILURE: Apache Tuscany SCA Implementation Project Mon, 17 Mar, 05:41
Continuum VMBuild Server [continuum] BUILD FAILURE: Apache Tuscany SCA Implementation Project Mon, 17 Mar, 05:43
Vamsavardhana Reddy (JIRA) [jira] Commented: (TUSCANY-2077) ConversationIds are not always unique Mon, 17 Mar, 06:17
Continuum VMBuild Server [continuum] BUILD FAILURE: Apache Tuscany SCA Implementation Project Mon, 17 Mar, 06:27
Continuum VMBuild Server [continuum] BUILD FAILURE: Apache Tuscany SCA Implementation Project Mon, 17 Mar, 06:29
Continuum VMBuild Server [continuum] BUILD FAILURE: Apache Tuscany SCA Implementation Project Mon, 17 Mar, 07:37
Continuum VMBuild Server [continuum] BUILD FAILURE: Apache Tuscany SCA Implementation Project Mon, 17 Mar, 07:39
Simon Laws Checking the TUSCANY-2077 test in? Re: svn commit: r637621 - in /incubator/tuscany/java/sca/modules/core/src/main/java/org/apache/tuscany/sca/core: assembly/ invocation/ Mon, 17 Mar, 08:05
Rajini Sivaram Re: [SCA 1.2] Calculator Sample and OSGI dependencies... Mon, 17 Mar, 09:20
Rajini Sivaram (JIRA) [jira] Commented: (TUSCANY-2089) java.lang.NoClassDefFoundError: running sample Calculator using ant script Mon, 17 Mar, 09:29
Continuum VMBuild Server [continuum] BUILD FAILURE: Apache Tuscany SCA Implementation Project Mon, 17 Mar, 09:40
Continuum VMBuild Server [continuum] BUILD FAILURE: Apache Tuscany SCA Implementation Project Mon, 17 Mar, 09:42
Simon Nash (JIRA) [jira] Commented: (TUSCANY-2077) ConversationIds are not always unique Mon, 17 Mar, 10:21
Vamsavardhana Reddy (JIRA) [jira] Created: (TUSCANY-2090) Test for uniqueness of ConversationIds Mon, 17 Mar, 10:39
Vamsavardhana Reddy (JIRA) [jira] Commented: (TUSCANY-2077) ConversationIds are not always unique Mon, 17 Mar, 10:41
Kelvin Goodson (JIRA) [jira] Resolved: (TUSCANY-2080) XML Helper Load method fails to return SDO generated class when using the method that takes a java.xml.transform.Source Mon, 17 Mar, 11:17
Vamsavardhana Reddy (JIRA) [jira] Created: (TUSCANY-2091) Sample: Calculator (No Interfaces) sample Mon, 17 Mar, 11:37
Vamsavardhana Reddy (JIRA) [jira] Updated: (TUSCANY-2091) Sample: Calculator (No Interfaces) sample Mon, 17 Mar, 11:49
Simon Nash Re: Tests for Tuscany running under OSGi Mon, 17 Mar, 12:20
Simon Nash Re: Default build time and space consumption Mon, 17 Mar, 12:24
Continuum VMBuild Server [continuum] BUILD FAILURE: Apache Tuscany SCA Implementation Project Mon, 17 Mar, 12:40
Continuum VMBuild Server [continuum] BUILD FAILURE: Apache Tuscany SCA Implementation Project Mon, 17 Mar, 12:42
Jürgen Schumacher (JIRA) [jira] Updated: (TUSCANY-2086) implementation.osgi cannot find compomentType file when referring to bundles in Eclipse Workspace Mon, 17 Mar, 12:43
Simon Nash Re: Default build time and space consumption Mon, 17 Mar, 12:57
Simon Nash Re: Checking the TUSCANY-2077 test in? Re: svn commit: r637621 - in /incubator/tuscany/java/sca/modules/core/src/main/java/org/apache/tuscany/sca/core: assembly/ invocation/ Mon, 17 Mar, 13:16
ant elder Re: Default build time and space consumption Mon, 17 Mar, 13:19
Jürgen Schumacher (JIRA) [jira] Commented: (TUSCANY-2086) implementation.osgi cannot find compomentType file when referring to bundles in Eclipse Workspace Mon, 17 Mar, 13:19
Jürgen Schumacher (JIRA) [jira] Updated: (TUSCANY-2086) implementation.osgi cannot find compomentType file when referring to bundles in Eclipse Workspace Mon, 17 Mar, 13:19
Jürgen Schumacher (JIRA) [jira] Updated: (TUSCANY-2086) implementation.osgi cannot find compomentType file when referring to bundles in Eclipse Workspace Mon, 17 Mar, 13:21
Simon Laws Re: Checking the TUSCANY-2077 test in? Re: svn commit: r637621 - in /incubator/tuscany/java/sca/modules/core/src/main/java/org/apache/tuscany/sca/core: assembly/ invocation/ Mon, 17 Mar, 13:26
ant elder Re: Tests for Tuscany running under OSGi Mon, 17 Mar, 14:49
Vamsavardhana Reddy Re: Checking the TUSCANY-2077 test in? Re: svn commit: r637621 - in /incubator/tuscany/java/sca/modules/core/src/main/java/org/apache/tuscany/sca/core: assembly/ invocation/ Mon, 17 Mar, 14:54
Simon Laws (JIRA) [jira] Closed: (TUSCANY-2056) Conversation does not continue if a Service Reference is passed as a return value (not as a parameter) when using binding.ws Mon, 17 Mar, 15:07
Continuum VMBuild Server [continuum] BUILD SUCCESSFUL: Apache Tuscany SCA Implementation Project Mon, 17 Mar, 15:14
Simon Laws (JIRA) [jira] Resolved: (TUSCANY-2088) Incorrect ConversationEndedException:Conversation has expired. on reference Mon, 17 Mar, 15:15
Greg Dritschler (JIRA) [jira] Created: (TUSCANY-2092) ConcurrentModificationException in ExtensibleContributionListener Mon, 17 Mar, 15:19
ant elder (JIRA) [jira] Updated: (TUSCANY-1974) Chat webapp sample misses chat messages Mon, 17 Mar, 15:19
Simon Laws Re: Tests for Tuscany running under OSGi Mon, 17 Mar, 15:26
Simon Laws (JIRA) [jira] Closed: (TUSCANY-1951) node.addContribution incorrectly loads unused composites Mon, 17 Mar, 15:37
Rajini Sivaram Re: Tests for Tuscany running under OSGi Mon, 17 Mar, 15:45
Rajini Sivaram Re: Tests for Tuscany running under OSGi Mon, 17 Mar, 16:06
Luciano Resende (JIRA) [jira] Resolved: (TUSCANY-2089) java.lang.NoClassDefFoundError: running sample Calculator using ant script Mon, 17 Mar, 16:25
Simon Nash Re: Tests for Tuscany running under OSGi Mon, 17 Mar, 16:25
Rajini Sivaram Re: Tests for Tuscany running under OSGi Mon, 17 Mar, 16:47
Rajini Sivaram (JIRA) [jira] Commented: (TUSCANY-2086) implementation.osgi cannot find compomentType file when referring to bundles in Eclipse Workspace Mon, 17 Mar, 16:54
ant elder (JIRA) [jira] Created: (TUSCANY-2093) Hangs in osgi itests Mon, 17 Mar, 16:54
ant elder Re: [jira] Commented: (TUSCANY-2068) itest/osgi-implementation is broken due to recent changes Mon, 17 Mar, 16:57
Rajini Sivaram (JIRA) [jira] Commented: (TUSCANY-2093) Hangs in osgi itests Mon, 17 Mar, 17:10
Message list« Previous · 1 · 2 · 3 · 4 · 5 · 6 · 7 · 8 · 9 · 10 · 11 · 12 · 13 · 14 · 15 · Next »Thread · Author · Date
Box list
Aug 20162
Apr 20161
Mar 20161
Dec 20151
Nov 20151
Oct 201514
Aug 20152
Feb 20154
Jan 20151
Nov 20141
Aug 20143
Jul 20141
Jun 20142
May 20141
Apr 20143
Mar 20141
Nov 20137
Oct 201318
Sep 20138
Aug 201311
Jul 201315
Jun 20138
May 20138
Apr 20138
Feb 20136
Jan 20135
Dec 20128
Nov 201225
Oct 20127
Sep 201222
Aug 20122
Jul 201212
Jun 201243
May 201259
Apr 201245
Mar 2012108
Feb 201290
Jan 201253
Dec 201178
Nov 201155
Oct 2011119
Sep 2011143
Aug 2011417
Jul 2011236
Jun 2011224
May 2011196
Apr 2011193
Mar 2011213
Feb 2011372
Jan 2011206
Dec 2010143
Nov 2010283
Oct 2010503
Sep 2010600
Aug 2010277
Jul 2010314
Jun 2010382
May 2010397
Apr 2010245
Mar 2010452
Feb 2010269
Jan 2010483
Dec 2009147
Nov 2009487
Oct 2009729
Sep 2009430
Aug 2009505
Jul 2009548
Jun 2009603
May 2009659
Apr 2009627
Mar 2009604
Feb 2009816
Jan 2009611
Dec 2008531
Nov 2008586
Oct 2008447
Sep 2008624
Aug 2008905
Jul 2008898
Jun 20081126
May 20081032
Apr 20081273
Mar 20081445
Feb 2008990
Jan 2008988
Dec 2007526
Nov 2007814
Oct 2007949
Sep 20071733
Aug 20071694
Jul 20071560
Jun 20071029
May 20071184
Apr 20071040
Mar 20071369
Feb 20071320
Jan 20071292
Dec 2006892
Nov 20061213
Oct 20061570
Sep 20061284
Aug 20061676
Jul 20061234
Jun 2006840
May 20061483
Apr 2006756
Mar 2006709
Feb 2006292
Jan 2006342
Dec 200554