tuscany-dev mailing list archives

Site index · List index
Message view « Date » · « Thread »
Top « Date » · « Thread »
From Continuum VMBuild Server <contin...@apache.org>
Subject [continuum] BUILD FAILURE: Apache Tuscany SCA Implementation Project
Date Wed, 12 Mar 2008 12:37:49 GMT
Online report : http://vmbuild.apache.org/continuum/buildResult.action?buildId=64271&projectId=277

Build statistics:
  State: Failed
  Previous State: Ok
  Started at: Wed 12 Mar 2008 05:24:07 -0700
  Finished at: Wed 12 Mar 2008 05:24:56 -0700
  Total time: 49s
  Build Trigger: Schedule
  Build Number: 111
  Exit code: 1
  Building machine hostname: vmbuild.apache.org
  Operating system : Linux(unknown)
  Java Home version : 
          java version "1.5.0_12"
          Java(TM) 2 Runtime Environment, Standard Edition (build 1.5.0_12-b04)
          Java HotSpot(TM) Client VM (build 1.5.0_12-b04, mixed mode, sharing)
        
  Builder version :
          Maven version: 2.0.7
          Java version: 1.5.0_12
          OS name: "linux" version: "2.6.20-16-server" arch: "i386"
    
****************************************************************************
SCM Changes:
****************************************************************************
Changed: svkrish @ Wed 12 Mar 2008 05:09:58 -0700
Comment: cleaning up policy computation and fixing holes in policy inheritance in operations
Files changed:
  /incubator/tuscany/java/sca/modules/assembly/src/main/java/org/apache/tuscany/sca/assembly/builder/impl/BindingPolicyComputer.java
( 636290 )
  /incubator/tuscany/java/sca/modules/assembly/src/main/java/org/apache/tuscany/sca/assembly/builder/impl/CompositeWireBuilderImpl.java
( 636290 )
  /incubator/tuscany/java/sca/modules/assembly/src/main/java/org/apache/tuscany/sca/assembly/builder/impl/ImplementationPolicyComputer.java
( 636290 )
  /incubator/tuscany/java/sca/modules/assembly/src/main/java/org/apache/tuscany/sca/assembly/builder/impl/PolicyComputer.java
( 636290 )
  /incubator/tuscany/java/sca/modules/assembly-xml/src/main/java/org/apache/tuscany/sca/assembly/xml/BaseAssemblyProcessor.java
( 636290 )
  /incubator/tuscany/java/sca/modules/assembly-xml/src/main/java/org/apache/tuscany/sca/assembly/xml/CompositeProcessor.java
( 636290 )
  /incubator/tuscany/java/sca/modules/implementation-java-xml/src/test/java/org/apache/tuscany/sca/implementation/java/xml/ReadTestCase.java
( 636290 )
  /incubator/tuscany/java/sca/modules/implementation-java-xml/src/test/resources/org/apache/tuscany/sca/implementation/java/xml/definitions.xml
( 636290 )
  /incubator/tuscany/java/sca/modules/policy/src/main/java/org/apache/tuscany/sca/policy/util/PolicyValidationUtils.java
( 636290 )

****************************************************************************
Dependencies Changes:
****************************************************************************
No dependencies changed


****************************************************************************
Build Defintion:
****************************************************************************
POM filename: pom.xml
Goals: -Pdistribution clean install   
Arguments: --batch-mode
Build Fresh: false
Always Build: false
Default Build Definition: true
Schedule: DEFAULT_SCHEDULE
Profile Name: Java 5, Large Memory
Description: 


****************************************************************************
Test Summary:
****************************************************************************
Tests: 1047
Failures: 0
Total time: 943372

****************************************************************************
Output:
****************************************************************************
[INFO] Scanning for projects...
[INFO] Reactor build order: 
[INFO]   Apache Tuscany SCA Implementation Project
[INFO]   Apache Tuscany SCA Implementation Modules
[INFO]   Apache Tuscany SCA Extensibility
[INFO]   Apache Tuscany SCA Policy Model
[INFO]   Apache Tuscany SCA Interface Model
[INFO]   Apache Tuscany SCA Assembly Model
[INFO]   Apache Tuscany SCA Assembly Model Java DSL
[INFO]   Apache Tuscany SCA Assembly Model XML Schemas
[INFO]   Apache Tuscany SCA Definitions
[INFO]   Apache Tuscany SCA Contribution Model
[INFO]   Apache Tuscany SCA Policy XML Model
[INFO]   Apache Tuscany SCA Definitions XML Model
[INFO]   Apache Tuscany SCA API
[INFO]   Apache Tuscany SCA Core SPI
[INFO]   Apache Tuscany SCA Namespace Import/Export Model
[INFO]   Apache Tuscany SCA Java Import/Export Model
[INFO]   Apache Tuscany SCA XML Contribution Model
[INFO]   Apache Tuscany SCA Resource Import/Export Model
[INFO]   Apache Tuscany SCA Contribution Model Implementation
[INFO]   Apache Tuscany SCA XML Assembly Model
[INFO]   Apache Tuscany SCA Java Interface Model
[INFO]   Apache Tuscany SCA Core Runtime
[INFO]   Apache Tuscany SCA Domain API
[INFO]   Apache Tuscany SCA Domain
[INFO]   Apache Tuscany SCA Node API
[INFO]   Apache Tuscany SCA Node
[INFO]   Apache Tuscany SCA Default Binding Model
[INFO]   Apache Tuscany SCA Default Binding XML Model
[INFO]   Apache Tuscany SCA DataBinding Framework
[INFO]   Apache Tuscany SCA Java Interface XML Model
[INFO]   Apache Tuscany SCA Data Binding for JAXB
[INFO]   Apache Tuscany Java Interface for JAXWS
[INFO]   Apache Tuscany SCA Core/DataBinding Integration
[INFO]   Apache Tuscany SCA Embedded Host
[INFO]   Apache Tuscany SCA Extension Helper
[INFO]   Apache Tuscany SCA HTTP Servlet Host Extension Point
[INFO]   Apache Tuscany SCA AJAX DWR Binding Extension
[INFO]   Apache Tuscany SCA Java Implementation Model
[INFO]   Apache Tuscany SCA Java Implementation XML Model
[INFO]   Apache Tuscany Logging Policy Model
[INFO]   Apache Tuscany Security Policy Model
[INFO]   Apache Tuscany SCA Java Implementation Model
[INFO]   Apache Tuscany SCA EJB Binding Extension
[INFO]   Apache Tuscany SCA Data Implementation API
[INFO]   Apache Tuscany SCA Tomcat Servlet Host Extension
[INFO]   Apache Tuscany SCA Atom+RSS Feed Binding Extension
[INFO]   Apache Tuscany SCA Atom Feed Binding Extension
[INFO]   Apache Tuscany SCA Atom Feed Binding Extension
[INFO]   Apache Tuscany SCA RSS Feed Binding Extension
[INFO]   Apache Tuscany SCA RSS Feed Binding Extension
[INFO]   Apache Tuscany SCA Jetty Servlet Host Extension
[INFO]   Apache Tuscany SCA Resource Implementation Extension
[INFO]   Apache Tuscany SCA HTTP Binding Extension
[INFO]   Apache Tuscany SCA Data Binding for Axiom
[INFO]   Apache Tuscany SCA JMS Binding Extension
[INFO]   Apache Tuscany SCA Data Binding for JSON
[INFO]   Apache Tuscany SCA JSON-RPC Binding Extension
[INFO]   Apache Tuscany SCA WSDL Interface Model
[INFO]   Apache Tuscany SCA Notification Implementation Extension
[INFO]   Apache Tuscany SCA Notification Binding Extension
[INFO]   Apache Tuscany SCA RMI Host Extension Point
[INFO]   Apache Tuscany SCA RMI Binding Extension
[INFO]   Apache Tuscany SCA WSDL Interface XML Model
[INFO]   Apache Tuscany SCA WSDL Interface Java2WSDL Helper
[INFO]   Apache Tuscany SCA WS Binding Model
[INFO]   Apache Tuscany SCA WS Binding XML Model
[INFO]   Apache Tuscany SCA Axis2-based WS Binding Extension
[INFO]   Apache Tuscany SCA Axis2-based Default Binding Extension
[INFO]   Apache Tuscany SCA Groovy contributions
[INFO]   Apache Tuscany OSGi Runtime Helper Library
[INFO]   Apache Tuscany SCA Contribution Service OSGi
[INFO]   Apache Tuscany SCA Spring-based Core Runtime
[INFO]   Apache Tuscany SCA Data Binding for SDO
[INFO]   Apache Tuscany SCA Data Binding for SDO/AXIOM
[INFO]   Installer for Saxon
[INFO]   Apache Tuscany SCA Data Binding for Saxon
[INFO]   Apache Tuscany SCA Data Binding for XmlBeans
[INFO]   Apache Tuscany Data Binding for FastInfoset
[INFO]   Apache Tuscany SCA Data Binding for XStream
[INFO]   Apache Tuscany SCA Data Engine Helper
[INFO]   Apache Tuscany SCA Domain Implementation
[INFO]   Apache Tuscany SCA Webapp Host
[INFO]   Apache Tuscany SCA Webapp JUnit Host
[INFO]   Apache Tuscany SCA BPEL Implementation Extension
[INFO]   Apache Tuscany SCA DAS Implementation Extension
[INFO]   Apache Tuscany SCA Data Implementation Extension
[INFO]   Apache Tuscany SCA EJB Session Bean Implementation Model
[INFO]   Apache Tuscany EJB Session Bean Implementation XML Model
[INFO]   Apache Tuscany SCA Node Implementation Model
[INFO]   Apache Tuscany Node Implementation XML Model
[INFO]   Apache Tuscany SCA Node Implementation Extension
[INFO]   Apache Tuscany SCA OSGi Implementation Extension
[INFO]   Apache Tuscany SCA Script Implementation Extension
[INFO]   Apache Tuscany SCA Spring Framework Implementation Extension
[INFO]   Apache Tuscany SCA Widget Implementation Extension
[INFO]   Apache Tuscany SCA XQuery Implementation Extension
[INFO]   Apache Tuscany SCA Node API
[INFO]   Apache Tuscany SCA Node Implementation
[INFO]   Apache Tuscany SCA Node Implementation
[INFO]   Apache Tuscany SCA Transaction Policy Model
[INFO]   Apache Tuscany SCA Runtime
[INFO]   Apache Tuscany SCA Runtime for Tomcat deep integration
[INFO]   Apache Tuscany SCA WAR Runtime
[INFO]   Apache Tuscany SCA Workspace Model
[INFO]   Apache Tuscany SCA XML Workspace Model
[INFO]   Apache Tuscany SCA Workspace Implementation
[INFO]   Apache Tuscany SCA Workspace Administration
[INFO]   Apache Tuscany SCA Tools
[INFO]   Apache Tuscany SCA Eclipse Tools
[INFO]   Apache Tuscany SCA Eclipse Tools Feature
[INFO]   Apache Tuscany SCA Eclipse Tools Core Plugin
[INFO]   Apache Tuscany SCA Java2WSDL Tool
[INFO]   Apache Tuscany SCA Eclipse Tools Runtime Plugin
[INFO]   Apache Tuscany SCA Eclipse Tools Update Site
[INFO]   Apache Tuscany SCA Maven Tools
[INFO]   Apache Tuscany SCA Ant Build Generator Maven Plugin
[INFO]   Apache Tuscany SCA Definitions Shade Transformer for Distribution Bundle
[INFO]   Apache Tuscany SCA Dependency Lister Maven Plugin
[INFO]   Apache Tuscany SCA Incremental Build Generator Maven Plugin
[INFO]   Apache Tuscany SCA Java2WSDL Maven Plugin
[INFO]   Apache Tuscany SCA Web JUnit Maven Plugin
[INFO]   Apache Tuscany SCA WSDL2Java Tool
[INFO]   Apache Tuscany SCA WSDL2Java Maven Plugin
[INFO]   Apache Tuscany SCA Echo Binding Extension Sample
[INFO]   Apache Tuscany SCA Echo Binding Sample Application
[INFO]   Apache Tuscany SCA Notification Binding Broker Sample
[INFO]   Apache Tuscany SCA Notification Binding Consumer Sample
[INFO]   Apache Tuscany SCA Notification Binding Producer Sample
[INFO]   Apache Tuscany SCA Calculator Sample
[INFO]   Apache Tuscany SCA Distributed Calculator Sample
[INFO]   Apache Tuscany SCA Calculator Sample using Implementation Policies
[INFO]   Apache Tuscany SCA Calculator RMI Reference Sample
[INFO]   Apache Tuscany SCA Calculator RMI Service Sample
[INFO]   Apache Tuscany SCA Calculator Sample using Scripting Languages
[INFO]   Apache Tuscany SCA Calculator Sample in a WebApp
[INFO]   Apache Tuscany SCA Calculator Sample Web Service enabled for 
WS Security and in a WebApp
[INFO]   Apache Tuscany SCA Calculator Sample Web Service in a WebApp
[INFO]   Apache Tuscany SCA Callback Web Service Sample
[INFO]   Apache Tuscany SCA Callback Web Service Remote Client Sample
[INFO]   Apache Tuscany SCA Chat Sample WebApp
[INFO]   Apache Tuscany SCA Echo Data Binding Sample
[INFO]   Apache Tuscany SCA Atom+RSS Feed Aggregator Sample
[INFO]   Apache Tuscany SCA Atom+RSS Feed Aggregator Sample Webapp
[INFO]   Apache Tuscany SCA HelloWorld BPEL Sample
[INFO]   Apache Tuscany SCA HelloWorld DOJO Sample WebApp
[INFO]   Apache Tuscany SCA JMS HelloWorld Sample in a WebApp
[INFO]   Apache Tuscany SCA HelloWorld JSON-RPC Sample WebApp
[INFO]   Apache Tuscany SCA HelloWorld Web Service JMS Sample
[INFO]   Apache Tuscany SCA HelloWorld Reference JMS Sample
[INFO]   Apache Tuscany SCA HelloWorld Service JMS Sample
[INFO]   Apache Tuscany SCA HelloWorld Web Service Sample
[INFO]   Apache Tuscany SCA HelloWorld Secure Web Service Sample
[INFO]   Apache Tuscany SCA HelloWorld Web Service Reference Sample
[INFO]   Apache Tuscany SCA HelloWorld Web Service Reference JMS Sample
[INFO]   Apache Tuscany SCA HelloWorld Secure Web Service Reference Sample
[INFO]   Apache Tuscany SCA HelloWorld Web Service SDO Sample
[INFO]   Apache Tuscany SCA HelloWorld Web Service SDO Sample WebApp
[INFO]   Apache Tuscany SCA Composite Sample
[INFO]   Apache Tuscany SCA CRUD Implementation Extension Sample
[INFO]   Apache Tuscany SCA CRUD Implementation Extension Sample Client
[INFO]   Apache Tuscany SCA Notification Implementation Sample
[INFO]   Apache Tuscany SCA POJO Implementation Extension Sample
[INFO]   Apache Tuscany SCA Loan Application Conversation Sample
[INFO]   Apache Tuscany SCA OSGi Supply Chain Sample
[INFO]   Apache Tuscany SCA XQuery Quote Implementation Sample
[INFO]   Apache Tuscany SCA Simplified BigBank Sample
[INFO]   Apache Tuscany SCA Spring-Based Simplified BigBank Sample
[INFO]   Apache Tuscany SCA Simple Callback Sample
[INFO]   Apache Tuscany SCA Simple Callback Web Service Sample
[INFO]   Apache Tuscany SCA Getting Started Online Store Sample
[INFO]   Apache Tuscany SCA Supply Chain Sample
[INFO]   Apache Tuscany SCA Web Resource Sample
[INFO]   Apache Tuscany SCA Samples
[INFO]   Apache Tuscany SCA Integration Tests
[INFO]   Apache Tuscany SCA Callable References Integration Tests
[INFO]   Apache Tuscany Test for Callable References over Web Services
[INFO]   Apache Tuscany SCA Callback API Integration Tests
[INFO]   Apache Tuscany SCA Callback Basic Integration Tests
[INFO]   Apache Tuscany SCA Callback Complex Type Integration Tests
[INFO]   Apache Tuscany SCA Callback ID Integration Tests
[INFO]   Apache Tuscany SCA Callback With Mutiple Wires Test
[INFO]   Apache Tuscany SCA Set Callback Integration Tests
[INFO]   Apache Tuscany SCA Callback Set Conversation Integration Tests
[INFO]   Apache Tuscany SCA Contribution Integration Tests
[INFO]   Apache Tuscany SCA Multiple Contribution Integration Tests
[INFO]   Apache Tuscany SCA Contribution Export Integration Tests
[INFO]   Apache Tuscany SCA Contribution Java Export Integration Tests
[INFO]   Apache Tuscany SCA Contribution Resource Export Integration Tests
[INFO]   Apache Tuscany SCA Contribution WSDL Export Integration Tests
[INFO]   Apache Tuscany SCA Contribution Import Integration Tests
[INFO]   Apache Tuscany SCA Contribution Java Import Java Integration Tests
[INFO]   Apache Tuscany SCA Contribution Resource Import Java Integration Tests
[INFO]   Apache Tuscany SCA Contribution WSDL Import Integration Tests
[INFO]   Apache Tuscany SCA Contribution Import/Export Integration Tests
[INFO]   Apache Tuscany Contribution ClassLoader Test : Contribution Classes
[INFO]   Apache Tuscany Contribution Classloader tests
[INFO]   Apache Tuscany Contribution ClassLoader Integration Tests
[INFO]   Apache Tuscany SCA Conversations Integration Tests
[INFO]   Apache Tuscany SCA Conversations Over binding.ws Integration Tests
[INFO]   Apache Tuscany SCA Databindings Integration Tests
[INFO]   Apache Tuscany SCA Databinding Common Integration Tests
[INFO]   Apache Tuscany SCA SDO Databinding Integration Tests
[INFO]   Apache Tuscany SCA JAXB Databinding Integration Tests
[INFO]   Apache Tuscany SCA DataBinding Interop Integration Tests
[INFO]   Apache Tuscany SCA Domain Integration Tests
[INFO]   Apache Tuscany SCA Exceptions Integration Tests
[INFO]   Apache Tuscany SCA Cross-Binding Exceptions Integration Tests
[INFO]   Apache Tuscany SCA WS Binding Exceptions Integration Tests
[INFO]   Apache Tuscany Test for Simple Exceptions over Web Services
[INFO]   Apache Tuscany SCA Extended API Integration Tests
[INFO]   Apache Tuscany SCA JMS Tests
[INFO]   Apache Tuscany SCA Web Service with Large SDO Integration Tests
[INFO]   Apache Tuscany SCA OneWay Integration Tests
[INFO]   Apache Tuscany SCA Operation Overloading Integration Tests
[INFO]   Apache Tuscany OSGi Contribution Version 2 classes
[INFO]   Apache Tuscany OSGi Contribution Version 1 classes
[INFO]   Apache Tuscany OSGi Contribution tests
[INFO]   Apache Tuscany OSGi Contribution Tests
[INFO]   Apache Tuscany SCA Properties Integration Tests
[INFO]   Apache Tuscany SCA Recursive Composition Integration Tests
[INFO]   Apache Tuscany SCA References Integration Tests
[INFO]   Apache Tuscany SCA Services Integration Tests
[INFO]   Apache Tuscany SCA Component Type Integration Tests
[INFO]   Apache Tuscany Interface Integration Tests
[INFO]   Apache Tuscany SCA Wires Basic Integration Tests
[INFO]   Apache Tuscany SCA Scopes Integration Tests
[INFO]   Apache Tuscany SCA WSDL Support Integration Tests
[INFO]   Apache Tuscany SCA WSDLless Support Integration Tests
[INFO]   Apache Tuscany SCA WSDL2Java Integration Tests
[INFO]   Apache Tuscany SCA Multiple WSDL File Support Integration Tests
[INFO]   Apache Tuscany SCA Web Services Void Args and Return Test
[INFO]   Apache Tuscany SCA Transaction Policy Integration Test
[INFO]   Apache Tuscany SCA BPEL Integration Tests
[INFO]   Apache Tuscany SCA HelloWorld BPEL iTest
[INFO]   Apache Tuscany SCA Implementation.spring Integration Tests
[INFO]   Apache Tuscany SCA Policy Framework Integration Tests
[INFO]   Apache Tuscany SCA Bundle Jar
[INFO]   Apache Tuscany SCA Manifest Jar
[INFO]   Apache Tuscany SCA WebApp Runtime
[INFO]   Apache Tuscany SCA Distribution
[INFO] ----------------------------------------------------------------------------
[INFO] Building Apache Tuscany SCA Implementation Project
[INFO]    task-segment: [clean, install]
[INFO] ----------------------------------------------------------------------------
[INFO] artifact org.apache.maven.plugins:maven-clean-plugin: checking for updates from apache.incubator
[INFO] artifact org.apache.maven.plugins:maven-clean-plugin: checking for updates from codehaus-snapshot
[INFO] [clean:clean]
[INFO] Deleting directory /home/continuum/data/working-directory/277/target
[INFO] Deleting directory /home/continuum/data/working-directory/277/target/classes
[INFO] Deleting directory /home/continuum/data/working-directory/277/target/test-classes
[INFO] Deleting directory /home/continuum/data/working-directory/277/target/site
[INFO] artifact org.apache.maven.plugins:maven-site-plugin: checking for updates from apache.incubator
[INFO] artifact org.apache.maven.plugins:maven-site-plugin: checking for updates from codehaus-snapshot
[INFO] artifact org.apache.maven.plugins:maven-install-plugin: checking for updates from apache.incubator
[INFO] artifact org.apache.maven.plugins:maven-install-plugin: checking for updates from codehaus-snapshot
[INFO] [site:attach-descriptor]
[INFO] [install:install]
[INFO] Installing /home/continuum/data/working-directory/277/pom.xml to /home/continuum/.m2/repository/org/apache/tuscany/sca/tuscany-sca/1.2-incubating-SNAPSHOT/tuscany-sca-1.2-incubating-SNAPSHOT.pom
[INFO] ----------------------------------------------------------------------------
[INFO] Building Apache Tuscany SCA Implementation Modules
[INFO]    task-segment: [clean, install]
[INFO] ----------------------------------------------------------------------------
[INFO] [clean:clean]
[INFO] Deleting directory /home/continuum/data/working-directory/277/modules/target
[INFO] Deleting directory /home/continuum/data/working-directory/277/modules/target/classes
[INFO] Deleting directory /home/continuum/data/working-directory/277/modules/target/test-classes
[INFO] Deleting directory /home/continuum/data/working-directory/277/modules/target/site
[INFO] [site:attach-descriptor]
[INFO] [install:install]
[INFO] Installing /home/continuum/data/working-directory/277/modules/pom.xml to /home/continuum/.m2/repository/org/apache/tuscany/sca/tuscany-modules/1.2-incubating-SNAPSHOT/tuscany-modules-1.2-incubating-SNAPSHOT.pom
[INFO] ----------------------------------------------------------------------------
[INFO] Building Apache Tuscany SCA Extensibility
[INFO]    task-segment: [clean, install]
[INFO] ----------------------------------------------------------------------------
[INFO] [clean:clean]
[INFO] Deleting directory /home/continuum/data/working-directory/277/modules/extensibility/target
[INFO] Deleting directory /home/continuum/data/working-directory/277/modules/extensibility/target/classes
[INFO] Deleting directory /home/continuum/data/working-directory/277/modules/extensibility/target/test-classes
[INFO] Deleting directory /home/continuum/data/working-directory/277/modules/extensibility/target/site
[INFO] artifact org.apache.maven.plugins:maven-resources-plugin: checking for updates from
apache.incubator
[INFO] artifact org.apache.maven.plugins:maven-resources-plugin: checking for updates from
codehaus-snapshot
[INFO] [resources:resources]
[INFO] Using default encoding to copy filtered resources.
[INFO] [compiler:compile]
[INFO] Compiling 2 source files to /home/continuum/data/working-directory/277/modules/extensibility/target/classes
[INFO] [resources:testResources]
[INFO] Using default encoding to copy filtered resources.
[INFO] [compiler:testCompile]
[INFO] Nothing to compile - all classes are up to date
[INFO] [surefire:test]
[INFO] No tests to run.
[INFO] [jar:jar]
[INFO] Building jar: /home/continuum/data/working-directory/277/modules/extensibility/target/tuscany-extensibility-1.2-incubating-SNAPSHOT.jar
[INFO] [install:install]
[INFO] Installing /home/continuum/data/working-directory/277/modules/extensibility/target/tuscany-extensibility-1.2-incubating-SNAPSHOT.jar
to /home/continuum/.m2/repository/org/apache/tuscany/sca/tuscany-extensibility/1.2-incubating-SNAPSHOT/tuscany-extensibility-1.2-incubating-SNAPSHOT.jar
[INFO] ----------------------------------------------------------------------------
[INFO] Building Apache Tuscany SCA Policy Model
[INFO]    task-segment: [clean, install]
[INFO] ----------------------------------------------------------------------------
[INFO] [clean:clean]
[INFO] Deleting directory /home/continuum/data/working-directory/277/modules/policy/target
[INFO] Deleting directory /home/continuum/data/working-directory/277/modules/policy/target/classes
[INFO] Deleting directory /home/continuum/data/working-directory/277/modules/policy/target/test-classes
[INFO] Deleting directory /home/continuum/data/working-directory/277/modules/policy/target/site
[INFO] [resources:resources]
[INFO] Using default encoding to copy filtered resources.
[INFO] [compiler:compile]
[INFO] Compiling 32 source files to /home/continuum/data/working-directory/277/modules/policy/target/classes
[INFO] [resources:testResources]
[INFO] Using default encoding to copy filtered resources.
[INFO] [compiler:testCompile]
[INFO] Compiling 1 source file to /home/continuum/data/working-directory/277/modules/policy/target/test-classes
[INFO] [surefire:test]
[INFO] Surefire report directory: /home/continuum/data/working-directory/277/modules/policy/target/surefire-reports

-------------------------------------------------------
 T E S T S
-------------------------------------------------------
Running org.apache.tuscany.sca.policy.PolicyFactoryTestCase
Tests run: 2, Failures: 0, Errors: 0, Skipped: 0, Time elapsed: 0.04 sec

Results :

Tests run: 2, Failures: 0, Errors: 0, Skipped: 0

[INFO] [jar:jar]
[INFO] Building jar: /home/continuum/data/working-directory/277/modules/policy/target/tuscany-policy-1.2-incubating-SNAPSHOT.jar
[INFO] [install:install]
[INFO] Installing /home/continuum/data/working-directory/277/modules/policy/target/tuscany-policy-1.2-incubating-SNAPSHOT.jar
to /home/continuum/.m2/repository/org/apache/tuscany/sca/tuscany-policy/1.2-incubating-SNAPSHOT/tuscany-policy-1.2-incubating-SNAPSHOT.jar
[INFO] ----------------------------------------------------------------------------
[INFO] Building Apache Tuscany SCA Interface Model
[INFO]    task-segment: [clean, install]
[INFO] ----------------------------------------------------------------------------
[INFO] [clean:clean]
[INFO] Deleting directory /home/continuum/data/working-directory/277/modules/interface/target
[INFO] Deleting directory /home/continuum/data/working-directory/277/modules/interface/target/classes
[INFO] Deleting directory /home/continuum/data/working-directory/277/modules/interface/target/test-classes
[INFO] Deleting directory /home/continuum/data/working-directory/277/modules/interface/target/site
[INFO] [resources:resources]
[INFO] Using default encoding to copy filtered resources.
[INFO] [compiler:compile]
[INFO] Compiling 23 source files to /home/continuum/data/working-directory/277/modules/interface/target/classes
[INFO] [resources:testResources]
[INFO] Using default encoding to copy filtered resources.
[INFO] [compiler:testCompile]
[INFO] Compiling 2 source files to /home/continuum/data/working-directory/277/modules/interface/target/test-classes
[INFO] [surefire:test]
[INFO] Surefire report directory: /home/continuum/data/working-directory/277/modules/interface/target/surefire-reports

-------------------------------------------------------
 T E S T S
-------------------------------------------------------
Running org.apache.tuscany.sca.interfacedef.impl.ContractCompatibilityTestCase
Tests run: 13, Failures: 0, Errors: 0, Skipped: 0, Time elapsed: 0.067 sec
Running org.apache.tuscany.sca.interfacedef.impl.InterfaceContractTestCase
Tests run: 1, Failures: 0, Errors: 0, Skipped: 0, Time elapsed: 0.018 sec

Results :

Tests run: 14, Failures: 0, Errors: 0, Skipped: 0

[INFO] [jar:jar]
[INFO] Building jar: /home/continuum/data/working-directory/277/modules/interface/target/tuscany-interface-1.2-incubating-SNAPSHOT.jar
[INFO] [install:install]
[INFO] Installing /home/continuum/data/working-directory/277/modules/interface/target/tuscany-interface-1.2-incubating-SNAPSHOT.jar
to /home/continuum/.m2/repository/org/apache/tuscany/sca/tuscany-interface/1.2-incubating-SNAPSHOT/tuscany-interface-1.2-incubating-SNAPSHOT.jar
[INFO] ----------------------------------------------------------------------------
[INFO] Building Apache Tuscany SCA Assembly Model
[INFO]    task-segment: [clean, install]
[INFO] ----------------------------------------------------------------------------
[INFO] [clean:clean]
[INFO] Deleting directory /home/continuum/data/working-directory/277/modules/assembly/target
[INFO] Deleting directory /home/continuum/data/working-directory/277/modules/assembly/target/classes
[INFO] Deleting directory /home/continuum/data/working-directory/277/modules/assembly/target/test-classes
[INFO] Deleting directory /home/continuum/data/working-directory/277/modules/assembly/target/site
[INFO] [resources:resources]
[INFO] Using default encoding to copy filtered resources.
[INFO] [compiler:compile]
[INFO] Compiling 74 source files to /home/continuum/data/working-directory/277/modules/assembly/target/classes
[INFO] ------------------------------------------------------------------------
[ERROR] BUILD FAILURE
[INFO] ------------------------------------------------------------------------
[INFO] Compilation failure

/home/continuum/data/working-directory/277/modules/assembly/src/main/java/org/apache/tuscany/sca/assembly/builder/impl/BindingPolicyComputer.java:[39,42]
cannot find symbol
symbol  : class PolicyComputationUtils
location: package org.apache.tuscany.sca.policy.util

/home/continuum/data/working-directory/277/modules/assembly/src/main/java/org/apache/tuscany/sca/assembly/builder/impl/CompositeWireBuilderImpl.java:[52,42]
cannot find symbol
symbol  : class PolicyComputationUtils
location: package org.apache.tuscany.sca.policy.util

/home/continuum/data/working-directory/277/modules/assembly/src/main/java/org/apache/tuscany/sca/assembly/builder/impl/BindingPolicyComputer.java:[225,20]
cannot find symbol
symbol  : variable PolicyComputationUtils
location: class org.apache.tuscany.sca.assembly.builder.impl.BindingPolicyComputer

/home/continuum/data/working-directory/277/modules/assembly/src/main/java/org/apache/tuscany/sca/assembly/builder/impl/BindingPolicyComputer.java:[230,20]
cannot find symbol
symbol  : variable PolicyComputationUtils
location: class org.apache.tuscany.sca.assembly.builder.impl.BindingPolicyComputer

/home/continuum/data/working-directory/277/modules/assembly/src/main/java/org/apache/tuscany/sca/assembly/builder/impl/CompositeWireBuilderImpl.java:[829,8]
cannot find symbol
symbol  : variable PolicyComputationUtils
location: class org.apache.tuscany.sca.assembly.builder.impl.CompositeWireBuilderImpl

/home/continuum/data/working-directory/277/modules/assembly/src/main/java/org/apache/tuscany/sca/assembly/builder/impl/CompositeWireBuilderImpl.java:[831,8]
cannot find symbol
symbol  : variable PolicyComputationUtils
location: class org.apache.tuscany.sca.assembly.builder.impl.CompositeWireBuilderImpl

/home/continuum/data/working-directory/277/modules/assembly/src/main/java/org/apache/tuscany/sca/assembly/builder/impl/CompositeWireBuilderImpl.java:[838,11]
cannot find symbol
symbol  : variable PolicyComputationUtils
location: class org.apache.tuscany.sca.assembly.builder.impl.CompositeWireBuilderImpl

/home/continuum/data/working-directory/277/modules/assembly/src/main/java/org/apache/tuscany/sca/assembly/builder/impl/CompositeWireBuilderImpl.java:[841,11]
cannot find symbol
symbol  : variable PolicyComputationUtils
location: class org.apache.tuscany.sca.assembly.builder.impl.CompositeWireBuilderImpl

/home/continuum/data/working-directory/277/modules/assembly/src/main/java/org/apache/tuscany/sca/assembly/builder/impl/CompositeWireBuilderImpl.java:[876,20]
cannot find symbol
symbol  : variable PolicyComputationUtils
location: class org.apache.tuscany.sca.assembly.builder.impl.CompositeWireBuilderImpl

/home/continuum/data/working-directory/277/modules/assembly/src/main/java/org/apache/tuscany/sca/assembly/builder/impl/CompositeWireBuilderImpl.java:[878,20]
cannot find symbol
symbol  : variable PolicyComputationUtils
location: class org.apache.tuscany.sca.assembly.builder.impl.CompositeWireBuilderImpl

/home/continuum/data/working-directory/277/modules/assembly/src/main/java/org/apache/tuscany/sca/assembly/builder/impl/CompositeWireBuilderImpl.java:[904,21]
cannot find symbol
symbol  : variable PolicyComputationUtils
location: class org.apache.tuscany.sca.assembly.builder.impl.CompositeWireBuilderImpl

/home/continuum/data/working-directory/277/modules/assembly/src/main/java/org/apache/tuscany/sca/assembly/builder/impl/CompositeWireBuilderImpl.java:[905,21]
cannot find symbol
symbol  : variable PolicyComputationUtils
location: class org.apache.tuscany.sca.assembly.builder.impl.CompositeWireBuilderImpl

/home/continuum/data/working-directory/277/modules/assembly/src/main/java/org/apache/tuscany/sca/assembly/builder/impl/CompositeWireBuilderImpl.java:[914,33]
cannot find symbol
symbol  : variable PolicyComputationUtils
location: class org.apache.tuscany.sca.assembly.builder.impl.CompositeWireBuilderImpl

/home/continuum/data/working-directory/277/modules/assembly/src/main/java/org/apache/tuscany/sca/assembly/builder/impl/CompositeWireBuilderImpl.java:[915,33]
cannot find symbol
symbol  : variable PolicyComputationUtils
location: class org.apache.tuscany.sca.assembly.builder.impl.CompositeWireBuilderImpl

/home/continuum/data/working-directory/277/modules/assembly/src/main/java/org/apache/tuscany/sca/assembly/builder/impl/CompositeWireBuilderImpl.java:[928,20]
cannot find symbol
symbol  : variable PolicyComputationUtils
location: class org.apache.tuscany.sca.assembly.builder.impl.CompositeWireBuilderImpl

/home/continuum/data/working-directory/277/modules/assembly/src/main/java/org/apache/tuscany/sca/assembly/builder/impl/CompositeWireBuilderImpl.java:[930,20]
cannot find symbol
symbol  : variable PolicyComputationUtils
location: class org.apache.tuscany.sca.assembly.builder.impl.CompositeWireBuilderImpl

/home/continuum/data/working-directory/277/modules/assembly/src/main/java/org/apache/tuscany/sca/assembly/builder/impl/CompositeWireBuilderImpl.java:[944,24]
cannot find symbol
symbol  : variable PolicyComputationUtils
location: class org.apache.tuscany.sca.assembly.builder.impl.CompositeWireBuilderImpl

/home/continuum/data/working-directory/277/modules/assembly/src/main/java/org/apache/tuscany/sca/assembly/builder/impl/CompositeWireBuilderImpl.java:[946,24]
cannot find symbol
symbol  : variable PolicyComputationUtils
location: class org.apache.tuscany.sca.assembly.builder.impl.CompositeWireBuilderImpl

/home/continuum/data/working-directory/277/modules/assembly/src/main/java/org/apache/tuscany/sca/assembly/builder/impl/CompositeWireBuilderImpl.java:[960,20]
cannot find symbol
symbol  : variable PolicyComputationUtils
location: class org.apache.tuscany.sca.assembly.builder.impl.CompositeWireBuilderImpl

/home/continuum/data/working-directory/277/modules/assembly/src/main/java/org/apache/tuscany/sca/assembly/builder/impl/CompositeWireBuilderImpl.java:[961,20]
cannot find symbol
symbol  : variable PolicyComputationUtils
location: class org.apache.tuscany.sca.assembly.builder.impl.CompositeWireBuilderImpl

/home/continuum/data/working-directory/277/modules/assembly/src/main/java/org/apache/tuscany/sca/assembly/builder/impl/CompositeWireBuilderImpl.java:[965,20]
cannot find symbol
symbol  : variable PolicyComputationUtils
location: class org.apache.tuscany.sca.assembly.builder.impl.CompositeWireBuilderImpl

/home/continuum/data/working-directory/277/modules/assembly/src/main/java/org/apache/tuscany/sca/assembly/builder/impl/CompositeWireBuilderImpl.java:[967,20]
cannot find symbol
symbol  : variable PolicyComputationUtils
location: class org.apache.tuscany.sca.assembly.builder.impl.CompositeWireBuilderImpl

/home/continuum/data/working-directory/277/modules/assembly/src/main/java/org/apache/tuscany/sca/assembly/builder/impl/CompositeWireBuilderImpl.java:[982,24]
cannot find symbol
symbol  : variable PolicyComputationUtils
location: class org.apache.tuscany.sca.assembly.builder.impl.CompositeWireBuilderImpl

/home/continuum/data/working-directory/277/modules/assembly/src/main/java/org/apache/tuscany/sca/assembly/builder/impl/CompositeWireBuilderImpl.java:[984,24]
cannot find symbol
symbol  : variable PolicyComputationUtils
location: class org.apache.tuscany.sca.assembly.builder.impl.CompositeWireBuilderImpl

/home/continuum/data/working-directory/277/modules/assembly/src/main/java/org/apache/tuscany/sca/assembly/builder/impl/CompositeWireBuilderImpl.java:[1004,20]
cannot find symbol
symbol  : variable PolicyComputationUtils
location: class org.apache.tuscany.sca.assembly.builder.impl.CompositeWireBuilderImpl

/home/continuum/data/working-directory/277/modules/assembly/src/main/java/org/apache/tuscany/sca/assembly/builder/impl/CompositeWireBuilderImpl.java:[1006,20]
cannot find symbol
symbol  : variable PolicyComputationUtils
location: class org.apache.tuscany.sca.assembly.builder.impl.CompositeWireBuilderImpl


[INFO] ------------------------------------------------------------------------
[INFO] For more information, run Maven with the -e switch
[INFO] ------------------------------------------------------------------------
[INFO] Total time: 37 seconds
[INFO] Finished at: Wed Mar 12 05:24:55 PDT 2008
[INFO] Final Memory: 19M/38M
[INFO] ------------------------------------------------------------------------

****************************************************************************



---------------------------------------------------------------------
To unsubscribe, e-mail: tuscany-dev-unsubscribe@ws.apache.org
For additional commands, e-mail: tuscany-dev-help@ws.apache.org


Mime
View raw message