tuscany-dev mailing list archives

Site index · List index
Message view « Date » · « Thread »
Top « Date » · « Thread »
From Continuum VMBuild Server <contin...@apache.org>
Subject [continuum] BUILD FAILURE: Apache Tuscany SCA Implementation Project
Date Fri, 14 Mar 2008 10:22:10 GMT
Online report : http://vmbuild.apache.org/continuum/buildResult.action?buildId=65201&projectId=277

Build statistics:
  State: Failed
  Previous State: Failed
  Started at: Fri 14 Mar 2008 03:08:02 -0700
  Finished at: Fri 14 Mar 2008 03:10:49 -0700
  Total time: 2m 47s
  Build Trigger: Schedule
  Build Number: 116
  Exit code: 1
  Building machine hostname: vmbuild.apache.org
  Operating system : Linux(unknown)
  Java Home version : 
          java version "1.5.0_12"
          Java(TM) 2 Runtime Environment, Standard Edition (build 1.5.0_12-b04)
          Java HotSpot(TM) Client VM (build 1.5.0_12-b04, mixed mode, sharing)
        
  Builder version :
          Maven version: 2.0.7
          Java version: 1.5.0_12
          OS name: "linux" version: "2.6.20-16-server" arch: "i386"
    
****************************************************************************
SCM Changes:
****************************************************************************
Changed: slaws @ Fri 14 Mar 2008 01:45:24 -0700
Comment: Add missing ASF headers
Files changed:
  /incubator/tuscany/java/sca/samples/calculator-distributed/cloud.composite ( 637018 )
  /incubator/tuscany/java/sca/samples/calculator-distributed/domain.composite ( 637018 )
  /incubator/tuscany/java/sca/samples/calculator-distributed/workspace.xml ( 637018 )

****************************************************************************
Dependencies Changes:
****************************************************************************
No dependencies changed


****************************************************************************
Build Defintion:
****************************************************************************
POM filename: pom.xml
Goals: -Pdistribution clean install   
Arguments: --batch-mode
Build Fresh: false
Always Build: false
Default Build Definition: true
Schedule: DEFAULT_SCHEDULE
Profile Name: Java 5, Large Memory
Description: 


****************************************************************************
Test Summary:
****************************************************************************
Tests: 1074
Failures: 6
Total time: 983537

****************************************************************************
Output:
****************************************************************************
[INFO] Scanning for projects...
[INFO] Reactor build order: 
[INFO]   Apache Tuscany SCA Implementation Project
[INFO]   Apache Tuscany SCA Implementation Modules
[INFO]   Apache Tuscany SCA Extensibility
[INFO]   Apache Tuscany SCA Policy Model
[INFO]   Apache Tuscany SCA Interface Model
[INFO]   Apache Tuscany SCA Assembly Model
[INFO]   Apache Tuscany SCA Assembly Model Java DSL
[INFO]   Apache Tuscany SCA Assembly Model XML Schemas
[INFO]   Apache Tuscany SCA Definitions
[INFO]   Apache Tuscany SCA Contribution Model
[INFO]   Apache Tuscany SCA Policy XML Model
[INFO]   Apache Tuscany SCA Definitions XML Model
[INFO]   Apache Tuscany SCA API
[INFO]   Apache Tuscany SCA Core SPI
[INFO]   Apache Tuscany SCA Namespace Import/Export Model
[INFO]   Apache Tuscany SCA Java Import/Export Model
[INFO]   Apache Tuscany SCA XML Contribution Model
[INFO]   Apache Tuscany SCA Resource Import/Export Model
[INFO]   Apache Tuscany SCA Contribution Model Implementation
[INFO]   Apache Tuscany SCA XML Assembly Model
[INFO]   Apache Tuscany SCA Java Interface Model
[INFO]   Apache Tuscany SCA Core Runtime
[INFO]   Apache Tuscany SCA Domain API
[INFO]   Apache Tuscany SCA Domain
[INFO]   Apache Tuscany SCA Node API
[INFO]   Apache Tuscany SCA Node
[INFO]   Apache Tuscany SCA Default Binding Model
[INFO]   Apache Tuscany SCA Default Binding XML Model
[INFO]   Apache Tuscany SCA DataBinding Framework
[INFO]   Apache Tuscany SCA Java Interface XML Model
[INFO]   Apache Tuscany SCA Data Binding for JAXB
[INFO]   Apache Tuscany Java Interface for JAXWS
[INFO]   Apache Tuscany SCA Core/DataBinding Integration
[INFO]   Apache Tuscany SCA Embedded Host
[INFO]   Apache Tuscany SCA Extension Helper
[INFO]   Apache Tuscany SCA HTTP Servlet Host Extension Point
[INFO]   Apache Tuscany SCA AJAX DWR Binding Extension
[INFO]   Apache Tuscany SCA Java Implementation Model
[INFO]   Apache Tuscany SCA Java Implementation XML Model
[INFO]   Apache Tuscany Logging Policy Model
[INFO]   Apache Tuscany Security Policy Model
[INFO]   Apache Tuscany SCA Java Implementation Model
[INFO]   Apache Tuscany SCA EJB Binding Extension
[INFO]   Apache Tuscany SCA Data Implementation API
[INFO]   Apache Tuscany SCA Tomcat Servlet Host Extension
[INFO]   Apache Tuscany SCA Atom+RSS Feed Binding Extension
[INFO]   Apache Tuscany SCA Atom Feed Binding Extension
[INFO]   Apache Tuscany SCA Atom Feed Binding Extension
[INFO]   Apache Tuscany SCA RSS Feed Binding Extension
[INFO]   Apache Tuscany SCA RSS Feed Binding Extension
[INFO]   Apache Tuscany SCA Jetty Servlet Host Extension
[INFO]   Apache Tuscany SCA Resource Implementation Extension
[INFO]   Apache Tuscany SCA HTTP Binding Extension
[INFO]   Apache Tuscany SCA Data Binding for Axiom
[INFO]   Apache Tuscany SCA JMS Binding Extension
[INFO]   Apache Tuscany SCA Data Binding for JSON
[INFO]   Apache Tuscany SCA JSON-RPC Binding Extension
[INFO]   Apache Tuscany SCA WSDL Interface Model
[INFO]   Apache Tuscany SCA Notification Implementation Extension
[INFO]   Apache Tuscany SCA Notification Binding Extension
[INFO]   Apache Tuscany SCA RMI Host Extension Point
[INFO]   Apache Tuscany SCA RMI Binding Extension
[INFO]   Apache Tuscany SCA WSDL Interface XML Model
[INFO]   Apache Tuscany SCA WSDL Interface Java2WSDL Helper
[INFO]   Apache Tuscany SCA WS Binding Model
[INFO]   Apache Tuscany SCA WS Binding XML Model
[INFO]   Apache Tuscany SCA Axis2-based WS Binding Extension
[INFO]   Apache Tuscany SCA Axis2-based Default Binding Extension
[INFO]   Apache Tuscany SCA Groovy contributions
[INFO]   Apache Tuscany OSGi Runtime Helper Library
[INFO]   Apache Tuscany SCA Contribution Service OSGi
[INFO]   Apache Tuscany SCA Spring-based Core Runtime
[INFO]   Apache Tuscany SCA Data Binding for SDO
[INFO]   Apache Tuscany SCA Data Binding for SDO/AXIOM
[INFO]   Installer for Saxon
[INFO]   Apache Tuscany SCA Data Binding for Saxon
[INFO]   Apache Tuscany SCA Data Binding for XmlBeans
[INFO]   Apache Tuscany Data Binding for FastInfoset
[INFO]   Apache Tuscany SCA Data Binding for XStream
[INFO]   Apache Tuscany SCA Data Engine Helper
[INFO]   Apache Tuscany SCA Domain Implementation
[INFO]   Apache Tuscany SCA Webapp Host
[INFO]   Apache Tuscany SCA Webapp JUnit Host
[INFO]   Apache Tuscany SCA BPEL Implementation Extension
[INFO]   Apache Tuscany SCA DAS Implementation Extension
[INFO]   Apache Tuscany SCA Data Implementation Extension
[INFO]   Apache Tuscany SCA EJB Session Bean Implementation Model
[INFO]   Apache Tuscany EJB Session Bean Implementation XML Model
[INFO]   Apache Tuscany SCA Node Implementation Model
[INFO]   Apache Tuscany Node Implementation XML Model
[INFO]   Apache Tuscany SCA Node Implementation Extension
[INFO]   Apache Tuscany SCA OSGi Implementation Extension
[INFO]   Apache Tuscany SCA Script Implementation Extension
[INFO]   Apache Tuscany SCA Spring Framework Implementation Extension
[INFO]   Apache Tuscany SCA Widget Implementation Extension
[INFO]   Apache Tuscany SCA XQuery Implementation Extension
[INFO]   Apache Tuscany SCA Node API
[INFO]   Apache Tuscany SCA Node Implementation
[INFO]   Apache Tuscany SCA Node Implementation
[INFO]   Apache Tuscany SCA Transaction Policy Model
[INFO]   Apache Tuscany SCA Runtime
[INFO]   Apache Tuscany SCA Runtime for Tomcat deep integration
[INFO]   Apache Tuscany SCA WAR Runtime
[INFO]   Apache Tuscany SCA Workspace Model
[INFO]   Apache Tuscany SCA XML Workspace Model
[INFO]   Apache Tuscany SCA Workspace Implementation
[INFO]   Apache Tuscany SCA Workspace Administration
[INFO]   Apache Tuscany SCA Tools
[INFO]   Apache Tuscany SCA Eclipse Tools
[INFO]   Apache Tuscany SCA Eclipse Tools Feature
[INFO]   Apache Tuscany SCA Eclipse Tools Core Plugin
[INFO]   Apache Tuscany SCA Java2WSDL Tool
[INFO]   Apache Tuscany SCA Eclipse Tools Runtime Plugin
[INFO]   Apache Tuscany SCA Eclipse Tools Update Site
[INFO]   Apache Tuscany SCA Maven Tools
[INFO]   Apache Tuscany SCA Ant Build Generator Maven Plugin
[INFO]   Apache Tuscany SCA Definitions Shade Transformer for Distribution Bundle
[INFO]   Apache Tuscany SCA Dependency Lister Maven Plugin
[INFO]   Apache Tuscany SCA Incremental Build Generator Maven Plugin
[INFO]   Apache Tuscany SCA Java2WSDL Maven Plugin
[INFO]   Apache Tuscany SCA Web JUnit Maven Plugin
[INFO]   Apache Tuscany SCA WSDL2Java Tool
[INFO]   Apache Tuscany SCA WSDL2Java Maven Plugin
[INFO]   Apache Tuscany SCA Echo Binding Extension Sample
[INFO]   Apache Tuscany SCA Echo Binding Sample Application
[INFO]   Apache Tuscany SCA Notification Binding Broker Sample
[INFO]   Apache Tuscany SCA Notification Binding Consumer Sample
[INFO]   Apache Tuscany SCA Notification Binding Producer Sample
[INFO]   Apache Tuscany SCA Calculator Sample
[INFO]   Apache Tuscany SCA Distributed Calculator Sample
[INFO]   Apache Tuscany SCA Calculator Sample using Implementation Policies
[INFO]   Apache Tuscany SCA Calculator RMI Reference Sample
[INFO]   Apache Tuscany SCA Calculator RMI Service Sample
[INFO]   Apache Tuscany SCA Calculator Sample using Scripting Languages
[INFO]   Apache Tuscany SCA Calculator Sample in a WebApp
[INFO]   Apache Tuscany SCA Calculator Sample Web Service enabled for 
WS Security and in a WebApp
[INFO]   Apache Tuscany SCA Calculator Sample Web Service in a WebApp
[INFO]   Apache Tuscany SCA Callback Web Service Sample
[INFO]   Apache Tuscany SCA Callback Web Service Remote Client Sample
[INFO]   Apache Tuscany SCA Chat Sample WebApp
[INFO]   Apache Tuscany SCA Echo Data Binding Sample
[INFO]   Apache Tuscany SCA Atom+RSS Feed Aggregator Sample
[INFO]   Apache Tuscany SCA Atom+RSS Feed Aggregator Sample Webapp
[INFO]   Apache Tuscany SCA HelloWorld BPEL Sample
[INFO]   Apache Tuscany SCA HelloWorld DOJO Sample WebApp
[INFO]   Apache Tuscany SCA JMS HelloWorld Sample in a WebApp
[INFO]   Apache Tuscany SCA HelloWorld JSON-RPC Sample WebApp
[INFO]   Apache Tuscany SCA HelloWorld Web Service JMS Sample
[INFO]   Apache Tuscany SCA HelloWorld Reference JMS Sample
[INFO]   Apache Tuscany SCA HelloWorld Service JMS Sample
[INFO]   Apache Tuscany SCA HelloWorld Web Service Sample
[INFO]   Apache Tuscany SCA HelloWorld Secure Web Service Sample
[INFO]   Apache Tuscany SCA HelloWorld Web Service Reference Sample
[INFO]   Apache Tuscany SCA HelloWorld Web Service Reference JMS Sample
[INFO]   Apache Tuscany SCA HelloWorld Secure Web Service Reference Sample
[INFO]   Apache Tuscany SCA HelloWorld Web Service SDO Sample
[INFO]   Apache Tuscany SCA HelloWorld Web Service SDO Sample WebApp
[INFO]   Apache Tuscany SCA Composite Sample
[INFO]   Apache Tuscany SCA CRUD Implementation Extension Sample
[INFO]   Apache Tuscany SCA CRUD Implementation Extension Sample Client
[INFO]   Apache Tuscany SCA Notification Implementation Sample
[INFO]   Apache Tuscany SCA POJO Implementation Extension Sample
[INFO]   Apache Tuscany SCA Loan Application Conversation Sample
[INFO]   Apache Tuscany SCA OSGi Supply Chain Sample
[INFO]   Apache Tuscany SCA XQuery Quote Implementation Sample
[INFO]   Apache Tuscany SCA Simplified BigBank Sample
[INFO]   Apache Tuscany SCA Spring-Based Simplified BigBank Sample
[INFO]   Apache Tuscany SCA Simple Callback Sample
[INFO]   Apache Tuscany SCA Simple Callback Web Service Sample
[INFO]   Apache Tuscany SCA Getting Started Online Store Sample
[INFO]   Apache Tuscany SCA Supply Chain Sample
[INFO]   Apache Tuscany SCA Web Resource Sample
[INFO]   Apache Tuscany SCA Samples
[INFO]   Apache Tuscany SCA Integration Tests
[INFO]   Apache Tuscany SCA Callable References Integration Tests
[INFO]   Apache Tuscany Test for Callable References over Web Services
[INFO]   Apache Tuscany SCA Callback API Integration Tests
[INFO]   Apache Tuscany SCA Callback Basic Integration Tests
[INFO]   Apache Tuscany SCA Callback Complex Type Integration Tests
[INFO]   Apache Tuscany SCA Callback ID Integration Tests
[INFO]   Apache Tuscany SCA Callback With Mutiple Wires Test
[INFO]   Apache Tuscany SCA Set Callback Integration Tests
[INFO]   Apache Tuscany SCA Callback Set Conversation Integration Tests
[INFO]   Apache Tuscany SCA Contribution Integration Tests
[INFO]   Apache Tuscany SCA Multiple Contribution Integration Tests
[INFO]   Apache Tuscany SCA Contribution Export Integration Tests
[INFO]   Apache Tuscany SCA Contribution Java Export Integration Tests
[INFO]   Apache Tuscany SCA Contribution Resource Export Integration Tests
[INFO]   Apache Tuscany SCA Contribution WSDL Export Integration Tests
[INFO]   Apache Tuscany SCA Contribution Import Integration Tests
[INFO]   Apache Tuscany SCA Contribution Java Import Java Integration Tests
[INFO]   Apache Tuscany SCA Contribution Resource Import Java Integration Tests
[INFO]   Apache Tuscany SCA Contribution WSDL Import Integration Tests
[INFO]   Apache Tuscany SCA Contribution Import/Export Integration Tests
[INFO]   Apache Tuscany Contribution ClassLoader Test : Contribution Classes
[INFO]   Apache Tuscany Contribution Classloader tests
[INFO]   Apache Tuscany Contribution ClassLoader Integration Tests
[INFO]   Apache Tuscany SCA Conversations Integration Tests
[INFO]   Apache Tuscany SCA Conversations Over binding.ws Integration Tests
[INFO]   Apache Tuscany SCA Databindings Integration Tests
[INFO]   Apache Tuscany SCA Databinding Common Integration Tests
[INFO]   Apache Tuscany SCA SDO Databinding Integration Tests
[INFO]   Apache Tuscany SCA JAXB Databinding Integration Tests
[INFO]   Apache Tuscany SCA DataBinding Interop Integration Tests
[INFO]   Apache Tuscany SCA Domain Integration Tests
[INFO]   Apache Tuscany SCA Exceptions Integration Tests
[INFO]   Apache Tuscany SCA Cross-Binding Exceptions Integration Tests
[INFO]   Apache Tuscany SCA WS Binding Exceptions Integration Tests
[INFO]   Apache Tuscany Test for Simple Exceptions over Web Services
[INFO]   Apache Tuscany SCA Extended API Integration Tests
[INFO]   Apache Tuscany SCA JMS Tests
[INFO]   Apache Tuscany SCA Web Service with Large SDO Integration Tests
[INFO]   Apache Tuscany SCA OneWay Integration Tests
[INFO]   Apache Tuscany SCA Operation Overloading Integration Tests
[INFO]   Apache Tuscany OSGi Contribution Version 2 classes
[INFO]   Apache Tuscany OSGi Contribution Version 1 classes
[INFO]   Apache Tuscany OSGi Contribution tests
[INFO]   Apache Tuscany OSGi Contribution Tests
[INFO]   Apache Tuscany SCA Properties Integration Tests
[INFO]   Apache Tuscany SCA Recursive Composition Integration Tests
[INFO]   Apache Tuscany SCA References Integration Tests
[INFO]   Apache Tuscany SCA Services Integration Tests
[INFO]   Apache Tuscany SCA Component Type Integration Tests
[INFO]   Apache Tuscany Interface Integration Tests
[INFO]   Apache Tuscany SCA Wires Basic Integration Tests
[INFO]   Apache Tuscany SCA Scopes Integration Tests
[INFO]   Apache Tuscany SCA WSDL Support Integration Tests
[INFO]   Apache Tuscany SCA WSDLless Support Integration Tests
[INFO]   Apache Tuscany SCA WSDL2Java Integration Tests
[INFO]   Apache Tuscany SCA Multiple WSDL File Support Integration Tests
[INFO]   Apache Tuscany SCA Web Services Void Args and Return Test
[INFO]   Apache Tuscany SCA Transaction Policy Integration Test
[INFO]   Apache Tuscany SCA BPEL Integration Tests
[INFO]   Apache Tuscany SCA HelloWorld BPEL iTest
[INFO]   Apache Tuscany SCA Implementation.spring Integration Tests
[INFO]   Apache Tuscany SCA Policy Framework Integration Tests
[INFO]   Apache Tuscany SCA Bundle Jar
[INFO]   Apache Tuscany SCA Manifest Jar
[INFO]   Apache Tuscany SCA WebApp Runtime
[INFO]   Apache Tuscany SCA Distribution
[INFO] ----------------------------------------------------------------------------
[INFO] Building Apache Tuscany SCA Implementation Project
[INFO]    task-segment: [clean, install]
[INFO] ----------------------------------------------------------------------------
[INFO] artifact org.apache.maven.plugins:maven-clean-plugin: checking for updates from apache.incubator
[INFO] artifact org.apache.maven.plugins:maven-clean-plugin: checking for updates from codehaus-snapshot
[INFO] [clean:clean]
[INFO] Deleting directory /home/continuum/data/working-directory/277/target
[INFO] Deleting directory /home/continuum/data/working-directory/277/target/classes
[INFO] Deleting directory /home/continuum/data/working-directory/277/target/test-classes
[INFO] Deleting directory /home/continuum/data/working-directory/277/target/site
[INFO] artifact org.apache.maven.plugins:maven-site-plugin: checking for updates from apache.incubator
[INFO] artifact org.apache.maven.plugins:maven-site-plugin: checking for updates from codehaus-snapshot
[INFO] artifact org.apache.maven.plugins:maven-install-plugin: checking for updates from apache.incubator
[INFO] artifact org.apache.maven.plugins:maven-install-plugin: checking for updates from codehaus-snapshot
[INFO] [site:attach-descriptor]
[INFO] [install:install]
[INFO] Installing /home/continuum/data/working-directory/277/pom.xml to /home/continuum/.m2/repository/org/apache/tuscany/sca/tuscany-sca/1.2-incubating-SNAPSHOT/tuscany-sca-1.2-incubating-SNAPSHOT.pom
[INFO] ----------------------------------------------------------------------------
[INFO] Building Apache Tuscany SCA Implementation Modules
[INFO]    task-segment: [clean, install]
[INFO] ----------------------------------------------------------------------------
[INFO] [clean:clean]
[INFO] Deleting directory /home/continuum/data/working-directory/277/modules/target
[INFO] Deleting directory /home/continuum/data/working-directory/277/modules/target/classes
[INFO] Deleting directory /home/continuum/data/working-directory/277/modules/target/test-classes
[INFO] Deleting directory /home/continuum/data/working-directory/277/modules/target/site
[INFO] [site:attach-descriptor]
[INFO] [install:install]
[INFO] Installing /home/continuum/data/working-directory/277/modules/pom.xml to /home/continuum/.m2/repository/org/apache/tuscany/sca/tuscany-modules/1.2-incubating-SNAPSHOT/tuscany-modules-1.2-incubating-SNAPSHOT.pom
[INFO] ----------------------------------------------------------------------------
[INFO] Building Apache Tuscany SCA Extensibility
[INFO]    task-segment: [clean, install]
[INFO] ----------------------------------------------------------------------------
[INFO] [clean:clean]
[INFO] Deleting directory /home/continuum/data/working-directory/277/modules/extensibility/target
[INFO] Deleting directory /home/continuum/data/working-directory/277/modules/extensibility/target/classes
[INFO] Deleting directory /home/continuum/data/working-directory/277/modules/extensibility/target/test-classes
[INFO] Deleting directory /home/continuum/data/working-directory/277/modules/extensibility/target/site
[INFO] artifact org.apache.maven.plugins:maven-resources-plugin: checking for updates from apache.incubator
[INFO] artifact org.apache.maven.plugins:maven-resources-plugin: checking for updates from codehaus-snapshot
[INFO] [resources:resources]
[INFO] Using default encoding to copy filtered resources.
[INFO] [compiler:compile]
[INFO] Compiling 2 source files to /home/continuum/data/working-directory/277/modules/extensibility/target/classes
[INFO] [resources:testResources]
[INFO] Using default encoding to copy filtered resources.
[INFO] [compiler:testCompile]
[INFO] Nothing to compile - all classes are up to date
[INFO] [surefire:test]
[INFO] No tests to run.
[INFO] [jar:jar]
[INFO] Building jar: /home/continuum/data/working-directory/277/modules/extensibility/target/tuscany-extensibility-1.2-incubating-SNAPSHOT.jar
[INFO] [install:install]
[INFO] Installing /home/continuum/data/working-directory/277/modules/extensibility/target/tuscany-extensibility-1.2-incubating-SNAPSHOT.jar to /home/continuum/.m2/repository/org/apache/tuscany/sca/tuscany-extensibility/1.2-incubating-SNAPSHOT/tuscany-extensibility-1.2-incubating-SNAPSHOT.jar
[INFO] ----------------------------------------------------------------------------
[INFO] Building Apache Tuscany SCA Policy Model
[INFO]    task-segment: [clean, install]
[INFO] ----------------------------------------------------------------------------
[INFO] [clean:clean]
[INFO] Deleting directory /home/continuum/data/working-directory/277/modules/policy/target
[INFO] Deleting directory /home/continuum/data/working-directory/277/modules/policy/target/classes
[INFO] Deleting directory /home/continuum/data/working-directory/277/modules/policy/target/test-classes
[INFO] Deleting directory /home/continuum/data/working-directory/277/modules/policy/target/site
[INFO] [resources:resources]
[INFO] Using default encoding to copy filtered resources.
[INFO] [compiler:compile]
[INFO] Compiling 33 source files to /home/continuum/data/working-directory/277/modules/policy/target/classes
[INFO] [resources:testResources]
[INFO] Using default encoding to copy filtered resources.
[INFO] [compiler:testCompile]
[INFO] Compiling 1 source file to /home/continuum/data/working-directory/277/modules/policy/target/test-classes
[INFO] [surefire:test]
[INFO] Surefire report directory: /home/continuum/data/working-directory/277/modules/policy/target/surefire-reports

-------------------------------------------------------
 T E S T S
-------------------------------------------------------
Running org.apache.tuscany.sca.policy.PolicyFactoryTestCase
Tests run: 2, Failures: 0, Errors: 0, Skipped: 0, Time elapsed: 0.04 sec

Results :

Tests run: 2, Failures: 0, Errors: 0, Skipped: 0

[INFO] [jar:jar]
[INFO] Building jar: /home/continuum/data/working-directory/277/modules/policy/target/tuscany-policy-1.2-incubating-SNAPSHOT.jar
[INFO] [install:install]
[INFO] Installing /home/continuum/data/working-directory/277/modules/policy/target/tuscany-policy-1.2-incubating-SNAPSHOT.jar to /home/continuum/.m2/repository/org/apache/tuscany/sca/tuscany-policy/1.2-incubating-SNAPSHOT/tuscany-policy-1.2-incubating-SNAPSHOT.jar
[INFO] ----------------------------------------------------------------------------
[INFO] Building Apache Tuscany SCA Interface Model
[INFO]    task-segment: [clean, install]
[INFO] ----------------------------------------------------------------------------
[INFO] [clean:clean]
[INFO] Deleting directory /home/continuum/data/working-directory/277/modules/interface/target
[INFO] Deleting directory /home/continuum/data/working-directory/277/modules/interface/target/classes
[INFO] Deleting directory /home/continuum/data/working-directory/277/modules/interface/target/test-classes
[INFO] Deleting directory /home/continuum/data/working-directory/277/modules/interface/target/site
[INFO] [resources:resources]
[INFO] Using default encoding to copy filtered resources.
[INFO] [compiler:compile]
[INFO] Compiling 23 source files to /home/continuum/data/working-directory/277/modules/interface/target/classes
[INFO] [resources:testResources]
[INFO] Using default encoding to copy filtered resources.
[INFO] [compiler:testCompile]
[INFO] Compiling 2 source files to /home/continuum/data/working-directory/277/modules/interface/target/test-classes
[INFO] [surefire:test]
[INFO] Surefire report directory: /home/continuum/data/working-directory/277/modules/interface/target/surefire-reports

-------------------------------------------------------
 T E S T S
-------------------------------------------------------
Running org.apache.tuscany.sca.interfacedef.impl.ContractCompatibilityTestCase
Tests run: 13, Failures: 0, Errors: 0, Skipped: 0, Time elapsed: 0.06 sec
Running org.apache.tuscany.sca.interfacedef.impl.InterfaceContractTestCase
Tests run: 1, Failures: 0, Errors: 0, Skipped: 0, Time elapsed: 0.017 sec

Results :

Tests run: 14, Failures: 0, Errors: 0, Skipped: 0

[INFO] [jar:jar]
[INFO] Building jar: /home/continuum/data/working-directory/277/modules/interface/target/tuscany-interface-1.2-incubating-SNAPSHOT.jar
[INFO] [install:install]
[INFO] Installing /home/continuum/data/working-directory/277/modules/interface/target/tuscany-interface-1.2-incubating-SNAPSHOT.jar to /home/continuum/.m2/repository/org/apache/tuscany/sca/tuscany-interface/1.2-incubating-SNAPSHOT/tuscany-interface-1.2-incubating-SNAPSHOT.jar
[INFO] ----------------------------------------------------------------------------
[INFO] Building Apache Tuscany SCA Assembly Model
[INFO]    task-segment: [clean, install]
[INFO] ----------------------------------------------------------------------------
[INFO] [clean:clean]
[INFO] Deleting directory /home/continuum/data/working-directory/277/modules/assembly/target
[INFO] Deleting directory /home/continuum/data/working-directory/277/modules/assembly/target/classes
[INFO] Deleting directory /home/continuum/data/working-directory/277/modules/assembly/target/test-classes
[INFO] Deleting directory /home/continuum/data/working-directory/277/modules/assembly/target/site
[INFO] [resources:resources]
[INFO] Using default encoding to copy filtered resources.
[INFO] [compiler:compile]
[INFO] Compiling 74 source files to /home/continuum/data/working-directory/277/modules/assembly/target/classes
[INFO] [resources:testResources]
[INFO] Using default encoding to copy filtered resources.
[INFO] [compiler:testCompile]
[INFO] Compiling 9 source files to /home/continuum/data/working-directory/277/modules/assembly/target/test-classes
[INFO] [surefire:test]
[INFO] Surefire report directory: /home/continuum/data/working-directory/277/modules/assembly/target/surefire-reports

-------------------------------------------------------
 T E S T S
-------------------------------------------------------
Running org.apache.tuscany.sca.assembly.builder.impl.CalculateBindingURITestCase
Mar 14, 2008 3:09:32 AM org.apache.tuscany.sca.assembly.builder.impl.CalculateBindingURITestCase$1 problem
WARNING: No implementation for component: c1
Mar 14, 2008 3:09:32 AM org.apache.tuscany.sca.assembly.builder.impl.CalculateBindingURITestCase$1 problem
WARNING: Service not found for component service: c1/s1
Mar 14, 2008 3:09:32 AM org.apache.tuscany.sca.assembly.builder.impl.CalculateBindingURITestCase$1 problem
WARNING: No implementation for component: c1
Mar 14, 2008 3:09:32 AM org.apache.tuscany.sca.assembly.builder.impl.CalculateBindingURITestCase$1 problem
WARNING: Service not found for component service: c1/s1
Mar 14, 2008 3:09:32 AM org.apache.tuscany.sca.assembly.builder.impl.CalculateBindingURITestCase$1 problem
WARNING: Service not found for component service: c1/s2
Mar 14, 2008 3:09:32 AM org.apache.tuscany.sca.assembly.builder.impl.CalculateBindingURITestCase$1 problem
WARNING: No implementation for component: c1
Mar 14, 2008 3:09:32 AM org.apache.tuscany.sca.assembly.builder.impl.CalculateBindingURITestCase$1 problem
WARNING: Service not found for component service: c1/s1
Mar 14, 2008 3:09:32 AM org.apache.tuscany.sca.assembly.builder.impl.CalculateBindingURITestCase$1 problem
WARNING: Service not found for component service: c1/s2
Mar 14, 2008 3:09:32 AM org.apache.tuscany.sca.assembly.builder.impl.CalculateBindingURITestCase$1 problem
WARNING: No implementation for component: c1
Mar 14, 2008 3:09:32 AM org.apache.tuscany.sca.assembly.builder.impl.CalculateBindingURITestCase$1 problem
WARNING: Service not found for component service: c1/s1
Mar 14, 2008 3:09:32 AM org.apache.tuscany.sca.assembly.builder.impl.CalculateBindingURITestCase$1 problem
WARNING: Service not found for component service: c1/s2
Mar 14, 2008 3:09:32 AM org.apache.tuscany.sca.assembly.builder.impl.CalculateBindingURITestCase$1 problem
WARNING: No implementation for component: c1
Mar 14, 2008 3:09:32 AM org.apache.tuscany.sca.assembly.builder.impl.CalculateBindingURITestCase$1 problem
WARNING: Service not found for component service: c1/s1
Mar 14, 2008 3:09:32 AM org.apache.tuscany.sca.assembly.builder.impl.CalculateBindingURITestCase$1 problem
WARNING: Service not found for component service: c1/s2
Mar 14, 2008 3:09:32 AM org.apache.tuscany.sca.assembly.builder.impl.CalculateBindingURITestCase$1 problem
WARNING: No implementation for component: c1
Mar 14, 2008 3:09:32 AM org.apache.tuscany.sca.assembly.builder.impl.CalculateBindingURITestCase$1 problem
WARNING: Service not found for component service: c1/s1
Mar 14, 2008 3:09:32 AM org.apache.tuscany.sca.assembly.builder.impl.CalculateBindingURITestCase$1 problem
WARNING: Service not found for component service: c1/s2
Mar 14, 2008 3:09:32 AM org.apache.tuscany.sca.assembly.builder.impl.CalculateBindingURITestCase$1 problem
WARNING: No implementation for component: c2
Mar 14, 2008 3:09:32 AM org.apache.tuscany.sca.assembly.builder.impl.CalculateBindingURITestCase$1 problem
WARNING: Service not found for component service: c2/s1
Mar 14, 2008 3:09:32 AM org.apache.tuscany.sca.assembly.builder.impl.CalculateBindingURITestCase$1 problem
WARNING: No implementation for component: c2
Mar 14, 2008 3:09:32 AM org.apache.tuscany.sca.assembly.builder.impl.CalculateBindingURITestCase$1 problem
WARNING: Service not found for component service: c2/s1
Mar 14, 2008 3:09:32 AM org.apache.tuscany.sca.assembly.builder.impl.CalculateBindingURITestCase$1 problem
WARNING: Service not found for component service: c2/s2
Mar 14, 2008 3:09:32 AM org.apache.tuscany.sca.assembly.builder.impl.CalculateBindingURITestCase$1 problem
WARNING: No implementation for component: c2
Mar 14, 2008 3:09:32 AM org.apache.tuscany.sca.assembly.builder.impl.CalculateBindingURITestCase$1 problem
WARNING: Service not found for component service: c2/s1
Mar 14, 2008 3:09:32 AM org.apache.tuscany.sca.assembly.builder.impl.CalculateBindingURITestCase$1 problem
WARNING: Service not found for component service: c2/s2
Mar 14, 2008 3:09:32 AM org.apache.tuscany.sca.assembly.builder.impl.CalculateBindingURITestCase$1 problem
WARNING: No implementation for component: c2
Mar 14, 2008 3:09:32 AM org.apache.tuscany.sca.assembly.builder.impl.CalculateBindingURITestCase$1 problem
WARNING: Service not found for component service: c2/s1
Mar 14, 2008 3:09:32 AM org.apache.tuscany.sca.assembly.builder.impl.CalculateBindingURITestCase$1 problem
WARNING: Service not found for component service: c2/s2
Mar 14, 2008 3:09:32 AM org.apache.tuscany.sca.assembly.builder.impl.CalculateBindingURITestCase$1 problem
WARNING: No implementation for component: c2
Mar 14, 2008 3:09:32 AM org.apache.tuscany.sca.assembly.builder.impl.CalculateBindingURITestCase$1 problem
WARNING: Service not found for component service: c2/s1
Mar 14, 2008 3:09:32 AM org.apache.tuscany.sca.assembly.builder.impl.CalculateBindingURITestCase$1 problem
WARNING: Service not found for component service: c2/s2
Tests run: 16, Failures: 0, Errors: 0, Skipped: 0, Time elapsed: 0.14 sec
Running org.apache.tuscany.sca.assembly.builder.impl.CompositeBuilderTestCase
Tests run: 2, Failures: 0, Errors: 0, Skipped: 0, Time elapsed: 0.017 sec
Running org.apache.tuscany.sca.assembly.builder.impl.PrintUtilTestCase
Tests run: 2, Failures: 0, Errors: 0, Skipped: 0, Time elapsed: 0.262 sec
Running org.apache.tuscany.sca.assembly.AssemblyFactoryTestCase
Tests run: 4, Failures: 0, Errors: 0, Skipped: 0, Time elapsed: 0.019 sec

Results :

Tests run: 24, Failures: 0, Errors: 0, Skipped: 0

[INFO] [jar:jar]
[INFO] Building jar: /home/continuum/data/working-directory/277/modules/assembly/target/tuscany-assembly-1.2-incubating-SNAPSHOT.jar
[INFO] [install:install]
[INFO] Installing /home/continuum/data/working-directory/277/modules/assembly/target/tuscany-assembly-1.2-incubating-SNAPSHOT.jar to /home/continuum/.m2/repository/org/apache/tuscany/sca/tuscany-assembly/1.2-incubating-SNAPSHOT/tuscany-assembly-1.2-incubating-SNAPSHOT.jar
[INFO] ----------------------------------------------------------------------------
[INFO] Building Apache Tuscany SCA Assembly Model Java DSL
[INFO]    task-segment: [clean, install]
[INFO] ----------------------------------------------------------------------------
[INFO] [clean:clean]
[INFO] Deleting directory /home/continuum/data/working-directory/277/modules/assembly-java-dsl/target
[INFO] Deleting directory /home/continuum/data/working-directory/277/modules/assembly-java-dsl/target/classes
[INFO] Deleting directory /home/continuum/data/working-directory/277/modules/assembly-java-dsl/target/test-classes
[INFO] Deleting directory /home/continuum/data/working-directory/277/modules/assembly-java-dsl/target/site
[INFO] [resources:resources]
[INFO] Using default encoding to copy filtered resources.
[INFO] [compiler:compile]
[INFO] Compiling 12 source files to /home/continuum/data/working-directory/277/modules/assembly-java-dsl/target/classes
[INFO] [resources:testResources]
[INFO] Using default encoding to copy filtered resources.
[INFO] [compiler:testCompile]
[INFO] Compiling 7 source files to /home/continuum/data/working-directory/277/modules/assembly-java-dsl/target/test-classes
[INFO] [surefire:test]
[INFO] Surefire report directory: /home/continuum/data/working-directory/277/modules/assembly-java-dsl/target/surefire-reports

-------------------------------------------------------
 T E S T S
-------------------------------------------------------
Running org.apache.tuscany.sca.assembly.dsl.BigBankBuilderTestCase
Tests run: 1, Failures: 0, Errors: 0, Skipped: 0, Time elapsed: 0.152 sec

Results :

Tests run: 1, Failures: 0, Errors: 0, Skipped: 0

[INFO] [jar:jar]
[INFO] Building jar: /home/continuum/data/working-directory/277/modules/assembly-java-dsl/target/tuscany-assembly-java-dsl-1.2-incubating-SNAPSHOT.jar
[INFO] [install:install]
[INFO] Installing /home/continuum/data/working-directory/277/modules/assembly-java-dsl/target/tuscany-assembly-java-dsl-1.2-incubating-SNAPSHOT.jar to /home/continuum/.m2/repository/org/apache/tuscany/sca/tuscany-assembly-java-dsl/1.2-incubating-SNAPSHOT/tuscany-assembly-java-dsl-1.2-incubating-SNAPSHOT.jar
[INFO] ----------------------------------------------------------------------------
[INFO] Building Apache Tuscany SCA Assembly Model XML Schemas
[INFO]    task-segment: [clean, install]
[INFO] ----------------------------------------------------------------------------
[INFO] [clean:clean]
[INFO] Deleting directory /home/continuum/data/working-directory/277/modules/assembly-xsd/target
[INFO] Deleting directory /home/continuum/data/working-directory/277/modules/assembly-xsd/target/classes
[INFO] Deleting directory /home/continuum/data/working-directory/277/modules/assembly-xsd/target/test-classes
[INFO] Deleting directory /home/continuum/data/working-directory/277/modules/assembly-xsd/target/site
[INFO] [resources:resources]
[INFO] Using default encoding to copy filtered resources.
[INFO] [compiler:compile]
[INFO] No sources to compile
[INFO] [resources:testResources]
[INFO] Using default encoding to copy filtered resources.
[INFO] [compiler:testCompile]
[INFO] No sources to compile
[INFO] [surefire:test]
[INFO] No tests to run.
[INFO] [jar:jar]
[INFO] Building jar: /home/continuum/data/working-directory/277/modules/assembly-xsd/target/tuscany-assembly-xsd-1.2-incubating-SNAPSHOT.jar
[INFO] [install:install]
[INFO] Installing /home/continuum/data/working-directory/277/modules/assembly-xsd/target/tuscany-assembly-xsd-1.2-incubating-SNAPSHOT.jar to /home/continuum/.m2/repository/org/apache/tuscany/sca/tuscany-assembly-xsd/1.2-incubating-SNAPSHOT/tuscany-assembly-xsd-1.2-incubating-SNAPSHOT.jar
[INFO] ----------------------------------------------------------------------------
[INFO] Building Apache Tuscany SCA Definitions
[INFO]    task-segment: [clean, install]
[INFO] ----------------------------------------------------------------------------
[INFO] [clean:clean]
[INFO] Deleting directory /home/continuum/data/working-directory/277/modules/definitions/target
[INFO] Deleting directory /home/continuum/data/working-directory/277/modules/definitions/target/classes
[INFO] Deleting directory /home/continuum/data/working-directory/277/modules/definitions/target/test-classes
[INFO] Deleting directory /home/continuum/data/working-directory/277/modules/definitions/target/site
[INFO] [resources:resources]
[INFO] Using default encoding to copy filtered resources.
[INFO] [compiler:compile]
[INFO] Compiling 6 source files to /home/continuum/data/working-directory/277/modules/definitions/target/classes
[INFO] [resources:testResources]
[INFO] Using default encoding to copy filtered resources.
[INFO] [compiler:testCompile]
[INFO] Nothing to compile - all classes are up to date
[INFO] [surefire:test]
[INFO] Surefire report directory: /home/continuum/data/working-directory/277/modules/definitions/target/surefire-reports

-------------------------------------------------------
 T E S T S
-------------------------------------------------------
There are no tests to run.

Results :

Tests run: 0, Failures: 0, Errors: 0, Skipped: 0

[INFO] [jar:jar]
[INFO] Building jar: /home/continuum/data/working-directory/277/modules/definitions/target/tuscany-definitions-1.2-incubating-SNAPSHOT.jar
[INFO] [install:install]
[INFO] Installing /home/continuum/data/working-directory/277/modules/definitions/target/tuscany-definitions-1.2-incubating-SNAPSHOT.jar to /home/continuum/.m2/repository/org/apache/tuscany/sca/tuscany-definitions/1.2-incubating-SNAPSHOT/tuscany-definitions-1.2-incubating-SNAPSHOT.jar
[INFO] ----------------------------------------------------------------------------
[INFO] Building Apache Tuscany SCA Contribution Model
[INFO]    task-segment: [clean, install]
[INFO] ----------------------------------------------------------------------------
[INFO] [clean:clean]
[INFO] Deleting directory /home/continuum/data/working-directory/277/modules/contribution/target
[INFO] Deleting directory /home/continuum/data/working-directory/277/modules/contribution/target/classes
[INFO] Deleting directory /home/continuum/data/working-directory/277/modules/contribution/target/test-classes
[INFO] Deleting directory /home/continuum/data/working-directory/277/modules/contribution/target/site
[INFO] [resources:resources]
[INFO] Using default encoding to copy filtered resources.
[INFO] [compiler:compile]
[INFO] Compiling 60 source files to /home/continuum/data/working-directory/277/modules/contribution/target/classes
[INFO] [resources:testResources]
[INFO] Using default encoding to copy filtered resources.
[INFO] [compiler:testCompile]
[INFO] Nothing to compile - all classes are up to date
[INFO] [surefire:test]
[INFO] No tests to run.
[INFO] [jar:jar]
[INFO] Building jar: /home/continuum/data/working-directory/277/modules/contribution/target/tuscany-contribution-1.2-incubating-SNAPSHOT.jar
[INFO] [install:install]
[INFO] Installing /home/continuum/data/working-directory/277/modules/contribution/target/tuscany-contribution-1.2-incubating-SNAPSHOT.jar to /home/continuum/.m2/repository/org/apache/tuscany/sca/tuscany-contribution/1.2-incubating-SNAPSHOT/tuscany-contribution-1.2-incubating-SNAPSHOT.jar
[INFO] ----------------------------------------------------------------------------
[INFO] Building Apache Tuscany SCA Policy XML Model
[INFO]    task-segment: [clean, install]
[INFO] ----------------------------------------------------------------------------
[INFO] [clean:clean]
[INFO] Deleting directory /home/continuum/data/working-directory/277/modules/policy-xml/target
[INFO] Deleting directory /home/continuum/data/working-directory/277/modules/policy-xml/target/classes
[INFO] Deleting directory /home/continuum/data/working-directory/277/modules/policy-xml/target/test-classes
[INFO] Deleting directory /home/continuum/data/working-directory/277/modules/policy-xml/target/site
[INFO] [resources:resources]
[INFO] Using default encoding to copy filtered resources.
[INFO] [compiler:compile]
[INFO] Compiling 9 source files to /home/continuum/data/working-directory/277/modules/policy-xml/target/classes
[INFO] [resources:testResources]
[INFO] Using default encoding to copy filtered resources.
[INFO] [compiler:testCompile]
[INFO] Compiling 3 source files to /home/continuum/data/working-directory/277/modules/policy-xml/target/test-classes
[INFO] [surefire:test]
[INFO] Surefire report directory: /home/continuum/data/working-directory/277/modules/policy-xml/target/surefire-reports

-------------------------------------------------------
 T E S T S
-------------------------------------------------------
Running org.apache.tuscany.sca.policy.xml.ReadDocumentTestCase
Mar 14, 2008 3:09:53 AM org.apache.tuscany.sca.contribution.processor.ExtensibleStAXArtifactProcessor read
WARNING: Element {http://www.osoa.org/xmlns/sca/1.0}definitions cannot be processed. ([row,col {unknown-source}]: [20,1])
Mar 14, 2008 3:09:53 AM org.apache.tuscany.sca.contribution.processor.ExtensibleStAXArtifactProcessor read
WARNING: Element {http://www.osoa.org/xmlns/sca/1.0}definitions cannot be processed. ([row,col {unknown-source}]: [20,1])
Tests run: 2, Failures: 0, Errors: 0, Skipped: 0, Time elapsed: 0.512 sec

Results :

Tests run: 2, Failures: 0, Errors: 0, Skipped: 0

[INFO] [jar:jar]
[INFO] Building jar: /home/continuum/data/working-directory/277/modules/policy-xml/target/tuscany-policy-xml-1.2-incubating-SNAPSHOT.jar
[INFO] [install:install]
[INFO] Installing /home/continuum/data/working-directory/277/modules/policy-xml/target/tuscany-policy-xml-1.2-incubating-SNAPSHOT.jar to /home/continuum/.m2/repository/org/apache/tuscany/sca/tuscany-policy-xml/1.2-incubating-SNAPSHOT/tuscany-policy-xml-1.2-incubating-SNAPSHOT.jar
[INFO] ----------------------------------------------------------------------------
[INFO] Building Apache Tuscany SCA Definitions XML Model
[INFO]    task-segment: [clean, install]
[INFO] ----------------------------------------------------------------------------
[INFO] [clean:clean]
[INFO] Deleting directory /home/continuum/data/working-directory/277/modules/definitions-xml/target
[INFO] Deleting directory /home/continuum/data/working-directory/277/modules/definitions-xml/target/classes
[INFO] Deleting directory /home/continuum/data/working-directory/277/modules/definitions-xml/target/test-classes
[INFO] Deleting directory /home/continuum/data/working-directory/277/modules/definitions-xml/target/site
[INFO] [resources:resources]
[INFO] Using default encoding to copy filtered resources.
[INFO] [compiler:compile]
[INFO] Compiling 3 source files to /home/continuum/data/working-directory/277/modules/definitions-xml/target/classes
[INFO] [resources:testResources]
[INFO] Using default encoding to copy filtered resources.
[INFO] [compiler:testCompile]
[INFO] Compiling 3 source files to /home/continuum/data/working-directory/277/modules/definitions-xml/target/test-classes
[INFO] [surefire:test]
[INFO] Surefire report directory: /home/continuum/data/working-directory/277/modules/definitions-xml/target/surefire-reports

-------------------------------------------------------
 T E S T S
-------------------------------------------------------
Running org.apache.tuscany.sca.definitions.ReadDocumentTestCase
Tests run: 2, Failures: 0, Errors: 0, Skipped: 0, Time elapsed: 0.423 sec

Results :

Tests run: 2, Failures: 0, Errors: 0, Skipped: 0

[INFO] [jar:jar]
[INFO] Building jar: /home/continuum/data/working-directory/277/modules/definitions-xml/target/tuscany-definitions-xml-1.2-incubating-SNAPSHOT.jar
[INFO] [install:install]
[INFO] Installing /home/continuum/data/working-directory/277/modules/definitions-xml/target/tuscany-definitions-xml-1.2-incubating-SNAPSHOT.jar to /home/continuum/.m2/repository/org/apache/tuscany/sca/tuscany-definitions-xml/1.2-incubating-SNAPSHOT/tuscany-definitions-xml-1.2-incubating-SNAPSHOT.jar
[INFO] ----------------------------------------------------------------------------
[INFO] Building Apache Tuscany SCA API
[INFO]    task-segment: [clean, install]
[INFO] ----------------------------------------------------------------------------
[INFO] [clean:clean]
[INFO] Deleting directory /home/continuum/data/working-directory/277/modules/sca-api/target
[INFO] Deleting directory /home/continuum/data/working-directory/277/modules/sca-api/target/classes
[INFO] Deleting directory /home/continuum/data/working-directory/277/modules/sca-api/target/test-classes
[INFO] Deleting directory /home/continuum/data/working-directory/277/modules/sca-api/target/site
[INFO] [resources:resources]
[INFO] Using default encoding to copy filtered resources.
[INFO] [compiler:compile]
[INFO] Compiling 35 source files to /home/continuum/data/working-directory/277/modules/sca-api/target/classes
[INFO] [resources:testResources]
[INFO] Using default encoding to copy filtered resources.
[INFO] [compiler:testCompile]
[INFO] No sources to compile
[INFO] [surefire:test]
[INFO] No tests to run.
[INFO] [jar:jar]
[INFO] Building jar: /home/continuum/data/working-directory/277/modules/sca-api/target/tuscany-sca-api-1.2-incubating-SNAPSHOT.jar
[INFO] [install:install]
[INFO] Installing /home/continuum/data/working-directory/277/modules/sca-api/target/tuscany-sca-api-1.2-incubating-SNAPSHOT.jar to /home/continuum/.m2/repository/org/apache/tuscany/sca/tuscany-sca-api/1.2-incubating-SNAPSHOT/tuscany-sca-api-1.2-incubating-SNAPSHOT.jar
[INFO] ----------------------------------------------------------------------------
[INFO] Building Apache Tuscany SCA Core SPI
[INFO]    task-segment: [clean, install]
[INFO] ----------------------------------------------------------------------------
[INFO] [clean:clean]
[INFO] Deleting directory /home/continuum/data/working-directory/277/modules/core-spi/target
[INFO] Deleting directory /home/continuum/data/working-directory/277/modules/core-spi/target/classes
[INFO] Deleting directory /home/continuum/data/working-directory/277/modules/core-spi/target/test-classes
[INFO] Deleting directory /home/continuum/data/working-directory/277/modules/core-spi/target/site
[INFO] [resources:resources]
[INFO] Using default encoding to copy filtered resources.
[INFO] [compiler:compile]
[INFO] Compiling 53 source files to /home/continuum/data/working-directory/277/modules/core-spi/target/classes
[INFO] [resources:testResources]
[INFO] Using default encoding to copy filtered resources.
[INFO] [compiler:testCompile]
[INFO] Nothing to compile - all classes are up to date
[INFO] [surefire:test]
[INFO] Surefire report directory: /home/continuum/data/working-directory/277/modules/core-spi/target/surefire-reports

-------------------------------------------------------
 T E S T S
-------------------------------------------------------
There are no tests to run.

Results :

Tests run: 0, Failures: 0, Errors: 0, Skipped: 0

[INFO] [jar:jar]
[INFO] Building jar: /home/continuum/data/working-directory/277/modules/core-spi/target/tuscany-core-spi-1.2-incubating-SNAPSHOT.jar
[INFO] [install:install]
[INFO] Installing /home/continuum/data/working-directory/277/modules/core-spi/target/tuscany-core-spi-1.2-incubating-SNAPSHOT.jar to /home/continuum/.m2/repository/org/apache/tuscany/sca/tuscany-core-spi/1.2-incubating-SNAPSHOT/tuscany-core-spi-1.2-incubating-SNAPSHOT.jar
[INFO] ----------------------------------------------------------------------------
[INFO] Building Apache Tuscany SCA Namespace Import/Export Model
[INFO]    task-segment: [clean, install]
[INFO] ----------------------------------------------------------------------------
[INFO] [clean:clean]
[INFO] Deleting directory /home/continuum/data/working-directory/277/modules/contribution-namespace/target
[INFO] Deleting directory /home/continuum/data/working-directory/277/modules/contribution-namespace/target/classes
[INFO] Deleting directory /home/continuum/data/working-directory/277/modules/contribution-namespace/target/test-classes
[INFO] Deleting directory /home/continuum/data/working-directory/277/modules/contribution-namespace/target/site
[INFO] [resources:resources]
[INFO] Using default encoding to copy filtered resources.
[INFO] [compiler:compile]
[INFO] Compiling 10 source files to /home/continuum/data/working-directory/277/modules/contribution-namespace/target/classes
[INFO] [resources:testResources]
[INFO] Using default encoding to copy filtered resources.
[INFO] [compiler:testCompile]
[INFO] Compiling 2 source files to /home/continuum/data/working-directory/277/modules/contribution-namespace/target/test-classes
[INFO] [surefire:test]
[INFO] Surefire report directory: /home/continuum/data/working-directory/277/modules/contribution-namespace/target/surefire-reports

-------------------------------------------------------
 T E S T S
-------------------------------------------------------
Running org.apache.tuscany.sca.contribution.namespace.impl.NamespaceImportProcessorTestCase
Tests run: 2, Failures: 0, Errors: 0, Skipped: 0, Time elapsed: 0.223 sec
Running org.apache.tuscany.sca.contribution.namespace.impl.NamespaceExportProcessorTestCase
Tests run: 2, Failures: 0, Errors: 0, Skipped: 0, Time elapsed: 0.017 sec

Results :

Tests run: 4, Failures: 0, Errors: 0, Skipped: 0

[INFO] [jar:jar]
[INFO] Building jar: /home/continuum/data/working-directory/277/modules/contribution-namespace/target/tuscany-contribution-namespace-1.2-incubating-SNAPSHOT.jar
[INFO] [install:install]
[INFO] Installing /home/continuum/data/working-directory/277/modules/contribution-namespace/target/tuscany-contribution-namespace-1.2-incubating-SNAPSHOT.jar to /home/continuum/.m2/repository/org/apache/tuscany/sca/tuscany-contribution-namespace/1.2-incubating-SNAPSHOT/tuscany-contribution-namespace-1.2-incubating-SNAPSHOT.jar
[INFO] ----------------------------------------------------------------------------
[INFO] Building Apache Tuscany SCA Java Import/Export Model
[INFO]    task-segment: [clean, install]
[INFO] ----------------------------------------------------------------------------
[INFO] [clean:clean]
[INFO] Deleting directory /home/continuum/data/working-directory/277/modules/contribution-java/target
[INFO] Deleting directory /home/continuum/data/working-directory/277/modules/contribution-java/target/classes
[INFO] Deleting directory /home/continuum/data/working-directory/277/modules/contribution-java/target/test-classes
[INFO] Deleting directory /home/continuum/data/working-directory/277/modules/contribution-java/target/site
[INFO] [resources:resources]
[INFO] Using default encoding to copy filtered resources.
[INFO] [compiler:compile]
[INFO] Compiling 13 source files to /home/continuum/data/working-directory/277/modules/contribution-java/target/classes
[INFO] [resources:testResources]
[INFO] Using default encoding to copy filtered resources.
[INFO] [compiler:testCompile]
[INFO] Compiling 4 source files to /home/continuum/data/working-directory/277/modules/contribution-java/target/test-classes
[INFO] [surefire:test]
[INFO] Surefire report directory: /home/continuum/data/working-directory/277/modules/contribution-java/target/surefire-reports

-------------------------------------------------------
 T E S T S
-------------------------------------------------------
Running org.apache.tuscany.sca.contribution.java.impl.ContributionClassLoaderTestCase
Tests run: 4, Failures: 0, Errors: 0, Skipped: 0, Time elapsed: 0.112 sec
Running org.apache.tuscany.sca.contribution.java.impl.JavaImportProcessorTestCase
Tests run: 2, Failures: 0, Errors: 0, Skipped: 0, Time elapsed: 0.214 sec
Running org.apache.tuscany.sca.contribution.java.impl.JavaExportProcessorTestCase
Tests run: 2, Failures: 0, Errors: 0, Skipped: 0, Time elapsed: 0.013 sec
Running org.apache.tuscany.sca.contribution.java.impl.ClassReferenceArtifactResolverTestCase
Tests run: 2, Failures: 0, Errors: 0, Skipped: 0, Time elapsed: 0.025 sec

Results :

Tests run: 10, Failures: 0, Errors: 0, Skipped: 0

[INFO] [jar:jar]
[INFO] Building jar: /home/continuum/data/working-directory/277/modules/contribution-java/target/tuscany-contribution-java-1.2-incubating-SNAPSHOT.jar
[INFO] [install:install]
[INFO] Installing /home/continuum/data/working-directory/277/modules/contribution-java/target/tuscany-contribution-java-1.2-incubating-SNAPSHOT.jar to /home/continuum/.m2/repository/org/apache/tuscany/sca/tuscany-contribution-java/1.2-incubating-SNAPSHOT/tuscany-contribution-java-1.2-incubating-SNAPSHOT.jar
[INFO] ----------------------------------------------------------------------------
[INFO] Building Apache Tuscany SCA XML Contribution Model
[INFO]    task-segment: [clean, install]
[INFO] ----------------------------------------------------------------------------
[INFO] [clean:clean]
[INFO] Deleting directory /home/continuum/data/working-directory/277/modules/contribution-xml/target
[INFO] Deleting directory /home/continuum/data/working-directory/277/modules/contribution-xml/target/classes
[INFO] Deleting directory /home/continuum/data/working-directory/277/modules/contribution-xml/target/test-classes
[INFO] Deleting directory /home/continuum/data/working-directory/277/modules/contribution-xml/target/site
[INFO] [resources:resources]
[INFO] Using default encoding to copy filtered resources.
[INFO] [compiler:compile]
[INFO] Compiling 4 source files to /home/continuum/data/working-directory/277/modules/contribution-xml/target/classes
[INFO] [resources:testResources]
[INFO] Using default encoding to copy filtered resources.
[INFO] [compiler:testCompile]
[INFO] Compiling 2 source files to /home/continuum/data/working-directory/277/modules/contribution-xml/target/test-classes
[INFO] [surefire:test]
[INFO] Surefire report directory: /home/continuum/data/working-directory/277/modules/contribution-xml/target/surefire-reports

-------------------------------------------------------
 T E S T S
-------------------------------------------------------
Running org.apache.tuscany.sca.contribution.xml.ContributionMetadataProcessorTestCase
Tests run: 3, Failures: 0, Errors: 0, Skipped: 0, Time elapsed: 0.276 sec

Results :

Tests run: 3, Failures: 0, Errors: 0, Skipped: 0

[INFO] [jar:jar]
[INFO] Building jar: /home/continuum/data/working-directory/277/modules/contribution-xml/target/tuscany-contribution-xml-1.2-incubating-SNAPSHOT.jar
[INFO] [install:install]
[INFO] Installing /home/continuum/data/working-directory/277/modules/contribution-xml/target/tuscany-contribution-xml-1.2-incubating-SNAPSHOT.jar to /home/continuum/.m2/repository/org/apache/tuscany/sca/tuscany-contribution-xml/1.2-incubating-SNAPSHOT/tuscany-contribution-xml-1.2-incubating-SNAPSHOT.jar
[INFO] ----------------------------------------------------------------------------
[INFO] Building Apache Tuscany SCA Resource Import/Export Model
[INFO]    task-segment: [clean, install]
[INFO] ----------------------------------------------------------------------------
[INFO] [clean:clean]
[INFO] Deleting directory /home/continuum/data/working-directory/277/modules/contribution-resource/target
[INFO] Deleting directory /home/continuum/data/working-directory/277/modules/contribution-resource/target/classes
[INFO] Deleting directory /home/continuum/data/working-directory/277/modules/contribution-resource/target/test-classes
[INFO] Deleting directory /home/continuum/data/working-directory/277/modules/contribution-resource/target/site
[INFO] [resources:resources]
[INFO] Using default encoding to copy filtered resources.
[INFO] [compiler:compile]
[INFO] Compiling 10 source files to /home/continuum/data/working-directory/277/modules/contribution-resource/target/classes
[INFO] [resources:testResources]
[INFO] Using default encoding to copy filtered resources.
[INFO] [compiler:testCompile]
[INFO] Compiling 2 source files to /home/continuum/data/working-directory/277/modules/contribution-resource/target/test-classes
[INFO] [surefire:test]
[INFO] Surefire report directory: /home/continuum/data/working-directory/277/modules/contribution-resource/target/surefire-reports

-------------------------------------------------------
 T E S T S
-------------------------------------------------------
Running org.apache.tuscany.sca.contribution.resource.impl.ResourceImportProcessorTestCase
Tests run: 2, Failures: 0, Errors: 0, Skipped: 0, Time elapsed: 0.264 sec
Running org.apache.tuscany.sca.contribution.resource.impl.ResourceExportProcessorTestCase
Tests run: 2, Failures: 0, Errors: 0, Skipped: 0, Time elapsed: 0.016 sec

Results :

Tests run: 4, Failures: 0, Errors: 0, Skipped: 0

[INFO] [jar:jar]
[INFO] Building jar: /home/continuum/data/working-directory/277/modules/contribution-resource/target/tuscany-contribution-resource-1.2-incubating-SNAPSHOT.jar
[INFO] [install:install]
[INFO] Installing /home/continuum/data/working-directory/277/modules/contribution-resource/target/tuscany-contribution-resource-1.2-incubating-SNAPSHOT.jar to /home/continuum/.m2/repository/org/apache/tuscany/sca/tuscany-contribution-resource/1.2-incubating-SNAPSHOT/tuscany-contribution-resource-1.2-incubating-SNAPSHOT.jar
[INFO] ----------------------------------------------------------------------------
[INFO] Building Apache Tuscany SCA Contribution Model Implementation
[INFO]    task-segment: [clean, install]
[INFO] ----------------------------------------------------------------------------
[INFO] [clean:clean]
[INFO] Deleting directory /home/continuum/data/working-directory/277/modules/contribution-impl/target
[INFO] Deleting directory /home/continuum/data/working-directory/277/modules/contribution-impl/target/classes
[INFO] Deleting directory /home/continuum/data/working-directory/277/modules/contribution-impl/target/test-classes
[INFO] Deleting directory /home/continuum/data/working-directory/277/modules/contribution-impl/target/site
[INFO] [resources:resources]
[INFO] Using default encoding to copy filtered resources.
[INFO] [compiler:compile]
[INFO] Compiling 7 source files to /home/continuum/data/working-directory/277/modules/contribution-impl/target/classes
[INFO] [resources:testResources]
[INFO] Using default encoding to copy filtered resources.
[INFO] [compiler:testCompile]
[INFO] Compiling 8 source files to /home/continuum/data/working-directory/277/modules/contribution-impl/target/test-classes
[INFO] [surefire:test]
[INFO] Surefire report directory: /home/continuum/data/working-directory/277/modules/contribution-impl/target/surefire-reports

-------------------------------------------------------
 T E S T S
-------------------------------------------------------
Running org.apache.tuscany.sca.contribution.processor.JarContributionPackageProcessorTestCase
Tests run: 1, Failures: 0, Errors: 0, Skipped: 0, Time elapsed: 0.055 sec
Running org.apache.tuscany.sca.contribution.services.PackageTypeDescriberImplTestCase
Tests run: 5, Failures: 0, Errors: 0, Skipped: 0, Time elapsed: 0.546 sec
Running org.apache.tuscany.sca.contribution.resolver.ExtensibleModelResolverTestCase
Tests run: 5, Failures: 0, Errors: 0, Skipped: 0, Time elapsed: 1.751 sec
Running org.apache.tuscany.sca.contribution.processor.FolderContributionPackageProcessorTestCase
Tests run: 1, Failures: 0, Errors: 0, Skipped: 0, Time elapsed: 0.054 sec
Running org.apache.tuscany.sca.contribution.resolver.DefaultModelResolverTestCase
Tests run: 3, Failures: 0, Errors: 0, Skipped: 0, Time elapsed: 0.008 sec
Running org.apache.tuscany.sca.contribution.processor.URLartifactProcessorExtensionPointTestCase
Tests run: 2, Failures: 0, Errors: 0, Skipped: 0, Time elapsed: 0.013 sec
Running org.apache.tuscany.sca.contribution.services.ContributionRepositoryTestCase
Tests run: 3, Failures: 0, Errors: 0, Skipped: 0, Time elapsed: 0.079 sec

Results :

Tests run: 20, Failures: 0, Errors: 0, Skipped: 0

[INFO] [jar:jar]
[INFO] Building jar: /home/continuum/data/working-directory/277/modules/contribution-impl/target/tuscany-contribution-impl-1.2-incubating-SNAPSHOT.jar
[INFO] [install:install]
[INFO] Installing /home/continuum/data/working-directory/277/modules/contribution-impl/target/tuscany-contribution-impl-1.2-incubating-SNAPSHOT.jar to /home/continuum/.m2/repository/org/apache/tuscany/sca/tuscany-contribution-impl/1.2-incubating-SNAPSHOT/tuscany-contribution-impl-1.2-incubating-SNAPSHOT.jar
[INFO] ----------------------------------------------------------------------------
[INFO] Building Apache Tuscany SCA XML Assembly Model
[INFO]    task-segment: [clean, install]
[INFO] ----------------------------------------------------------------------------
[INFO] [clean:clean]
[INFO] Deleting directory /home/continuum/data/working-directory/277/modules/assembly-xml/target
[INFO] Deleting directory /home/continuum/data/working-directory/277/modules/assembly-xml/target/classes
[INFO] Deleting directory /home/continuum/data/working-directory/277/modules/assembly-xml/target/test-classes
[INFO] Deleting directory /home/continuum/data/working-directory/277/modules/assembly-xml/target/site
[INFO] [resources:resources]
[INFO] Using default encoding to copy filtered resources.
[INFO] [compiler:compile]
[INFO] Compiling 14 source files to /home/continuum/data/working-directory/277/modules/assembly-xml/target/classes
[INFO] [resources:testResources]
[INFO] Using default encoding to copy filtered resources.
[INFO] [compiler:testCompile]
[INFO] Compiling 12 source files to /home/continuum/data/working-directory/277/modules/assembly-xml/target/test-classes
[INFO] [surefire:test]
[INFO] Surefire report directory: /home/continuum/data/working-directory/277/modules/assembly-xml/target/surefire-reports

-------------------------------------------------------
 T E S T S
-------------------------------------------------------
Running org.apache.tuscany.sca.assembly.xml.ResolveTestCase
Mar 14, 2008 3:10:45 AM org.apache.tuscany.sca.contribution.processor.ExtensibleStAXArtifactProcessor read
WARNING: Element {http://www.osoa.org/xmlns/sca/1.0}interface.java cannot be processed. ([row,col {unknown-source}]: [26,9])
Mar 14, 2008 3:10:46 AM org.apache.tuscany.sca.contribution.processor.ExtensibleStAXArtifactProcessor read
WARNING: Element {http://www.osoa.org/xmlns/sca/1.0}interface.java cannot be processed. ([row,col {unknown-source}]: [30,9])
Mar 14, 2008 3:10:46 AM org.apache.tuscany.sca.contribution.processor.ExtensibleStAXArtifactProcessor read
WARNING: Element {http://extension}testExtension cannot be processed. ([row,col {unknown-source}]: [30,5])
Mar 14, 2008 3:10:46 AM org.apache.tuscany.sca.contribution.processor.ExtensibleStAXArtifactProcessor read
WARNING: Element {http://extension}testExtension cannot be processed. ([row,col {unknown-source}]: [34,9])
Mar 14, 2008 3:10:46 AM org.apache.tuscany.sca.contribution.processor.ExtensibleStAXArtifactProcessor read
WARNING: Element {http://www.osoa.org/xmlns/sca/1.0}interface.java cannot be processed. ([row,col {unknown-source}]: [35,9])
Mar 14, 2008 3:10:46 AM org.apache.tuscany.sca.contribution.processor.ExtensibleStAXArtifactProcessor read
WARNING: Element {http://www.osoa.org/xmlns/sca/1.0}binding.ws cannot be processed. ([row,col {unknown-source}]: [38,9])
Mar 14, 2008 3:10:46 AM org.apache.tuscany.sca.contribution.processor.ExtensibleStAXArtifactProcessor read
WARNING: Element {http://extension}testExtension cannot be processed. ([row,col {unknown-source}]: [43,10])
Mar 14, 2008 3:10:46 AM org.apache.tuscany.sca.contribution.processor.ExtensibleStAXArtifactProcessor read
WARNING: Element {http://www.osoa.org/xmlns/sca/1.0}binding.ws cannot be processed. ([row,col {unknown-source}]: [44,13])
Mar 14, 2008 3:10:46 AM org.apache.tuscany.sca.contribution.processor.ExtensibleStAXArtifactProcessor read
WARNING: Element {http://extension}testExtension cannot be processed. ([row,col {unknown-source}]: [52,9])
Mar 14, 2008 3:10:46 AM org.apache.tuscany.sca.contribution.processor.ExtensibleStAXArtifactProcessor read
WARNING: Element {http://www.osoa.org/xmlns/sca/1.0}interface.java cannot be processed. ([row,col {unknown-source}]: [54,13])
Mar 14, 2008 3:10:46 AM org.apache.tuscany.sca.contribution.processor.ExtensibleStAXArtifactProcessor read
WARNING: Element {http://extension}testExtension cannot be processed. ([row,col {unknown-source}]: [59,13])
Mar 14, 2008 3:10:46 AM org.apache.tuscany.sca.contribution.processor.ExtensibleStAXArtifactProcessor read
WARNING: Element {http://www.osoa.org/xmlns/sca/1.0}interface.java cannot be processed. ([row,col {unknown-source}]: [60,13])
Mar 14, 2008 3:10:46 AM org.apache.tuscany.sca.contribution.processor.ExtensibleStAXArtifactProcessor read
WARNING: Element {http://www.osoa.org/xmlns/sca/1.0}implementation.java cannot be processed. ([row,col {unknown-source}]: [68,9])
Mar 14, 2008 3:10:46 AM org.apache.tuscany.sca.contribution.processor.ExtensibleStAXArtifactProcessor read
WARNING: Element {http://www.osoa.org/xmlns/sca/1.0}interface.java cannot be processed. ([row,col {unknown-source}]: [73,13])
Mar 14, 2008 3:10:46 AM org.apache.tuscany.sca.contribution.processor.ExtensibleStAXArtifactProcessor read
WARNING: Element {http://www.osoa.org/xmlns/sca/1.0}implementation.java cannot be processed. ([row,col {unknown-source}]: [75,9])
Mar 14, 2008 3:10:46 AM org.apache.tuscany.sca.contribution.processor.ExtensibleStAXArtifactProcessor read
WARNING: Element {http://www.osoa.org/xmlns/sca/1.0}interface.java cannot be processed. ([row,col {unknown-source}]: [80,13])
Mar 14, 2008 3:10:46 AM org.apache.tuscany.sca.contribution.processor.ExtensibleStAXArtifactProcessor read
WARNING: Element {http://www.osoa.org/xmlns/sca/1.0}implementation.java cannot be processed. ([row,col {unknown-source}]: [86,9])
Mar 14, 2008 3:10:46 AM org.apache.tuscany.sca.contribution.processor.ExtensibleStAXArtifactProcessor read
WARNING: Element {http://www.osoa.org/xmlns/sca/1.0}implementation.java cannot be processed. ([row,col {unknown-source}]: [90,9])
Mar 14, 2008 3:10:46 AM org.apache.tuscany.sca.contribution.processor.ExtensibleStAXArtifactProcessor read
WARNING: Element {http://www.osoa.org/xmlns/sca/1.0}implementation.java cannot be processed. ([row,col {unknown-source}]: [94,9])
Mar 14, 2008 3:10:46 AM org.apache.tuscany.sca.contribution.processor.ExtensibleStAXArtifactProcessor read
WARNING: Element {http://www.osoa.org/xmlns/sca/1.0}interface.java cannot be processed. ([row,col {unknown-source}]: [99,9])
Mar 14, 2008 3:10:46 AM org.apache.tuscany.sca.contribution.processor.ExtensibleStAXArtifactProcessor read
WARNING: Element {http://www.osoa.org/xmlns/sca/1.0}binding.ws cannot be processed. ([row,col {unknown-source}]: [102,9])
Mar 14, 2008 3:10:46 AM org.apache.tuscany.sca.contribution.processor.ExtensibleStAXArtifactProcessor read
WARNING: Element {http://www.osoa.org/xmlns/sca/1.0}binding.ws cannot be processed. ([row,col {unknown-source}]: [107,13])
Mar 14, 2008 3:10:46 AM org.apache.tuscany.sca.contribution.processor.ExtensibleStAXArtifactProcessor read
WARNING: Element {http://www.osoa.org/xmlns/sca/1.0}interface.java cannot be processed. ([row,col {unknown-source}]: [26,9])
Mar 14, 2008 3:10:46 AM org.apache.tuscany.sca.contribution.processor.ExtensibleStAXArtifactProcessor read
WARNING: Element {http://www.osoa.org/xmlns/sca/1.0}implementation.java cannot be processed. ([row,col {unknown-source}]: [30,3])
Mar 14, 2008 3:10:46 AM org.apache.tuscany.sca.contribution.processor.ExtensibleStAXArtifactProcessor read
WARNING: Element {http://www.osoa.org/xmlns/sca/1.0}implementation.java cannot be processed. ([row,col {unknown-source}]: [38,9])
Mar 14, 2008 3:10:46 AM org.apache.tuscany.sca.contribution.processor.ExtensibleStAXArtifactProcessor read
WARNING: Element {http://www.osoa.org/xmlns/sca/1.0}implementation.java cannot be processed. ([row,col {unknown-source}]: [42,9])
Mar 14, 2008 3:10:46 AM org.apache.tuscany.sca.contribution.processor.ExtensibleStAXArtifactProcessor read
WARNING: Element {http://www.osoa.org/xmlns/sca/1.0}implementation.java cannot be processed. ([row,col {unknown-source}]: [46,9])
Mar 14, 2008 3:10:46 AM org.apache.tuscany.sca.contribution.processor.ExtensibleStAXArtifactProcessor read
WARNING: Element {http://www.osoa.org/xmlns/sca/1.0}implementation.java cannot be processed. ([row,col {unknown-source}]: [50,9])
Mar 14, 2008 3:10:46 AM org.apache.tuscany.sca.contribution.processor.ExtensibleStAXArtifactProcessor read
WARNING: Element {http://extension}testExtension cannot be processed. ([row,col {unknown-source}]: [30,5])
Mar 14, 2008 3:10:46 AM org.apache.tuscany.sca.contribution.processor.ExtensibleStAXArtifactProcessor read
WARNING: Element {http://extension}testExtension cannot be processed. ([row,col {unknown-source}]: [34,9])
Mar 14, 2008 3:10:46 AM org.apache.tuscany.sca.contribution.processor.ExtensibleStAXArtifactProcessor read
WARNING: Element {http://www.osoa.org/xmlns/sca/1.0}interface.java cannot be processed. ([row,col {unknown-source}]: [35,9])
Mar 14, 2008 3:10:46 AM org.apache.tuscany.sca.contribution.processor.ExtensibleStAXArtifactProcessor read
WARNING: Element {http://www.osoa.org/xmlns/sca/1.0}binding.ws cannot be processed. ([row,col {unknown-source}]: [38,9])
Mar 14, 2008 3:10:46 AM org.apache.tuscany.sca.contribution.processor.ExtensibleStAXArtifactProcessor read
WARNING: Element {http://extension}testExtension cannot be processed. ([row,col {unknown-source}]: [43,10])
Mar 14, 2008 3:10:46 AM org.apache.tuscany.sca.contribution.processor.ExtensibleStAXArtifactProcessor read
WARNING: Element {http://www.osoa.org/xmlns/sca/1.0}binding.ws cannot be processed. ([row,col {unknown-source}]: [44,13])
Mar 14, 2008 3:10:46 AM org.apache.tuscany.sca.contribution.processor.ExtensibleStAXArtifactProcessor read
WARNING: Element {http://extension}testExtension cannot be processed. ([row,col {unknown-source}]: [52,9])
Mar 14, 2008 3:10:46 AM org.apache.tuscany.sca.contribution.processor.ExtensibleStAXArtifactProcessor read
WARNING: Element {http://www.osoa.org/xmlns/sca/1.0}interface.java cannot be processed. ([row,col {unknown-source}]: [54,13])
Mar 14, 2008 3:10:46 AM org.apache.tuscany.sca.contribution.processor.ExtensibleStAXArtifactProcessor read
WARNING: Element {http://extension}testExtension cannot be processed. ([row,col {unknown-source}]: [59,13])
Mar 14, 2008 3:10:46 AM org.apache.tuscany.sca.contribution.processor.ExtensibleStAXArtifactProcessor read
WARNING: Element {http://www.osoa.org/xmlns/sca/1.0}interface.java cannot be processed. ([row,col {unknown-source}]: [60,13])
Mar 14, 2008 3:10:46 AM org.apache.tuscany.sca.contribution.processor.ExtensibleStAXArtifactProcessor read
WARNING: Element {http://www.osoa.org/xmlns/sca/1.0}implementation.java cannot be processed. ([row,col {unknown-source}]: [68,9])
Mar 14, 2008 3:10:46 AM org.apache.tuscany.sca.contribution.processor.ExtensibleStAXArtifactProcessor read
WARNING: Element {http://www.osoa.org/xmlns/sca/1.0}interface.java cannot be processed. ([row,col {unknown-source}]: [73,13])
Mar 14, 2008 3:10:46 AM org.apache.tuscany.sca.contribution.processor.ExtensibleStAXArtifactProcessor read
WARNING: Element {http://www.osoa.org/xmlns/sca/1.0}implementation.java cannot be processed. ([row,col {unknown-source}]: [75,9])
Mar 14, 2008 3:10:46 AM org.apache.tuscany.sca.contribution.processor.ExtensibleStAXArtifactProcessor read
WARNING: Element {http://www.osoa.org/xmlns/sca/1.0}interface.java cannot be processed. ([row,col {unknown-source}]: [80,13])
Mar 14, 2008 3:10:46 AM org.apache.tuscany.sca.contribution.processor.ExtensibleStAXArtifactProcessor read
WARNING: Element {http://www.osoa.org/xmlns/sca/1.0}implementation.java cannot be processed. ([row,col {unknown-source}]: [86,9])
Mar 14, 2008 3:10:46 AM org.apache.tuscany.sca.contribution.processor.ExtensibleStAXArtifactProcessor read
WARNING: Element {http://www.osoa.org/xmlns/sca/1.0}implementation.java cannot be processed. ([row,col {unknown-source}]: [90,9])
Mar 14, 2008 3:10:46 AM org.apache.tuscany.sca.contribution.processor.ExtensibleStAXArtifactProcessor read
WARNING: Element {http://www.osoa.org/xmlns/sca/1.0}implementation.java cannot be processed. ([row,col {unknown-source}]: [94,9])
Mar 14, 2008 3:10:46 AM org.apache.tuscany.sca.contribution.processor.ExtensibleStAXArtifactProcessor read
WARNING: Element {http://www.osoa.org/xmlns/sca/1.0}interface.java cannot be processed. ([row,col {unknown-source}]: [99,9])
Mar 14, 2008 3:10:46 AM org.apache.tuscany.sca.contribution.processor.ExtensibleStAXArtifactProcessor read
WARNING: Element {http://www.osoa.org/xmlns/sca/1.0}binding.ws cannot be processed. ([row,col {unknown-source}]: [102,9])
Mar 14, 2008 3:10:46 AM org.apache.tuscany.sca.contribution.processor.ExtensibleStAXArtifactProcessor read
WARNING: Element {http://www.osoa.org/xmlns/sca/1.0}binding.ws cannot be processed. ([row,col {unknown-source}]: [107,13])
Tests run: 2, Failures: 0, Errors: 0, Skipped: 0, Time elapsed: 0.983 sec
Running org.apache.tuscany.sca.assembly.xml.ReadTestCase
Mar 14, 2008 3:10:46 AM org.apache.tuscany.sca.contribution.processor.ExtensibleStAXArtifactProcessor read
WARNING: Element {http://www.osoa.org/xmlns/sca/1.0}interface.java cannot be processed. ([row,col {unknown-source}]: [26,9])
Mar 14, 2008 3:10:46 AM org.apache.tuscany.sca.contribution.processor.ExtensibleStAXArtifactProcessor read
WARNING: Element {http://www.osoa.org/xmlns/sca/1.0}implementation.java cannot be processed. ([row,col {unknown-source}]: [30,3])
Mar 14, 2008 3:10:46 AM org.apache.tuscany.sca.contribution.processor.ExtensibleStAXArtifactProcessor read
WARNING: Element {http://www.osoa.org/xmlns/sca/1.0}implementation.java cannot be processed. ([row,col {unknown-source}]: [38,9])
Mar 14, 2008 3:10:46 AM org.apache.tuscany.sca.contribution.processor.ExtensibleStAXArtifactProcessor read
WARNING: Element {http://www.osoa.org/xmlns/sca/1.0}implementation.java cannot be processed. ([row,col {unknown-source}]: [42,9])
Mar 14, 2008 3:10:46 AM org.apache.tuscany.sca.contribution.processor.ExtensibleStAXArtifactProcessor read
WARNING: Element {http://www.osoa.org/xmlns/sca/1.0}implementation.java cannot be processed. ([row,col {unknown-source}]: [46,9])
Mar 14, 2008 3:10:46 AM org.apache.tuscany.sca.contribution.processor.ExtensibleStAXArtifactProcessor read
WARNING: Element {http://www.osoa.org/xmlns/sca/1.0}implementation.java cannot be processed. ([row,col {unknown-source}]: [50,9])
Mar 14, 2008 3:10:46 AM org.apache.tuscany.sca.contribution.processor.ExtensibleStAXArtifactProcessor read
WARNING: Element {http://www.osoa.org/xmlns/sca/1.0}interface.java cannot be processed. ([row,col {unknown-source}]: [23,9])
Mar 14, 2008 3:10:46 AM org.apache.tuscany.sca.contribution.processor.ExtensibleStAXArtifactProcessor read
WARNING: Element {http://www.osoa.org/xmlns/sca/1.0}interface.java cannot be processed. ([row,col {unknown-source}]: [27,9])
Mar 14, 2008 3:10:46 AM org.apache.tuscany.sca.contribution.processor.ExtensibleStAXArtifactProcessor read
WARNING: Element {http://www.osoa.org/xmlns/sca/1.0}interface.java cannot be processed. ([row,col {unknown-source}]: [26,9])
Mar 14, 2008 3:10:46 AM org.apache.tuscany.sca.contribution.processor.ExtensibleStAXArtifactProcessor read
WARNING: Element {http://www.osoa.org/xmlns/sca/1.0}interface.java cannot be processed. ([row,col {unknown-source}]: [30,9])
Mar 14, 2008 3:10:46 AM org.apache.tuscany.sca.contribution.processor.ExtensibleStAXArtifactProcessor read
WARNING: Element {http://www.osoa.org/xmlns/sca/1.0}interface.java cannot be processed. ([row,col {unknown-source}]: [26,9])
Mar 14, 2008 3:10:46 AM org.apache.tuscany.sca.contribution.processor.ExtensibleStAXArtifactProcessor read
WARNING: Element {http://www.osoa.org/xmlns/sca/1.0}implementation.java cannot be processed. ([row,col {unknown-source}]: [30,3])
Mar 14, 2008 3:10:46 AM org.apache.tuscany.sca.contribution.processor.ExtensibleStAXArtifactProcessor read
WARNING: Element {http://www.osoa.org/xmlns/sca/1.0}implementation.java cannot be processed. ([row,col {unknown-source}]: [38,9])
Mar 14, 2008 3:10:46 AM org.apache.tuscany.sca.contribution.processor.ExtensibleStAXArtifactProcessor read
WARNING: Element {http://www.osoa.org/xmlns/sca/1.0}implementation.java cannot be processed. ([row,col {unknown-source}]: [42,9])
Mar 14, 2008 3:10:46 AM org.apache.tuscany.sca.contribution.processor.ExtensibleStAXArtifactProcessor read
WARNING: Element {http://www.osoa.org/xmlns/sca/1.0}implementation.java cannot be processed. ([row,col {unknown-source}]: [46,9])
Mar 14, 2008 3:10:46 AM org.apache.tuscany.sca.contribution.processor.ExtensibleStAXArtifactProcessor read
WARNING: Element {http://www.osoa.org/xmlns/sca/1.0}implementation.java cannot be processed. ([row,col {unknown-source}]: [50,9])
Tests run: 4, Failures: 0, Errors: 0, Skipped: 0, Time elapsed: 0.19 sec
Running org.apache.tuscany.sca.assembly.xml.WireTestCase
Mar 14, 2008 3:10:46 AM org.apache.tuscany.sca.contribution.processor.ExtensibleStAXArtifactProcessor read
WARNING: Element {http://www.osoa.org/xmlns/sca/1.0}interface.java cannot be processed. ([row,col {unknown-source}]: [26,9])
Mar 14, 2008 3:10:46 AM org.apache.tuscany.sca.contribution.processor.ExtensibleStAXArtifactProcessor read
WARNING: Element {http://www.osoa.org/xmlns/sca/1.0}interface.java cannot be processed. ([row,col {unknown-source}]: [30,9])
Mar 14, 2008 3:10:46 AM org.apache.tuscany.sca.contribution.processor.ExtensibleStAXArtifactProcessor read
WARNING: Element {http://extension}testExtension cannot be processed. ([row,col {unknown-source}]: [30,5])
Mar 14, 2008 3:10:47 AM org.apache.tuscany.sca.contribution.processor.ExtensibleStAXArtifactProcessor read
WARNING: Element {http://extension}testExtension cannot be processed. ([row,col {unknown-source}]: [34,9])
Mar 14, 2008 3:10:47 AM org.apache.tuscany.sca.contribution.processor.ExtensibleStAXArtifactProcessor read
WARNING: Element {http://www.osoa.org/xmlns/sca/1.0}interface.java cannot be processed. ([row,col {unknown-source}]: [35,9])
Mar 14, 2008 3:10:47 AM org.apache.tuscany.sca.contribution.processor.ExtensibleStAXArtifactProcessor read
WARNING: Element {http://www.osoa.org/xmlns/sca/1.0}binding.ws cannot be processed. ([row,col {unknown-source}]: [38,9])
Mar 14, 2008 3:10:47 AM org.apache.tuscany.sca.contribution.processor.ExtensibleStAXArtifactProcessor read
WARNING: Element {http://extension}testExtension cannot be processed. ([row,col {unknown-source}]: [43,10])
Mar 14, 2008 3:10:47 AM org.apache.tuscany.sca.contribution.processor.ExtensibleStAXArtifactProcessor read
WARNING: Element {http://www.osoa.org/xmlns/sca/1.0}binding.ws cannot be processed. ([row,col {unknown-source}]: [44,13])
Mar 14, 2008 3:10:47 AM org.apache.tuscany.sca.contribution.processor.ExtensibleStAXArtifactProcessor read
WARNING: Element {http://extension}testExtension cannot be processed. ([row,col {unknown-source}]: [52,9])
Mar 14, 2008 3:10:47 AM org.apache.tuscany.sca.contribution.processor.ExtensibleStAXArtifactProcessor read
WARNING: Element {http://www.osoa.org/xmlns/sca/1.0}interface.java cannot be processed. ([row,col {unknown-source}]: [54,13])
Mar 14, 2008 3:10:47 AM org.apache.tuscany.sca.contribution.processor.ExtensibleStAXArtifactProcessor read
WARNING: Element {http://extension}testExtension cannot be processed. ([row,col {unknown-source}]: [59,13])
Mar 14, 2008 3:10:47 AM org.apache.tuscany.sca.contribution.processor.ExtensibleStAXArtifactProcessor read
WARNING: Element {http://www.osoa.org/xmlns/sca/1.0}interface.java cannot be processed. ([row,col {unknown-source}]: [60,13])
Mar 14, 2008 3:10:47 AM org.apache.tuscany.sca.contribution.processor.ExtensibleStAXArtifactProcessor read
WARNING: Element {http://www.osoa.org/xmlns/sca/1.0}implementation.java cannot be processed. ([row,col {unknown-source}]: [68,9])
Mar 14, 2008 3:10:47 AM org.apache.tuscany.sca.contribution.processor.ExtensibleStAXArtifactProcessor read
WARNING: Element {http://www.osoa.org/xmlns/sca/1.0}interface.java cannot be processed. ([row,col {unknown-source}]: [73,13])
Mar 14, 2008 3:10:47 AM org.apache.tuscany.sca.contribution.processor.ExtensibleStAXArtifactProcessor read
WARNING: Element {http://www.osoa.org/xmlns/sca/1.0}implementation.java cannot be processed. ([row,col {unknown-source}]: [75,9])
Mar 14, 2008 3:10:47 AM org.apache.tuscany.sca.contribution.processor.ExtensibleStAXArtifactProcessor read
WARNING: Element {http://www.osoa.org/xmlns/sca/1.0}interface.java cannot be processed. ([row,col {unknown-source}]: [80,13])
Mar 14, 2008 3:10:47 AM org.apache.tuscany.sca.contribution.processor.ExtensibleStAXArtifactProcessor read
WARNING: Element {http://www.osoa.org/xmlns/sca/1.0}implementation.java cannot be processed. ([row,col {unknown-source}]: [86,9])
Mar 14, 2008 3:10:47 AM org.apache.tuscany.sca.contribution.processor.ExtensibleStAXArtifactProcessor read
WARNING: Element {http://www.osoa.org/xmlns/sca/1.0}implementation.java cannot be processed. ([row,col {unknown-source}]: [90,9])
Mar 14, 2008 3:10:47 AM org.apache.tuscany.sca.contribution.processor.ExtensibleStAXArtifactProcessor read
WARNING: Element {http://www.osoa.org/xmlns/sca/1.0}implementation.java cannot be processed. ([row,col {unknown-source}]: [94,9])
Mar 14, 2008 3:10:47 AM org.apache.tuscany.sca.contribution.processor.ExtensibleStAXArtifactProcessor read
WARNING: Element {http://www.osoa.org/xmlns/sca/1.0}interface.java cannot be processed. ([row,col {unknown-source}]: [99,9])
Mar 14, 2008 3:10:47 AM org.apache.tuscany.sca.contribution.processor.ExtensibleStAXArtifactProcessor read
WARNING: Element {http://www.osoa.org/xmlns/sca/1.0}binding.ws cannot be processed. ([row,col {unknown-source}]: [102,9])
Mar 14, 2008 3:10:47 AM org.apache.tuscany.sca.contribution.processor.ExtensibleStAXArtifactProcessor read
WARNING: Element {http://www.osoa.org/xmlns/sca/1.0}binding.ws cannot be processed. ([row,col {unknown-source}]: [107,13])
Mar 14, 2008 3:10:47 AM org.apache.tuscany.sca.contribution.processor.ExtensibleStAXArtifactProcessor read
WARNING: Element {http://www.osoa.org/xmlns/sca/1.0}interface.java cannot be processed. ([row,col {unknown-source}]: [26,9])
Mar 14, 2008 3:10:47 AM org.apache.tuscany.sca.contribution.processor.ExtensibleStAXArtifactProcessor read
WARNING: Element {http://www.osoa.org/xmlns/sca/1.0}implementation.java cannot be processed. ([row,col {unknown-source}]: [30,3])
Mar 14, 2008 3:10:47 AM org.apache.tuscany.sca.contribution.processor.ExtensibleStAXArtifactProcessor read
WARNING: Element {http://www.osoa.org/xmlns/sca/1.0}implementation.java cannot be processed. ([row,col {unknown-source}]: [38,9])
Mar 14, 2008 3:10:47 AM org.apache.tuscany.sca.contribution.processor.ExtensibleStAXArtifactProcessor read
WARNING: Element {http://www.osoa.org/xmlns/sca/1.0}implementation.java cannot be processed. ([row,col {unknown-source}]: [42,9])
Mar 14, 2008 3:10:47 AM org.apache.tuscany.sca.contribution.processor.ExtensibleStAXArtifactProcessor read
WARNING: Element {http://www.osoa.org/xmlns/sca/1.0}implementation.java cannot be processed. ([row,col {unknown-source}]: [46,9])
Mar 14, 2008 3:10:47 AM org.apache.tuscany.sca.contribution.processor.ExtensibleStAXArtifactProcessor read
WARNING: Element {http://www.osoa.org/xmlns/sca/1.0}implementation.java cannot be processed. ([row,col {unknown-source}]: [50,9])
Mar 14, 2008 3:10:47 AM org.apache.tuscany.sca.contribution.processor.ExtensibleStAXArtifactProcessor read
WARNING: Element {http://extension}testExtension cannot be processed. ([row,col {unknown-source}]: [30,5])
Mar 14, 2008 3:10:47 AM org.apache.tuscany.sca.contribution.processor.ExtensibleStAXArtifactProcessor read
WARNING: Element {http://extension}testExtension cannot be processed. ([row,col {unknown-source}]: [34,9])
Mar 14, 2008 3:10:47 AM org.apache.tuscany.sca.contribution.processor.ExtensibleStAXArtifactProcessor read
WARNING: Element {http://www.osoa.org/xmlns/sca/1.0}interface.java cannot be processed. ([row,col {unknown-source}]: [35,9])
Mar 14, 2008 3:10:47 AM org.apache.tuscany.sca.contribution.processor.ExtensibleStAXArtifactProcessor read
WARNING: Element {http://www.osoa.org/xmlns/sca/1.0}binding.ws cannot be processed. ([row,col {unknown-source}]: [38,9])
Mar 14, 2008 3:10:47 AM org.apache.tuscany.sca.contribution.processor.ExtensibleStAXArtifactProcessor read
WARNING: Element {http://extension}testExtension cannot be processed. ([row,col {unknown-source}]: [43,10])
Mar 14, 2008 3:10:47 AM org.apache.tuscany.sca.contribution.processor.ExtensibleStAXArtifactProcessor read
WARNING: Element {http://www.osoa.org/xmlns/sca/1.0}binding.ws cannot be processed. ([row,col {unknown-source}]: [44,13])
Mar 14, 2008 3:10:47 AM org.apache.tuscany.sca.contribution.processor.ExtensibleStAXArtifactProcessor read
WARNING: Element {http://extension}testExtension cannot be processed. ([row,col {unknown-source}]: [52,9])
Mar 14, 2008 3:10:47 AM org.apache.tuscany.sca.contribution.processor.ExtensibleStAXArtifactProcessor read
WARNING: Element {http://www.osoa.org/xmlns/sca/1.0}interface.java cannot be processed. ([row,col {unknown-source}]: [54,13])
Mar 14, 2008 3:10:47 AM org.apache.tuscany.sca.contribution.processor.ExtensibleStAXArtifactProcessor read
WARNING: Element {http://extension}testExtension cannot be processed. ([row,col {unknown-source}]: [59,13])
Mar 14, 2008 3:10:47 AM org.apache.tuscany.sca.contribution.processor.ExtensibleStAXArtifactProcessor read
WARNING: Element {http://www.osoa.org/xmlns/sca/1.0}interface.java cannot be processed. ([row,col {unknown-source}]: [60,13])
Mar 14, 2008 3:10:47 AM org.apache.tuscany.sca.contribution.processor.ExtensibleStAXArtifactProcessor read
WARNING: Element {http://www.osoa.org/xmlns/sca/1.0}implementation.java cannot be processed. ([row,col {unknown-source}]: [68,9])
Mar 14, 2008 3:10:47 AM org.apache.tuscany.sca.contribution.processor.ExtensibleStAXArtifactProcessor read
WARNING: Element {http://www.osoa.org/xmlns/sca/1.0}interface.java cannot be processed. ([row,col {unknown-source}]: [73,13])
Mar 14, 2008 3:10:47 AM org.apache.tuscany.sca.contribution.processor.ExtensibleStAXArtifactProcessor read
WARNING: Element {http://www.osoa.org/xmlns/sca/1.0}implementation.java cannot be processed. ([row,col {unknown-source}]: [75,9])
Mar 14, 2008 3:10:47 AM org.apache.tuscany.sca.contribution.processor.ExtensibleStAXArtifactProcessor read
WARNING: Element {http://www.osoa.org/xmlns/sca/1.0}interface.java cannot be processed. ([row,col {unknown-source}]: [80,13])
Mar 14, 2008 3:10:47 AM org.apache.tuscany.sca.contribution.processor.ExtensibleStAXArtifactProcessor read
WARNING: Element {http://www.osoa.org/xmlns/sca/1.0}implementation.java cannot be processed. ([row,col {unknown-source}]: [86,9])
Mar 14, 2008 3:10:47 AM org.apache.tuscany.sca.contribution.processor.ExtensibleStAXArtifactProcessor read
WARNING: Element {http://www.osoa.org/xmlns/sca/1.0}implementation.java cannot be processed. ([row,col {unknown-source}]: [90,9])
Mar 14, 2008 3:10:47 AM org.apache.tuscany.sca.contribution.processor.ExtensibleStAXArtifactProcessor read
WARNING: Element {http://www.osoa.org/xmlns/sca/1.0}implementation.java cannot be processed. ([row,col {unknown-source}]: [94,9])
Mar 14, 2008 3:10:47 AM org.apache.tuscany.sca.contribution.processor.ExtensibleStAXArtifactProcessor read
WARNING: Element {http://www.osoa.org/xmlns/sca/1.0}interface.java cannot be processed. ([row,col {unknown-source}]: [99,9])
Mar 14, 2008 3:10:47 AM org.apache.tuscany.sca.contribution.processor.ExtensibleStAXArtifactProcessor read
WARNING: Element {http://www.osoa.org/xmlns/sca/1.0}binding.ws cannot be processed. ([row,col {unknown-source}]: [102,9])
Mar 14, 2008 3:10:47 AM org.apache.tuscany.sca.contribution.processor.ExtensibleStAXArtifactProcessor read
WARNING: Element {http://www.osoa.org/xmlns/sca/1.0}binding.ws cannot be processed. ([row,col {unknown-source}]: [107,13])
Tests run: 2, Failures: 0, Errors: 2, Skipped: 0, Time elapsed: 0.305 sec <<< FAILURE!
testResolveConstrainingType(org.apache.tuscany.sca.assembly.xml.WireTestCase)  Time elapsed: 0.237 sec  <<< ERROR!
org.apache.tuscany.sca.contribution.service.ContributionReadException: javax.xml.xpath.XPathExpressionException
	at org.apache.tuscany.sca.policy.xml.PolicySetProcessor.read(PolicySetProcessor.java:109)
	at org.apache.tuscany.sca.policy.xml.PolicySetProcessor.read(PolicySetProcessor.java:61)
	at org.apache.tuscany.sca.contribution.processor.ExtensibleStAXArtifactProcessor.read(ExtensibleStAXArtifactProcessor.java:83)
	at org.apache.tuscany.sca.definitions.xml.SCADefinitionsProcessor.read(SCADefinitionsProcessor.java:90)
	at org.apache.tuscany.sca.definitions.xml.SCADefinitionsProcessor.read(SCADefinitionsProcessor.java:49)
	at org.apache.tuscany.sca.contribution.processor.ExtensibleStAXArtifactProcessor.read(ExtensibleStAXArtifactProcessor.java:83)
	at org.apache.tuscany.sca.definitions.xml.SCADefinitionsDocumentProcessor.read(SCADefinitionsDocumentProcessor.java:120)
	at org.apache.tuscany.sca.assembly.xml.WireTestCase.testResolveConstrainingType(WireTestCase.java:104)
	at sun.reflect.NativeMethodAccessorImpl.invoke0(Native Method)
	at sun.reflect.NativeMethodAccessorImpl.invoke(NativeMethodAccessorImpl.java:39)
	at sun.reflect.DelegatingMethodAccessorImpl.invoke(DelegatingMethodAccessorImpl.java:25)
	at java.lang.reflect.Method.invoke(Method.java:585)
	at junit.framework.TestCase.runTest(TestCase.java:168)
	at junit.framework.TestCase.runBare(TestCase.java:134)
	at junit.framework.TestResult$1.protect(TestResult.java:110)
	at junit.framework.TestResult.runProtected(TestResult.java:128)
	at junit.framework.TestResult.run(TestResult.java:113)
	at junit.framework.TestCase.run(TestCase.java:124)
	at junit.framework.TestSuite.runTest(TestSuite.java:232)
	at junit.framework.TestSuite.run(TestSuite.java:227)
	at org.junit.internal.runners.OldTestClassRunner.run(OldTestClassRunner.java:35)
	at org.apache.maven.surefire.junit4.JUnit4TestSet.execute(JUnit4TestSet.java:62)
	at org.apache.maven.surefire.suite.AbstractDirectoryTestSuite.executeTestSet(AbstractDirectoryTestSuite.java:138)
	at org.apache.maven.surefire.suite.AbstractDirectoryTestSuite.execute(AbstractDirectoryTestSuite.java:125)
	at org.apache.maven.surefire.Surefire.run(Surefire.java:132)
	at sun.reflect.NativeMethodAccessorImpl.invoke0(Native Method)
	at sun.reflect.NativeMethodAccessorImpl.invoke(NativeMethodAccessorImpl.java:39)
	at sun.reflect.DelegatingMethodAccessorImpl.invoke(DelegatingMethodAccessorImpl.java:25)
	at java.lang.reflect.Method.invoke(Method.java:585)
	at org.apache.maven.surefire.booter.SurefireBooter.runSuitesInProcess(SurefireBooter.java:308)
	at org.apache.maven.surefire.booter.SurefireBooter.main(SurefireBooter.java:879)
Caused by: javax.xml.xpath.XPathExpressionException
	at com.sun.org.apache.xpath.internal.jaxp.XPathImpl.compile(XPathImpl.java:402)
	at org.apache.tuscany.sca.policy.xml.PolicySetProcessor.read(PolicySetProcessor.java:103)
	... 30 more
Caused by: javax.xml.transform.TransformerException: Extra illegal tokens: 'http://www.osoa.org/xmlns/sca/1.0', ':', 'binding.sca'
	at com.sun.org.apache.xpath.internal.compiler.XPathParser.error(XPathParser.java:602)
	at com.sun.org.apache.xpath.internal.compiler.XPathParser.initXPath(XPathParser.java:141)
	at com.sun.org.apache.xpath.internal.XPath.<init>(XPath.java:162)
	at com.sun.org.apache.xpath.internal.XPath.<init>(XPath.java:198)
	at com.sun.org.apache.xpath.internal.jaxp.XPathImpl.compile(XPathImpl.java:394)
	... 31 more

testResolveComposite(org.apache.tuscany.sca.assembly.xml.WireTestCase)  Time elapsed: 0.048 sec  <<< ERROR!
org.apache.tuscany.sca.contribution.service.ContributionReadException: javax.xml.xpath.XPathExpressionException
	at org.apache.tuscany.sca.policy.xml.PolicySetProcessor.read(PolicySetProcessor.java:109)
	at org.apache.tuscany.sca.policy.xml.PolicySetProcessor.read(PolicySetProcessor.java:61)
	at org.apache.tuscany.sca.contribution.processor.ExtensibleStAXArtifactProcessor.read(ExtensibleStAXArtifactProcessor.java:83)
	at org.apache.tuscany.sca.definitions.xml.SCADefinitionsProcessor.read(SCADefinitionsProcessor.java:90)
	at org.apache.tuscany.sca.definitions.xml.SCADefinitionsProcessor.read(SCADefinitionsProcessor.java:49)
	at org.apache.tuscany.sca.contribution.processor.ExtensibleStAXArtifactProcessor.read(ExtensibleStAXArtifactProcessor.java:83)
	at org.apache.tuscany.sca.definitions.xml.SCADefinitionsDocumentProcessor.read(SCADefinitionsDocumentProcessor.java:120)
	at org.apache.tuscany.sca.assembly.xml.WireTestCase.testResolveComposite(WireTestCase.java:134)
	at sun.reflect.NativeMethodAccessorImpl.invoke0(Native Method)
	at sun.reflect.NativeMethodAccessorImpl.invoke(NativeMethodAccessorImpl.java:39)
	at sun.reflect.DelegatingMethodAccessorImpl.invoke(DelegatingMethodAccessorImpl.java:25)
	at java.lang.reflect.Method.invoke(Method.java:585)
	at junit.framework.TestCase.runTest(TestCase.java:168)
	at junit.framework.TestCase.runBare(TestCase.java:134)
	at junit.framework.TestResult$1.protect(TestResult.java:110)
	at junit.framework.TestResult.runProtected(TestResult.java:128)
	at junit.framework.TestResult.run(TestResult.java:113)
	at junit.framework.TestCase.run(TestCase.java:124)
	at junit.framework.TestSuite.runTest(TestSuite.java:232)
	at junit.framework.TestSuite.run(TestSuite.java:227)
	at org.junit.internal.runners.OldTestClassRunner.run(OldTestClassRunner.java:35)
	at org.apache.maven.surefire.junit4.JUnit4TestSet.execute(JUnit4TestSet.java:62)
	at org.apache.maven.surefire.suite.AbstractDirectoryTestSuite.executeTestSet(AbstractDirectoryTestSuite.java:138)
	at org.apache.maven.surefire.suite.AbstractDirectoryTestSuite.execute(AbstractDirectoryTestSuite.java:125)
	at org.apache.maven.surefire.Surefire.run(Surefire.java:132)
	at sun.reflect.NativeMethodAccessorImpl.invoke0(Native Method)
	at sun.reflect.NativeMethodAccessorImpl.invoke(NativeMethodAccessorImpl.java:39)
	at sun.reflect.DelegatingMethodAccessorImpl.invoke(DelegatingMethodAccessorImpl.java:25)
	at java.lang.reflect.Method.invoke(Method.java:585)
	at org.apache.maven.surefire.booter.SurefireBooter.runSuitesInProcess(SurefireBooter.java:308)
	at org.apache.maven.surefire.booter.SurefireBooter.main(SurefireBooter.java:879)
Caused by: javax.xml.xpath.XPathExpressionException
	at com.sun.org.apache.xpath.internal.jaxp.XPathImpl.compile(XPathImpl.java:402)
	at org.apache.tuscany.sca.policy.xml.PolicySetProcessor.read(PolicySetProcessor.java:103)
	... 30 more
Caused by: javax.xml.transform.TransformerException: Extra illegal tokens: 'http://www.osoa.org/xmlns/sca/1.0', ':', 'binding.sca'
	at com.sun.org.apache.xpath.internal.compiler.XPathParser.error(XPathParser.java:602)
	at com.sun.org.apache.xpath.internal.compiler.XPathParser.initXPath(XPathParser.java:141)
	at com.sun.org.apache.xpath.internal.XPath.<init>(XPath.java:162)
	at com.sun.org.apache.xpath.internal.XPath.<init>(XPath.java:198)
	at com.sun.org.apache.xpath.internal.jaxp.XPathImpl.compile(XPathImpl.java:394)
	... 31 more

Running org.apache.tuscany.sca.assembly.xml.WriteAllTestCase
Mar 14, 2008 3:10:47 AM org.apache.tuscany.sca.contribution.processor.ExtensibleStAXArtifactProcessor read
WARNING: Element {http://extension}testExtension cannot be processed. ([row,col {unknown-source}]: [30,5])
Mar 14, 2008 3:10:47 AM org.apache.tuscany.sca.contribution.processor.ExtensibleStAXArtifactProcessor read
WARNING: Element {http://extension}testExtension cannot be processed. ([row,col {unknown-source}]: [34,9])
Mar 14, 2008 3:10:47 AM org.apache.tuscany.sca.contribution.processor.ExtensibleStAXArtifactProcessor read
WARNING: Element {http://www.osoa.org/xmlns/sca/1.0}interface.java cannot be processed. ([row,col {unknown-source}]: [35,9])
Mar 14, 2008 3:10:47 AM org.apache.tuscany.sca.contribution.processor.ExtensibleStAXArtifactProcessor read
WARNING: Element {http://www.osoa.org/xmlns/sca/1.0}binding.ws cannot be processed. ([row,col {unknown-source}]: [38,9])
Mar 14, 2008 3:10:47 AM org.apache.tuscany.sca.contribution.processor.ExtensibleStAXArtifactProcessor read
WARNING: Element {http://extension}testExtension cannot be processed. ([row,col {unknown-source}]: [43,10])
Mar 14, 2008 3:10:47 AM org.apache.tuscany.sca.contribution.processor.ExtensibleStAXArtifactProcessor read
WARNING: Element {http://www.osoa.org/xmlns/sca/1.0}binding.ws cannot be processed. ([row,col {unknown-source}]: [44,13])
Mar 14, 2008 3:10:47 AM org.apache.tuscany.sca.contribution.processor.ExtensibleStAXArtifactProcessor read
WARNING: Element {http://extension}testExtension cannot be processed. ([row,col {unknown-source}]: [52,9])
Mar 14, 2008 3:10:47 AM org.apache.tuscany.sca.contribution.processor.ExtensibleStAXArtifactProcessor read
WARNING: Element {http://www.osoa.org/xmlns/sca/1.0}interface.java cannot be processed. ([row,col {unknown-source}]: [54,13])
Mar 14, 2008 3:10:47 AM org.apache.tuscany.sca.contribution.processor.ExtensibleStAXArtifactProcessor read
WARNING: Element {http://extension}testExtension cannot be processed. ([row,col {unknown-source}]: [59,13])
Mar 14, 2008 3:10:47 AM org.apache.tuscany.sca.contribution.processor.ExtensibleStAXArtifactProcessor read
WARNING: Element {http://www.osoa.org/xmlns/sca/1.0}interface.java cannot be processed. ([row,col {unknown-source}]: [60,13])
Mar 14, 2008 3:10:47 AM org.apache.tuscany.sca.contribution.processor.ExtensibleStAXArtifactProcessor read
WARNING: Element {http://www.osoa.org/xmlns/sca/1.0}implementation.java cannot be processed. ([row,col {unknown-source}]: [68,9])
Mar 14, 2008 3:10:47 AM org.apache.tuscany.sca.contribution.processor.ExtensibleStAXArtifactProcessor read
WARNING: Element {http://www.osoa.org/xmlns/sca/1.0}interface.java cannot be processed. ([row,col {unknown-source}]: [73,13])
Mar 14, 2008 3:10:47 AM org.apache.tuscany.sca.contribution.processor.ExtensibleStAXArtifactProcessor read
WARNING: Element {http://www.osoa.org/xmlns/sca/1.0}implementation.java cannot be processed. ([row,col {unknown-source}]: [75,9])
Mar 14, 2008 3:10:47 AM org.apache.tuscany.sca.contribution.processor.ExtensibleStAXArtifactProcessor read
WARNING: Element {http://www.osoa.org/xmlns/sca/1.0}interface.java cannot be processed. ([row,col {unknown-source}]: [80,13])
Mar 14, 2008 3:10:47 AM org.apache.tuscany.sca.contribution.processor.ExtensibleStAXArtifactProcessor read
WARNING: Element {http://www.osoa.org/xmlns/sca/1.0}implementation.java cannot be processed. ([row,col {unknown-source}]: [86,9])
Mar 14, 2008 3:10:47 AM org.apache.tuscany.sca.contribution.processor.ExtensibleStAXArtifactProcessor read
WARNING: Element {http://www.osoa.org/xmlns/sca/1.0}implementation.java cannot be processed. ([row,col {unknown-source}]: [90,9])
Mar 14, 2008 3:10:47 AM org.apache.tuscany.sca.contribution.processor.ExtensibleStAXArtifactProcessor read
WARNING: Element {http://www.osoa.org/xmlns/sca/1.0}implementation.java cannot be processed. ([row,col {unknown-source}]: [94,9])
Mar 14, 2008 3:10:47 AM org.apache.tuscany.sca.contribution.processor.ExtensibleStAXArtifactProcessor read
WARNING: Element {http://www.osoa.org/xmlns/sca/1.0}interface.java cannot be processed. ([row,col {unknown-source}]: [99,9])
Mar 14, 2008 3:10:47 AM org.apache.tuscany.sca.contribution.processor.ExtensibleStAXArtifactProcessor read
WARNING: Element {http://www.osoa.org/xmlns/sca/1.0}binding.ws cannot be processed. ([row,col {unknown-source}]: [102,9])
Mar 14, 2008 3:10:47 AM org.apache.tuscany.sca.contribution.processor.ExtensibleStAXArtifactProcessor read
WARNING: Element {http://www.osoa.org/xmlns/sca/1.0}binding.ws cannot be processed. ([row,col {unknown-source}]: [107,13])
Mar 14, 2008 3:10:47 AM org.apache.tuscany.sca.contribution.processor.ExtensibleStAXArtifactProcessor read
WARNING: Element {http://extension}testExtension cannot be processed. ([row,col {unknown-source}]: [30,5])
Mar 14, 2008 3:10:47 AM org.apache.tuscany.sca.contribution.processor.ExtensibleStAXArtifactProcessor read
WARNING: Element {http://extension}testExtension cannot be processed. ([row,col {unknown-source}]: [34,9])
Mar 14, 2008 3:10:47 AM org.apache.tuscany.sca.contribution.processor.ExtensibleStAXArtifactProcessor read
WARNING: Element {http://www.osoa.org/xmlns/sca/1.0}interface.java cannot be processed. ([row,col {unknown-source}]: [35,9])
Mar 14, 2008 3:10:47 AM org.apache.tuscany.sca.contribution.processor.ExtensibleStAXArtifactProcessor read
WARNING: Element {http://www.osoa.org/xmlns/sca/1.0}binding.ws cannot be processed. ([row,col {unknown-source}]: [38,9])
Mar 14, 2008 3:10:47 AM org.apache.tuscany.sca.contribution.processor.ExtensibleStAXArtifactProcessor read
WARNING: Element {http://extension}testExtension cannot be processed. ([row,col {unknown-source}]: [43,10])
Mar 14, 2008 3:10:47 AM org.apache.tuscany.sca.contribution.processor.ExtensibleStAXArtifactProcessor read
WARNING: Element {http://www.osoa.org/xmlns/sca/1.0}binding.ws cannot be processed. ([row,col {unknown-source}]: [44,13])
Mar 14, 2008 3:10:47 AM org.apache.tuscany.sca.contribution.processor.ExtensibleStAXArtifactProcessor read
WARNING: Element {http://extension}testExtension cannot be processed. ([row,col {unknown-source}]: [52,9])
Mar 14, 2008 3:10:47 AM org.apache.tuscany.sca.contribution.processor.ExtensibleStAXArtifactProcessor read
WARNING: Element {http://www.osoa.org/xmlns/sca/1.0}interface.java cannot be processed. ([row,col {unknown-source}]: [54,13])
Mar 14, 2008 3:10:47 AM org.apache.tuscany.sca.contribution.processor.ExtensibleStAXArtifactProcessor read
WARNING: Element {http://extension}testExtension cannot be processed. ([row,col {unknown-source}]: [59,13])
Mar 14, 2008 3:10:47 AM org.apache.tuscany.sca.contribution.processor.ExtensibleStAXArtifactProcessor read
WARNING: Element {http://www.osoa.org/xmlns/sca/1.0}interface.java cannot be processed. ([row,col {unknown-source}]: [60,13])
Mar 14, 2008 3:10:47 AM org.apache.tuscany.sca.contribution.processor.ExtensibleStAXArtifactProcessor read
WARNING: Element {http://www.osoa.org/xmlns/sca/1.0}implementation.java cannot be processed. ([row,col {unknown-source}]: [68,9])
Mar 14, 2008 3:10:47 AM org.apache.tuscany.sca.contribution.processor.ExtensibleStAXArtifactProcessor read
WARNING: Element {http://www.osoa.org/xmlns/sca/1.0}interface.java cannot be processed. ([row,col {unknown-source}]: [73,13])
Mar 14, 2008 3:10:47 AM org.apache.tuscany.sca.contribution.processor.ExtensibleStAXArtifactProcessor read
WARNING: Element {http://www.osoa.org/xmlns/sca/1.0}implementation.java cannot be processed. ([row,col {unknown-source}]: [75,9])
Mar 14, 2008 3:10:47 AM org.apache.tuscany.sca.contribution.processor.ExtensibleStAXArtifactProcessor read
WARNING: Element {http://www.osoa.org/xmlns/sca/1.0}interface.java cannot be processed. ([row,col {unknown-source}]: [80,13])
Mar 14, 2008 3:10:47 AM org.apache.tuscany.sca.contribution.processor.ExtensibleStAXArtifactProcessor read
WARNING: Element {http://www.osoa.org/xmlns/sca/1.0}implementation.java cannot be processed. ([row,col {unknown-source}]: [86,9])
Mar 14, 2008 3:10:47 AM org.apache.tuscany.sca.contribution.processor.ExtensibleStAXArtifactProcessor read
WARNING: Element {http://www.osoa.org/xmlns/sca/1.0}implementation.java cannot be processed. ([row,col {unknown-source}]: [90,9])
Mar 14, 2008 3:10:47 AM org.apache.tuscany.sca.contribution.processor.ExtensibleStAXArtifactProcessor read
WARNING: Element {http://www.osoa.org/xmlns/sca/1.0}implementation.java cannot be processed. ([row,col {unknown-source}]: [94,9])
Mar 14, 2008 3:10:47 AM org.apache.tuscany.sca.contribution.processor.ExtensibleStAXArtifactProcessor read
WARNING: Element {http://www.osoa.org/xmlns/sca/1.0}interface.java cannot be processed. ([row,col {unknown-source}]: [99,9])
Mar 14, 2008 3:10:47 AM org.apache.tuscany.sca.contribution.processor.ExtensibleStAXArtifactProcessor read
WARNING: Element {http://www.osoa.org/xmlns/sca/1.0}binding.ws cannot be processed. ([row,col {unknown-source}]: [102,9])
Mar 14, 2008 3:10:47 AM org.apache.tuscany.sca.contribution.processor.ExtensibleStAXArtifactProcessor read
WARNING: Element {http://www.osoa.org/xmlns/sca/1.0}binding.ws cannot be processed. ([row,col {unknown-source}]: [107,13])
Mar 14, 2008 3:10:47 AM org.apache.tuscany.sca.contribution.processor.ExtensibleStAXArtifactProcessor read
WARNING: Element {http://www.osoa.org/xmlns/sca/1.0}interface.java cannot be processed. ([row,col {unknown-source}]: [23,9])
Mar 14, 2008 3:10:47 AM org.apache.tuscany.sca.contribution.processor.ExtensibleStAXArtifactProcessor read
WARNING: Element {http://www.osoa.org/xmlns/sca/1.0}interface.java cannot be processed. ([row,col {unknown-source}]: [27,9])
Mar 14, 2008 3:10:47 AM org.apache.tuscany.sca.contribution.processor.ExtensibleStAXArtifactProcessor read
WARNING: Element {http://www.osoa.org/xmlns/sca/1.0}interface.java cannot be processed. ([row,col {unknown-source}]: [26,9])
Mar 14, 2008 3:10:47 AM org.apache.tuscany.sca.contribution.processor.ExtensibleStAXArtifactProcessor read
WARNING: Element {http://www.osoa.org/xmlns/sca/1.0}interface.java cannot be processed. ([row,col {unknown-source}]: [30,9])
Tests run: 4, Failures: 0, Errors: 1, Skipped: 0, Time elapsed: 0.302 sec <<< FAILURE!
testReadWireWriteComposite(org.apache.tuscany.sca.assembly.xml.WriteAllTestCase)  Time elapsed: 0.044 sec  <<< ERROR!
org.apache.tuscany.sca.contribution.service.ContributionReadException: javax.xml.xpath.XPathExpressionException
	at org.apache.tuscany.sca.policy.xml.PolicySetProcessor.read(PolicySetProcessor.java:109)
	at org.apache.tuscany.sca.policy.xml.PolicySetProcessor.read(PolicySetProcessor.java:61)
	at org.apache.tuscany.sca.contribution.processor.ExtensibleStAXArtifactProcessor.read(ExtensibleStAXArtifactProcessor.java:83)
	at org.apache.tuscany.sca.definitions.xml.SCADefinitionsProcessor.read(SCADefinitionsProcessor.java:90)
	at org.apache.tuscany.sca.definitions.xml.SCADefinitionsProcessor.read(SCADefinitionsProcessor.java:49)
	at org.apache.tuscany.sca.contribution.processor.ExtensibleStAXArtifactProcessor.read(ExtensibleStAXArtifactProcessor.java:83)
	at org.apache.tuscany.sca.definitions.xml.SCADefinitionsDocumentProcessor.read(SCADefinitionsDocumentProcessor.java:120)
	at org.apache.tuscany.sca.assembly.xml.WriteAllTestCase.testReadWireWriteComposite(WriteAllTestCase.java:113)
	at sun.reflect.NativeMethodAccessorImpl.invoke0(Native Method)
	at sun.reflect.NativeMethodAccessorImpl.invoke(NativeMethodAccessorImpl.java:39)
	at sun.reflect.DelegatingMethodAccessorImpl.invoke(DelegatingMethodAccessorImpl.java:25)
	at java.lang.reflect.Method.invoke(Method.java:585)
	at junit.framework.TestCase.runTest(TestCase.java:168)
	at junit.framework.TestCase.runBare(TestCase.java:134)
	at junit.framework.TestResult$1.protect(TestResult.java:110)
	at junit.framework.TestResult.runProtected(TestResult.java:128)
	at junit.framework.TestResult.run(TestResult.java:113)
	at junit.framework.TestCase.run(TestCase.java:124)
	at junit.framework.TestSuite.runTest(TestSuite.java:232)
	at junit.framework.TestSuite.run(TestSuite.java:227)
	at org.junit.internal.runners.OldTestClassRunner.run(OldTestClassRunner.java:35)
	at org.apache.maven.surefire.junit4.JUnit4TestSet.execute(JUnit4TestSet.java:62)
	at org.apache.maven.surefire.suite.AbstractDirectoryTestSuite.executeTestSet(AbstractDirectoryTestSuite.java:138)
	at org.apache.maven.surefire.suite.AbstractDirectoryTestSuite.execute(AbstractDirectoryTestSuite.java:125)
	at org.apache.maven.surefire.Surefire.run(Surefire.java:132)
	at sun.reflect.NativeMethodAccessorImpl.invoke0(Native Method)
	at sun.reflect.NativeMethodAccessorImpl.invoke(NativeMethodAccessorImpl.java:39)
	at sun.reflect.DelegatingMethodAccessorImpl.invoke(DelegatingMethodAccessorImpl.java:25)
	at java.lang.reflect.Method.invoke(Method.java:585)
	at org.apache.maven.surefire.booter.SurefireBooter.runSuitesInProcess(SurefireBooter.java:308)
	at org.apache.maven.surefire.booter.SurefireBooter.main(SurefireBooter.java:879)
Caused by: javax.xml.xpath.XPathExpressionException
	at com.sun.org.apache.xpath.internal.jaxp.XPathImpl.compile(XPathImpl.java:402)
	at org.apache.tuscany.sca.policy.xml.PolicySetProcessor.read(PolicySetProcessor.java:103)
	... 30 more
Caused by: javax.xml.transform.TransformerException: Extra illegal tokens: 'http://www.osoa.org/xmlns/sca/1.0', ':', 'binding.sca'
	at com.sun.org.apache.xpath.internal.compiler.XPathParser.error(XPathParser.java:602)
	at com.sun.org.apache.xpath.internal.compiler.XPathParser.initXPath(XPathParser.java:141)
	at com.sun.org.apache.xpath.internal.XPath.<init>(XPath.java:162)
	at com.sun.org.apache.xpath.internal.XPath.<init>(XPath.java:198)
	at com.sun.org.apache.xpath.internal.jaxp.XPathImpl.compile(XPathImpl.java:394)
	... 31 more

Running org.apache.tuscany.sca.assembly.xml.ReadDocumentTestCase
Mar 14, 2008 3:10:47 AM org.apache.tuscany.sca.contribution.processor.ExtensibleStAXArtifactProcessor read
WARNING: Element {http://www.osoa.org/xmlns/sca/1.0}interface.java cannot be processed. ([row,col,system-id]: [26,9,"file:/home/continuum/data/working-directory/277/modules/assembly-xml/target/test-classes/org/apache/tuscany/sca/assembly/xml/CalculatorComponent.constrainingType"])
Mar 14, 2008 3:10:47 AM org.apache.tuscany.sca.contribution.processor.ExtensibleStAXArtifactProcessor read
WARNING: Element {http://www.osoa.org/xmlns/sca/1.0}interface.java cannot be processed. ([row,col,system-id]: [30,9,"file:/home/continuum/data/working-directory/277/modules/assembly-xml/target/test-classes/org/apache/tuscany/sca/assembly/xml/CalculatorComponent.constrainingType"])
Mar 14, 2008 3:10:47 AM org.apache.tuscany.sca.contribution.processor.ExtensibleStAXArtifactProcessor read
WARNING: Element {http://extension}testExtension cannot be processed. ([row,col,system-id]: [30,5,"file:/home/continuum/data/working-directory/277/modules/assembly-xml/target/test-classes/org/apache/tuscany/sca/assembly/xml/TestAllCalculator.composite"])
Mar 14, 2008 3:10:47 AM org.apache.tuscany.sca.contribution.processor.ExtensibleStAXArtifactProcessor read
WARNING: Element {http://extension}testExtension cannot be processed. ([row,col,system-id]: [34,9,"file:/home/continuum/data/working-directory/277/modules/assembly-xml/target/test-classes/org/apache/tuscany/sca/assembly/xml/TestAllCalculator.composite"])
Mar 14, 2008 3:10:47 AM org.apache.tuscany.sca.contribution.processor.ExtensibleStAXArtifactProcessor read
WARNING: Element {http://www.osoa.org/xmlns/sca/1.0}interface.java cannot be processed. ([row,col,system-id]: [35,9,"file:/home/continuum/data/working-directory/277/modules/assembly-xml/target/test-classes/org/apache/tuscany/sca/assembly/xml/TestAllCalculator.composite"])
Mar 14, 2008 3:10:47 AM org.apache.tuscany.sca.contribution.processor.ExtensibleStAXArtifactProcessor read
WARNING: Element {http://www.osoa.org/xmlns/sca/1.0}binding.ws cannot be processed. ([row,col,system-id]: [38,9,"file:/home/continuum/data/working-directory/277/modules/assembly-xml/target/test-classes/org/apache/tuscany/sca/assembly/xml/TestAllCalculator.composite"])
Mar 14, 2008 3:10:47 AM org.apache.tuscany.sca.contribution.processor.ExtensibleStAXArtifactProcessor read
WARNING: Element {http://extension}testExtension cannot be processed. ([row,col,system-id]: [43,10,"file:/home/continuum/data/working-directory/277/modules/assembly-xml/target/test-classes/org/apache/tuscany/sca/assembly/xml/TestAllCalculator.composite"])
Mar 14, 2008 3:10:47 AM org.apache.tuscany.sca.contribution.processor.ExtensibleStAXArtifactProcessor read
WARNING: Element {http://www.osoa.org/xmlns/sca/1.0}binding.ws cannot be processed. ([row,col,system-id]: [44,13,"file:/home/continuum/data/working-directory/277/modules/assembly-xml/target/test-classes/org/apache/tuscany/sca/assembly/xml/TestAllCalculator.composite"])
Mar 14, 2008 3:10:47 AM org.apache.tuscany.sca.contribution.processor.ExtensibleStAXArtifactProcessor read
WARNING: Element {http://extension}testExtension cannot be processed. ([row,col,system-id]: [52,9,"file:/home/continuum/data/working-directory/277/modules/assembly-xml/target/test-classes/org/apache/tuscany/sca/assembly/xml/TestAllCalculator.composite"])
Mar 14, 2008 3:10:47 AM org.apache.tuscany.sca.contribution.processor.ExtensibleStAXArtifactProcessor read
WARNING: Element {http://www.osoa.org/xmlns/sca/1.0}interface.java cannot be processed. ([row,col,system-id]: [54,13,"file:/home/continuum/data/working-directory/277/modules/assembly-xml/target/test-classes/org/apache/tuscany/sca/assembly/xml/TestAllCalculator.composite"])
Mar 14, 2008 3:10:47 AM org.apache.tuscany.sca.contribution.processor.ExtensibleStAXArtifactProcessor read
WARNING: Element {http://extension}testExtension cannot be processed. ([row,col,system-id]: [59,13,"file:/home/continuum/data/working-directory/277/modules/assembly-xml/target/test-classes/org/apache/tuscany/sca/assembly/xml/TestAllCalculator.composite"])
Mar 14, 2008 3:10:47 AM org.apache.tuscany.sca.contribution.processor.ExtensibleStAXArtifactProcessor read
WARNING: Element {http://www.osoa.org/xmlns/sca/1.0}interface.java cannot be processed. ([row,col,system-id]: [60,13,"file:/home/continuum/data/working-directory/277/modules/assembly-xml/target/test-classes/org/apache/tuscany/sca/assembly/xml/TestAllCalculator.composite"])
Mar 14, 2008 3:10:47 AM org.apache.tuscany.sca.contribution.processor.ExtensibleStAXArtifactProcessor read
WARNING: Element {http://www.osoa.org/xmlns/sca/1.0}implementation.java cannot be processed. ([row,col,system-id]: [68,9,"file:/home/continuum/data/working-directory/277/modules/assembly-xml/target/test-classes/org/apache/tuscany/sca/assembly/xml/TestAllCalculator.composite"])
Mar 14, 2008 3:10:47 AM org.apache.tuscany.sca.contribution.processor.ExtensibleStAXArtifactProcessor read
WARNING: Element {http://www.osoa.org/xmlns/sca/1.0}interface.java cannot be processed. ([row,col,system-id]: [73,13,"file:/home/continuum/data/working-directory/277/modules/assembly-xml/target/test-classes/org/apache/tuscany/sca/assembly/xml/TestAllCalculator.composite"])
Mar 14, 2008 3:10:47 AM org.apache.tuscany.sca.contribution.processor.ExtensibleStAXArtifactProcessor read
WARNING: Element {http://www.osoa.org/xmlns/sca/1.0}implementation.java cannot be processed. ([row,col,system-id]: [75,9,"file:/home/continuum/data/working-directory/277/modules/assembly-xml/target/test-classes/org/apache/tuscany/sca/assembly/xml/TestAllCalculator.composite"])
Mar 14, 2008 3:10:47 AM org.apache.tuscany.sca.contribution.processor.ExtensibleStAXArtifactProcessor read
WARNING: Element {http://www.osoa.org/xmlns/sca/1.0}interface.java cannot be processed. ([row,col,system-id]: [80,13,"file:/home/continuum/data/working-directory/277/modules/assembly-xml/target/test-classes/org/apache/tuscany/sca/assembly/xml/TestAllCalculator.composite"])
Mar 14, 2008 3:10:47 AM org.apache.tuscany.sca.contribution.processor.ExtensibleStAXArtifactProcessor read
WARNING: Element {http://www.osoa.org/xmlns/sca/1.0}implementation.java cannot be processed. ([row,col,system-id]: [86,9,"file:/home/continuum/data/working-directory/277/modules/assembly-xml/target/test-classes/org/apache/tuscany/sca/assembly/xml/TestAllCalculator.composite"])
Mar 14, 2008 3:10:47 AM org.apache.tuscany.sca.contribution.processor.ExtensibleStAXArtifactProcessor read
WARNING: Element {http://www.osoa.org/xmlns/sca/1.0}implementation.java cannot be processed. ([row,col,system-id]: [90,9,"file:/home/continuum/data/working-directory/277/modules/assembly-xml/target/test-classes/org/apache/tuscany/sca/assembly/xml/TestAllCalculator.composite"])
Mar 14, 2008 3:10:47 AM org.apache.tuscany.sca.contribution.processor.ExtensibleStAXArtifactProcessor read
WARNING: Element {http://www.osoa.org/xmlns/sca/1.0}implementation.java cannot be processed. ([row,col,system-id]: [94,9,"file:/home/continuum/data/working-directory/277/modules/assembly-xml/target/test-classes/org/apache/tuscany/sca/assembly/xml/TestAllCalculator.composite"])
Mar 14, 2008 3:10:47 AM org.apache.tuscany.sca.contribution.processor.ExtensibleStAXArtifactProcessor read
WARNING: Element {http://www.osoa.org/xmlns/sca/1.0}interface.java cannot be processed. ([row,col,system-id]: [99,9,"file:/home/continuum/data/working-directory/277/modules/assembly-xml/target/test-classes/org/apache/tuscany/sca/assembly/xml/TestAllCalculator.composite"])
Mar 14, 2008 3:10:47 AM org.apache.tuscany.sca.contribution.processor.ExtensibleStAXArtifactProcessor read
WARNING: Element {http://www.osoa.org/xmlns/sca/1.0}binding.ws cannot be processed. ([row,col,system-id]: [102,9,"file:/home/continuum/data/working-directory/277/modules/assembly-xml/target/test-classes/org/apache/tuscany/sca/assembly/xml/TestAllCalculator.composite"])
Mar 14, 2008 3:10:47 AM org.apache.tuscany.sca.contribution.processor.ExtensibleStAXArtifactProcessor read
WARNING: Element {http://www.osoa.org/xmlns/sca/1.0}binding.ws cannot be processed. ([row,col,system-id]: [107,13,"file:/home/continuum/data/working-directory/277/modules/assembly-xml/target/test-classes/org/apache/tuscany/sca/assembly/xml/TestAllCalculator.composite"])
Mar 14, 2008 3:10:47 AM org.apache.tuscany.sca.contribution.processor.ExtensibleStAXArtifactProcessor read
WARNING: Element {http://www.osoa.org/xmlns/sca/1.0}interface.java cannot be processed. ([row,col,system-id]: [26,9,"file:/home/continuum/data/working-directory/277/modules/assembly-xml/target/test-classes/org/apache/tuscany/sca/assembly/xml/Calculator.composite"])
Mar 14, 2008 3:10:47 AM org.apache.tuscany.sca.contribution.processor.ExtensibleStAXArtifactProcessor read
WARNING: Element {http://www.osoa.org/xmlns/sca/1.0}implementation.java cannot be processed. ([row,col,system-id]: [30,3,"file:/home/continuum/data/working-directory/277/modules/assembly-xml/target/test-classes/org/apache/tuscany/sca/assembly/xml/Calculator.composite"])
Mar 14, 2008 3:10:47 AM org.apache.tuscany.sca.contribution.processor.ExtensibleStAXArtifactProcessor read
WARNING: Element {http://www.osoa.org/xmlns/sca/1.0}implementation.java cannot be processed. ([row,col,system-id]: [38,9,"file:/home/continuum/data/working-directory/277/modules/assembly-xml/target/test-classes/org/apache/tuscany/sca/assembly/xml/Calculator.composite"])
Mar 14, 2008 3:10:47 AM org.apache.tuscany.sca.contribution.processor.ExtensibleStAXArtifactProcessor read
WARNING: Element {http://www.osoa.org/xmlns/sca/1.0}implementation.java cannot be processed. ([row,col,system-id]: [42,9,"file:/home/continuum/data/working-directory/277/modules/assembly-xml/target/test-classes/org/apache/tuscany/sca/assembly/xml/Calculator.composite"])
Mar 14, 2008 3:10:47 AM org.apache.tuscany.sca.contribution.processor.ExtensibleStAXArtifactProcessor read
WARNING: Element {http://www.osoa.org/xmlns/sca/1.0}implementation.java cannot be processed. ([row,col,system-id]: [46,9,"file:/home/continuum/data/working-directory/277/modules/assembly-xml/target/test-classes/org/apache/tuscany/sca/assembly/xml/Calculator.composite"])
Mar 14, 2008 3:10:47 AM org.apache.tuscany.sca.contribution.processor.ExtensibleStAXArtifactProcessor read
WARNING: Element {http://www.osoa.org/xmlns/sca/1.0}implementation.java cannot be processed. ([row,col,system-id]: [50,9,"file:/home/continuum/data/working-directory/277/modules/assembly-xml/target/test-classes/org/apache/tuscany/sca/assembly/xml/Calculator.composite"])
Mar 14, 2008 3:10:47 AM org.apache.tuscany.sca.contribution.processor.ExtensibleStAXArtifactProcessor read
WARNING: Element {http://extension}testExtension cannot be processed. ([row,col,system-id]: [30,5,"file:/home/continuum/data/working-directory/277/modules/assembly-xml/target/test-classes/org/apache/tuscany/sca/assembly/xml/TestAllCalculator.composite"])
Mar 14, 2008 3:10:47 AM org.apache.tuscany.sca.contribution.processor.ExtensibleStAXArtifactProcessor read
WARNING: Element {http://extension}testExtension cannot be processed. ([row,col,system-id]: [34,9,"file:/home/continuum/data/working-directory/277/modules/assembly-xml/target/test-classes/org/apache/tuscany/sca/assembly/xml/TestAllCalculator.composite"])
Mar 14, 2008 3:10:47 AM org.apache.tuscany.sca.contribution.processor.ExtensibleStAXArtifactProcessor read
WARNING: Element {http://www.osoa.org/xmlns/sca/1.0}interface.java cannot be processed. ([row,col,system-id]: [35,9,"file:/home/continuum/data/working-directory/277/modules/assembly-xml/target/test-classes/org/apache/tuscany/sca/assembly/xml/TestAllCalculator.composite"])
Mar 14, 2008 3:10:47 AM org.apache.tuscany.sca.contribution.processor.ExtensibleStAXArtifactProcessor read
WARNING: Element {http://www.osoa.org/xmlns/sca/1.0}binding.ws cannot be processed. ([row,col,system-id]: [38,9,"file:/home/continuum/data/working-directory/277/modules/assembly-xml/target/test-classes/org/apache/tuscany/sca/assembly/xml/TestAllCalculator.composite"])
Mar 14, 2008 3:10:47 AM org.apache.tuscany.sca.contribution.processor.ExtensibleStAXArtifactProcessor read
WARNING: Element {http://extension}testExtension cannot be processed. ([row,col,system-id]: [43,10,"file:/home/continuum/data/working-directory/277/modules/assembly-xml/target/test-classes/org/apache/tuscany/sca/assembly/xml/TestAllCalculator.composite"])
Mar 14, 2008 3:10:47 AM org.apache.tuscany.sca.contribution.processor.ExtensibleStAXArtifactProcessor read
WARNING: Element {http://www.osoa.org/xmlns/sca/1.0}binding.ws cannot be processed. ([row,col,system-id]: [44,13,"file:/home/continuum/data/working-directory/277/modules/assembly-xml/target/test-classes/org/apache/tuscany/sca/assembly/xml/TestAllCalculator.composite"])
Mar 14, 2008 3:10:47 AM org.apache.tuscany.sca.contribution.processor.ExtensibleStAXArtifactProcessor read
WARNING: Element {http://extension}testExtension cannot be processed. ([row,col,system-id]: [52,9,"file:/home/continuum/data/working-directory/277/modules/assembly-xml/target/test-classes/org/apache/tuscany/sca/assembly/xml/TestAllCalculator.composite"])
Mar 14, 2008 3:10:47 AM org.apache.tuscany.sca.contribution.processor.ExtensibleStAXArtifactProcessor read
WARNING: Element {http://www.osoa.org/xmlns/sca/1.0}interface.java cannot be processed. ([row,col,system-id]: [54,13,"file:/home/continuum/data/working-directory/277/modules/assembly-xml/target/test-classes/org/apache/tuscany/sca/assembly/xml/TestAllCalculator.composite"])
Mar 14, 2008 3:10:47 AM org.apache.tuscany.sca.contribution.processor.ExtensibleStAXArtifactProcessor read
WARNING: Element {http://extension}testExtension cannot be processed. ([row,col,system-id]: [59,13,"file:/home/continuum/data/working-directory/277/modules/assembly-xml/target/test-classes/org/apache/tuscany/sca/assembly/xml/TestAllCalculator.composite"])
Mar 14, 2008 3:10:47 AM org.apache.tuscany.sca.contribution.processor.ExtensibleStAXArtifactProcessor read
WARNING: Element {http://www.osoa.org/xmlns/sca/1.0}interface.java cannot be processed. ([row,col,system-id]: [60,13,"file:/home/continuum/data/working-directory/277/modules/assembly-xml/target/test-classes/org/apache/tuscany/sca/assembly/xml/TestAllCalculator.composite"])
Mar 14, 2008 3:10:47 AM org.apache.tuscany.sca.contribution.processor.ExtensibleStAXArtifactProcessor read
WARNING: Element {http://www.osoa.org/xmlns/sca/1.0}implementation.java cannot be processed. ([row,col,system-id]: [68,9,"file:/home/continuum/data/working-directory/277/modules/assembly-xml/target/test-classes/org/apache/tuscany/sca/assembly/xml/TestAllCalculator.composite"])
Mar 14, 2008 3:10:47 AM org.apache.tuscany.sca.contribution.processor.ExtensibleStAXArtifactProcessor read
WARNING: Element {http://www.osoa.org/xmlns/sca/1.0}interface.java cannot be processed. ([row,col,system-id]: [73,13,"file:/home/continuum/data/working-directory/277/modules/assembly-xml/target/test-classes/org/apache/tuscany/sca/assembly/xml/TestAllCalculator.composite"])
Mar 14, 2008 3:10:47 AM org.apache.tuscany.sca.contribution.processor.ExtensibleStAXArtifactProcessor read
WARNING: Element {http://www.osoa.org/xmlns/sca/1.0}implementation.java cannot be processed. ([row,col,system-id]: [75,9,"file:/home/continuum/data/working-directory/277/modules/assembly-xml/target/test-classes/org/apache/tuscany/sca/assembly/xml/TestAllCalculator.composite"])
Mar 14, 2008 3:10:47 AM org.apache.tuscany.sca.contribution.processor.ExtensibleStAXArtifactProcessor read
WARNING: Element {http://www.osoa.org/xmlns/sca/1.0}interface.java cannot be processed. ([row,col,system-id]: [80,13,"file:/home/continuum/data/working-directory/277/modules/assembly-xml/target/test-classes/org/apache/tuscany/sca/assembly/xml/TestAllCalculator.composite"])
Mar 14, 2008 3:10:47 AM org.apache.tuscany.sca.contribution.processor.ExtensibleStAXArtifactProcessor read
WARNING: Element {http://www.osoa.org/xmlns/sca/1.0}implementation.java cannot be processed. ([row,col,system-id]: [86,9,"file:/home/continuum/data/working-directory/277/modules/assembly-xml/target/test-classes/org/apache/tuscany/sca/assembly/xml/TestAllCalculator.composite"])
Mar 14, 2008 3:10:47 AM org.apache.tuscany.sca.contribution.processor.ExtensibleStAXArtifactProcessor read
WARNING: Element {http://www.osoa.org/xmlns/sca/1.0}implementation.java cannot be processed. ([row,col,system-id]: [90,9,"file:/home/continuum/data/working-directory/277/modules/assembly-xml/target/test-classes/org/apache/tuscany/sca/assembly/xml/TestAllCalculator.composite"])
Mar 14, 2008 3:10:47 AM org.apache.tuscany.sca.contribution.processor.ExtensibleStAXArtifactProcessor read
WARNING: Element {http://www.osoa.org/xmlns/sca/1.0}implementation.java cannot be processed. ([row,col,system-id]: [94,9,"file:/home/continuum/data/working-directory/277/modules/assembly-xml/target/test-classes/org/apache/tuscany/sca/assembly/xml/TestAllCalculator.composite"])
Mar 14, 2008 3:10:47 AM org.apache.tuscany.sca.contribution.processor.ExtensibleStAXArtifactProcessor read
WARNING: Element {http://www.osoa.org/xmlns/sca/1.0}interface.java cannot be processed. ([row,col,system-id]: [99,9,"file:/home/continuum/data/working-directory/277/modules/assembly-xml/target/test-classes/org/apache/tuscany/sca/assembly/xml/TestAllCalculator.composite"])
Mar 14, 2008 3:10:47 AM org.apache.tuscany.sca.contribution.processor.ExtensibleStAXArtifactProcessor read
WARNING: Element {http://www.osoa.org/xmlns/sca/1.0}binding.ws cannot be processed. ([row,col,system-id]: [102,9,"file:/home/continuum/data/working-directory/277/modules/assembly-xml/target/test-classes/org/apache/tuscany/sca/assembly/xml/TestAllCalculator.composite"])
Mar 14, 2008 3:10:47 AM org.apache.tuscany.sca.contribution.processor.ExtensibleStAXArtifactProcessor read
WARNING: Element {http://www.osoa.org/xmlns/sca/1.0}binding.ws cannot be processed. ([row,col,system-id]: [107,13,"file:/home/continuum/data/working-directory/277/modules/assembly-xml/target/test-classes/org/apache/tuscany/sca/assembly/xml/TestAllCalculator.composite"])
Mar 14, 2008 3:10:48 AM org.apache.tuscany.sca.contribution.processor.ExtensibleStAXArtifactProcessor read
WARNING: Element {http://www.osoa.org/xmlns/sca/1.0}implementation.java cannot be processed. ([row,col,system-id]: [25,9,"file:/home/continuum/data/working-directory/277/modules/assembly-xml/target/test-classes/org/apache/tuscany/sca/assembly/xml/JavaScriptReference.composite"])
Mar 14, 2008 3:10:48 AM org.apache.tuscany.sca.contribution.processor.ExtensibleStAXArtifactProcessor read
WARNING: Element {http://tuscany.apache.org/xmlns/sca/1.0}implementation.script cannot be processed. ([row,col,system-id]: [29,9,"file:/home/continuum/data/working-directory/277/modules/assembly-xml/target/test-classes/org/apache/tuscany/sca/assembly/xml/JavaScriptReference.composite"])
Mar 14, 2008 3:10:48 AM org.apache.tuscany.sca.contribution.processor.ExtensibleStAXArtifactProcessor read
WARNING: Element {http://www.osoa.org/xmlns/sca/1.0}implementation.java cannot be processed. ([row,col,system-id]: [34,9,"file:/home/continuum/data/working-directory/277/modules/assembly-xml/target/test-classes/org/apache/tuscany/sca/assembly/xml/JavaScriptReference.composite"])
Mar 14, 2008 3:10:48 AM org.apache.tuscany.sca.contribution.processor.ExtensibleStAXArtifactProcessor read
WARNING: Element {http://www.osoa.org/xmlns/sca/1.0}interface.java cannot be processed. ([row,col,system-id]: [25,9,"file:/home/continuum/data/working-directory/277/modules/assembly-xml/target/test-classes/org/apache/tuscany/sca/assembly/xml/RMIBindingTest.composite"])
Mar 14, 2008 3:10:48 AM org.apache.tuscany.sca.contribution.processor.ExtensibleStAXArtifactProcessor read
WARNING: Element {http://tuscany.apache.org/xmlns/sca/1.0}binding.rmi cannot be processed. ([row,col,system-id]: [26,9,"file:/home/continuum/data/working-directory/277/modules/assembly-xml/target/test-classes/org/apache/tuscany/sca/assembly/xml/RMIBindingTest.composite"])
Mar 14, 2008 3:10:48 AM org.apache.tuscany.sca.contribution.processor.ExtensibleStAXArtifactProcessor read
WARNING: Element {http://www.osoa.org/xmlns/sca/1.0}implementation.java cannot be processed. ([row,col,system-id]: [30,9,"file:/home/continuum/data/working-directory/277/modules/assembly-xml/target/test-classes/org/apache/tuscany/sca/assembly/xml/RMIBindingTest.composite"])
Mar 14, 2008 3:10:48 AM org.apache.tuscany.sca.contribution.processor.ExtensibleStAXArtifactProcessor read
WARNING: Element {http://www.osoa.org/xmlns/sca/1.0}implementation.java cannot be processed. ([row,col,system-id]: [34,9,"file:/home/continuum/data/working-directory/277/modules/assembly-xml/target/test-classes/org/apache/tuscany/sca/assembly/xml/RMIBindingTest.composite"])
Mar 14, 2008 3:10:48 AM org.apache.tuscany.sca.contribution.processor.ExtensibleStAXArtifactProcessor read
WARNING: Element {http://www.osoa.org/xmlns/sca/1.0}interface.java cannot be processed. ([row,col,system-id]: [39,9,"file:/home/continuum/data/working-directory/277/modules/assembly-xml/target/test-classes/org/apache/tuscany/sca/assembly/xml/RMIBindingTest.composite"])
Mar 14, 2008 3:10:48 AM org.apache.tuscany.sca.contribution.processor.ExtensibleStAXArtifactProcessor read
WARNING: Element {http://tuscany.apache.org/xmlns/sca/1.0}binding.rmi cannot be processed. ([row,col,system-id]: [40,9,"file:/home/continuum/data/working-directory/277/modules/assembly-xml/target/test-classes/org/apache/tuscany/sca/assembly/xml/RMIBindingTest.composite"])
Tests run: 7, Failures: 0, Errors: 0, Skipped: 0, Time elapsed: 1.236 sec
Running org.apache.tuscany.sca.assembly.xml.BuildPolicyTestCase
Mar 14, 2008 3:10:48 AM org.apache.tuscany.sca.contribution.processor.ExtensibleStAXArtifactProcessor read
WARNING: Element {http://www.osoa.org/xmlns/sca/1.0}interface.java cannot be processed. ([row,col,system-id]: [26,9,"file:/home/continuum/data/working-directory/277/modules/assembly-xml/target/test-classes/org/apache/tuscany/sca/assembly/xml/CalculatorComponent.constrainingType"])
Mar 14, 2008 3:10:48 AM org.apache.tuscany.sca.contribution.processor.ExtensibleStAXArtifactProcessor read
WARNING: Element {http://www.osoa.org/xmlns/sca/1.0}interface.java cannot be processed. ([row,col,system-id]: [30,9,"file:/home/continuum/data/working-directory/277/modules/assembly-xml/target/test-classes/org/apache/tuscany/sca/assembly/xml/CalculatorComponent.constrainingType"])
Mar 14, 2008 3:10:48 AM org.apache.tuscany.sca.contribution.processor.ExtensibleStAXArtifactProcessor read
WARNING: Element {http://extension}testExtension cannot be processed. ([row,col,system-id]: [30,5,"file:/home/continuum/data/working-directory/277/modules/assembly-xml/target/test-classes/org/apache/tuscany/sca/assembly/xml/TestAllPolicyCalculator.composite"])
Mar 14, 2008 3:10:48 AM org.apache.tuscany.sca.contribution.processor.ExtensibleStAXArtifactProcessor read
WARNING: Element {http://extension}testExtension cannot be processed. ([row,col,system-id]: [33,9,"file:/home/continuum/data/working-directory/277/modules/assembly-xml/target/test-classes/org/apache/tuscany/sca/assembly/xml/TestAllPolicyCalculator.composite"])
Mar 14, 2008 3:10:48 AM org.apache.tuscany.sca.contribution.processor.ExtensibleStAXArtifactProcessor read
WARNING: Element {http://www.osoa.org/xmlns/sca/1.0}interface.java cannot be processed. ([row,col,system-id]: [34,9,"file:/home/continuum/data/working-directory/277/modules/assembly-xml/target/test-classes/org/apache/tuscany/sca/assembly/xml/TestAllPolicyCalculator.composite"])
Mar 14, 2008 3:10:48 AM org.apache.tuscany.sca.contribution.processor.ExtensibleStAXArtifactProcessor read
WARNING: Element {http://www.osoa.org/xmlns/sca/1.0}binding.ws cannot be processed. ([row,col,system-id]: [37,9,"file:/home/continuum/data/working-directory/277/modules/assembly-xml/target/test-classes/org/apache/tuscany/sca/assembly/xml/TestAllPolicyCalculator.composite"])
Mar 14, 2008 3:10:48 AM org.apache.tuscany.sca.contribution.processor.ExtensibleStAXArtifactProcessor read
WARNING: Element {http://extension}testExtension cannot be processed. ([row,col,system-id]: [41,10,"file:/home/continuum/data/working-directory/277/modules/assembly-xml/target/test-classes/org/apache/tuscany/sca/assembly/xml/TestAllPolicyCalculator.composite"])
Mar 14, 2008 3:10:48 AM org.apache.tuscany.sca.contribution.processor.ExtensibleStAXArtifactProcessor read
WARNING: Element {http://www.osoa.org/xmlns/sca/1.0}binding.ws cannot be processed. ([row,col,system-id]: [42,13,"file:/home/continuum/data/working-directory/277/modules/assembly-xml/target/test-classes/org/apache/tuscany/sca/assembly/xml/TestAllPolicyCalculator.composite"])
Mar 14, 2008 3:10:48 AM org.apache.tuscany.sca.contribution.processor.ExtensibleStAXArtifactProcessor read
WARNING: Element {http://extension}testExtension cannot be processed. ([row,col,system-id]: [49,9,"file:/home/continuum/data/working-directory/277/modules/assembly-xml/target/test-classes/org/apache/tuscany/sca/assembly/xml/TestAllPolicyCalculator.composite"])
Mar 14, 2008 3:10:48 AM org.apache.tuscany.sca.contribution.processor.ExtensibleStAXArtifactProcessor read
WARNING: Element {http://www.osoa.org/xmlns/sca/1.0}interface.java cannot be processed. ([row,col,system-id]: [51,13,"file:/home/continuum/data/working-directory/277/modules/assembly-xml/target/test-classes/org/apache/tuscany/sca/assembly/xml/TestAllPolicyCalculator.composite"])
Mar 14, 2008 3:10:48 AM org.apache.tuscany.sca.contribution.processor.ExtensibleStAXArtifactProcessor read
WARNING: Element {http://www.osoa.org/xmlns/sca/1.0}binding.ws cannot be processed. ([row,col,system-id]: [53,13,"file:/home/continuum/data/working-directory/277/modules/assembly-xml/target/test-classes/org/apache/tuscany/sca/assembly/xml/TestAllPolicyCalculator.composite"])
Mar 14, 2008 3:10:48 AM org.apache.tuscany.sca.contribution.processor.ExtensibleStAXArtifactProcessor read
WARNING: Element {http://extension}testExtension cannot be processed. ([row,col,system-id]: [59,13,"file:/home/continuum/data/working-directory/277/modules/assembly-xml/target/test-classes/org/apache/tuscany/sca/assembly/xml/TestAllPolicyCalculator.composite"])
Mar 14, 2008 3:10:48 AM org.apache.tuscany.sca.contribution.processor.ExtensibleStAXArtifactProcessor read
WARNING: Element {http://www.osoa.org/xmlns/sca/1.0}interface.java cannot be processed. ([row,col,system-id]: [60,13,"file:/home/continuum/data/working-directory/277/modules/assembly-xml/target/test-classes/org/apache/tuscany/sca/assembly/xml/TestAllPolicyCalculator.composite"])
Mar 14, 2008 3:10:48 AM org.apache.tuscany.sca.contribution.processor.ExtensibleStAXArtifactProcessor read
WARNING: Element {http://www.osoa.org/xmlns/sca/1.0}binding.ws cannot be processed. ([row,col,system-id]: [62,13,"file:/home/continuum/data/working-directory/277/modules/assembly-xml/target/test-classes/org/apache/tuscany/sca/assembly/xml/TestAllPolicyCalculator.composite"])
Mar 14, 2008 3:10:48 AM org.apache.tuscany.sca.contribution.processor.ExtensibleStAXArtifactProcessor read
WARNING: Element {http://www.osoa.org/xmlns/sca/1.0}implementation.java cannot be processed. ([row,col,system-id]: [71,9,"file:/home/continuum/data/working-directory/277/modules/assembly-xml/target/test-classes/org/apache/tuscany/sca/assembly/xml/TestAllPolicyCalculator.composite"])
Mar 14, 2008 3:10:48 AM org.apache.tuscany.sca.contribution.processor.ExtensibleStAXArtifactProcessor read
WARNING: Element {http://www.osoa.org/xmlns/sca/1.0}interface.java cannot be processed. ([row,col,system-id]: [76,13,"file:/home/continuum/data/working-directory/277/modules/assembly-xml/target/test-classes/org/apache/tuscany/sca/assembly/xml/TestAllPolicyCalculator.composite"])
Mar 14, 2008 3:10:48 AM org.apache.tuscany.sca.contribution.processor.ExtensibleStAXArtifactProcessor read
WARNING: Element {http://www.osoa.org/xmlns/sca/1.0}implementation.java cannot be processed. ([row,col,system-id]: [78,9,"file:/home/continuum/data/working-directory/277/modules/assembly-xml/target/test-classes/org/apache/tuscany/sca/assembly/xml/TestAllPolicyCalculator.composite"])
Mar 14, 2008 3:10:48 AM org.apache.tuscany.sca.contribution.processor.ExtensibleStAXArtifactProcessor read
WARNING: Element {http://www.osoa.org/xmlns/sca/1.0}interface.java cannot be processed. ([row,col,system-id]: [83,13,"file:/home/continuum/data/working-directory/277/modules/assembly-xml/target/test-classes/org/apache/tuscany/sca/assembly/xml/TestAllPolicyCalculator.composite"])
Mar 14, 2008 3:10:48 AM org.apache.tuscany.sca.contribution.processor.ExtensibleStAXArtifactProcessor read
WARNING: Element {http://www.osoa.org/xmlns/sca/1.0}implementation.java cannot be processed. ([row,col,system-id]: [89,9,"file:/home/continuum/data/working-directory/277/modules/assembly-xml/target/test-classes/org/apache/tuscany/sca/assembly/xml/TestAllPolicyCalculator.composite"])
Mar 14, 2008 3:10:48 AM org.apache.tuscany.sca.contribution.processor.ExtensibleStAXArtifactProcessor read
WARNING: Element {http://www.osoa.org/xmlns/sca/1.0}implementation.java cannot be processed. ([row,col,system-id]: [93,9,"file:/home/continuum/data/working-directory/277/modules/assembly-xml/target/test-classes/org/apache/tuscany/sca/assembly/xml/TestAllPolicyCalculator.composite"])
Mar 14, 2008 3:10:48 AM org.apache.tuscany.sca.contribution.processor.ExtensibleStAXArtifactProcessor read
WARNING: Element {http://www.osoa.org/xmlns/sca/1.0}implementation.java cannot be processed. ([row,col,system-id]: [97,9,"file:/home/continuum/data/working-directory/277/modules/assembly-xml/target/test-classes/org/apache/tuscany/sca/assembly/xml/TestAllPolicyCalculator.composite"])
Mar 14, 2008 3:10:48 AM org.apache.tuscany.sca.contribution.processor.ExtensibleStAXArtifactProcessor read
WARNING: Element {http://www.osoa.org/xmlns/sca/1.0}interface.java cannot be processed. ([row,col,system-id]: [102,9,"file:/home/continuum/data/working-directory/277/modules/assembly-xml/target/test-classes/org/apache/tuscany/sca/assembly/xml/TestAllPolicyCalculator.composite"])
Mar 14, 2008 3:10:48 AM org.apache.tuscany.sca.contribution.processor.ExtensibleStAXArtifactProcessor read
WARNING: Element {http://www.osoa.org/xmlns/sca/1.0}binding.ws cannot be processed. ([row,col,system-id]: [105,9,"file:/home/continuum/data/working-directory/277/modules/assembly-xml/target/test-classes/org/apache/tuscany/sca/assembly/xml/TestAllPolicyCalculator.composite"])
Mar 14, 2008 3:10:48 AM org.apache.tuscany.sca.contribution.processor.ExtensibleStAXArtifactProcessor read
WARNING: Element {http://www.osoa.org/xmlns/sca/1.0}binding.ws cannot be processed. ([row,col,system-id]: [109,13,"file:/home/continuum/data/working-directory/277/modules/assembly-xml/target/test-classes/org/apache/tuscany/sca/assembly/xml/TestAllPolicyCalculator.composite"])
Mar 14, 2008 3:10:48 AM org.apache.tuscany.sca.assembly.builder.impl.CompositeBuilderImpl$1 problem
WARNING: No implementation for component: CalculatorServiceComponent
Mar 14, 2008 3:10:48 AM org.apache.tuscany.sca.assembly.builder.impl.CompositeBuilderImpl$1 problem
WARNING: Service not found for component service: CalculatorServiceComponent/CalculatorService
Mar 14, 2008 3:10:48 AM org.apache.tuscany.sca.assembly.builder.impl.CompositeBuilderImpl$1 problem
WARNING: Reference not found for component reference: CalculatorServiceComponent/addService
Mar 14, 2008 3:10:48 AM org.apache.tuscany.sca.assembly.builder.impl.CompositeBuilderImpl$1 problem
WARNING: Reference not found for component reference: CalculatorServiceComponent/subtractService
Mar 14, 2008 3:10:48 AM org.apache.tuscany.sca.assembly.builder.impl.CompositeBuilderImpl$1 problem
WARNING: Reference not found for component reference: CalculatorServiceComponent/multiplyService
Mar 14, 2008 3:10:48 AM org.apache.tuscany.sca.assembly.builder.impl.CompositeBuilderImpl$1 problem
WARNING: Reference not found for component reference: CalculatorServiceComponent/divideService
Mar 14, 2008 3:10:48 AM org.apache.tuscany.sca.assembly.builder.impl.CompositeBuilderImpl$1 problem
WARNING: Property not found for component property: CalculatorServiceComponent/round
Mar 14, 2008 3:10:48 AM org.apache.tuscany.sca.assembly.builder.impl.CompositeBuilderImpl$1 problem
WARNING: No implementation for component: AddServiceComponent
Mar 14, 2008 3:10:48 AM org.apache.tuscany.sca.assembly.builder.impl.CompositeBuilderImpl$1 problem
WARNING: Service not found for component service: AddServiceComponent/AddService
Mar 14, 2008 3:10:48 AM org.apache.tuscany.sca.assembly.builder.impl.CompositeBuilderImpl$1 problem
WARNING: Component implementation not found: NestedCompositeComponent : null
Mar 14, 2008 3:10:48 AM org.apache.tuscany.sca.assembly.builder.impl.CompositeBuilderImpl$1 problem
WARNING: Service not found for component service: NestedCompositeComponent/CalculatorService
Mar 14, 2008 3:10:48 AM org.apache.tuscany.sca.assembly.builder.impl.CompositeBuilderImpl$1 problem
WARNING: No implementation for component: SubtractServiceComponent
Mar 14, 2008 3:10:48 AM org.apache.tuscany.sca.assembly.builder.impl.CompositeBuilderImpl$1 problem
WARNING: No implementation for component: MultiplyServiceComponent
Mar 14, 2008 3:10:48 AM org.apache.tuscany.sca.assembly.builder.impl.CompositeBuilderImpl$1 problem
WARNING: No implementation for component: DivideServiceComponent
Mar 14, 2008 3:10:48 AM org.apache.tuscany.sca.assembly.builder.impl.CompositeBuilderImpl$1 problem
WARNING: No implementation for component: CalculatorServiceComponent
Mar 14, 2008 3:10:48 AM org.apache.tuscany.sca.assembly.builder.impl.CompositeBuilderImpl$1 problem
WARNING: Service not found for component service: CalculatorServiceComponent/CalculatorService
Mar 14, 2008 3:10:48 AM org.apache.tuscany.sca.assembly.builder.impl.CompositeBuilderImpl$1 problem
WARNING: Reference not found for component reference: CalculatorServiceComponent/addService
Mar 14, 2008 3:10:48 AM org.apache.tuscany.sca.assembly.builder.impl.CompositeBuilderImpl$1 problem
WARNING: Reference not found for component reference: CalculatorServiceComponent/subtractService
Mar 14, 2008 3:10:48 AM org.apache.tuscany.sca.assembly.builder.impl.CompositeBuilderImpl$1 problem
WARNING: Reference not found for component reference: CalculatorServiceComponent/multiplyService
Mar 14, 2008 3:10:48 AM org.apache.tuscany.sca.assembly.builder.impl.CompositeBuilderImpl$1 problem
WARNING: Reference not found for component reference: CalculatorServiceComponent/divideService
Mar 14, 2008 3:10:48 AM org.apache.tuscany.sca.assembly.builder.impl.CompositeBuilderImpl$1 problem
WARNING: Property not found for component property: CalculatorServiceComponent/round
Mar 14, 2008 3:10:48 AM org.apache.tuscany.sca.assembly.builder.impl.CompositeBuilderImpl$1 problem
WARNING: No implementation for component: AddServiceComponent
Mar 14, 2008 3:10:48 AM org.apache.tuscany.sca.assembly.builder.impl.CompositeBuilderImpl$1 problem
WARNING: Service not found for component service: AddServiceComponent/AddService
Mar 14, 2008 3:10:48 AM org.apache.tuscany.sca.assembly.builder.impl.CompositeBuilderImpl$1 problem
WARNING: Component implementation not found: NestedCompositeComponent : null
Mar 14, 2008 3:10:48 AM org.apache.tuscany.sca.assembly.builder.impl.CompositeBuilderImpl$1 problem
WARNING: Service not found for component service: NestedCompositeComponent/CalculatorService
Mar 14, 2008 3:10:48 AM org.apache.tuscany.sca.assembly.builder.impl.CompositeBuilderImpl$1 problem
WARNING: No implementation for component: SubtractServiceComponent
Mar 14, 2008 3:10:48 AM org.apache.tuscany.sca.assembly.builder.impl.CompositeBuilderImpl$1 problem
WARNING: No implementation for component: MultiplyServiceComponent
Mar 14, 2008 3:10:48 AM org.apache.tuscany.sca.assembly.builder.impl.CompositeBuilderImpl$1 problem
WARNING: No implementation for component: DivideServiceComponent
Mar 14, 2008 3:10:48 AM org.apache.tuscany.sca.assembly.builder.impl.CompositeBuilderImpl$1 problem
WARNING: Theres been an exception related to policies... org.apache.tuscany.sca.assembly.builder.impl.PolicyComputationException: The following are unfulfilled intents for binding in service - CalculatorService
Unfulfilled Intents = [{http://test}tuscanyIntent_1, {http://test}tuscanyIntent_3, {http://test}tuscanyIntent_2]
Mar 14, 2008 3:10:48 AM org.apache.tuscany.sca.assembly.builder.impl.CompositeBuilderImpl$1 problem
WARNING: Theres been an exception related to policies... org.apache.tuscany.sca.assembly.builder.impl.PolicyComputationException: The are unfulfilled intents for binding in reference - MultiplyService
Unfulfilled Intents = [{http://test}tuscanyIntent_1, {http://test}tuscanyIntent_3, {http://test}tuscanyIntent_2]
Mar 14, 2008 3:10:48 AM org.apache.tuscany.sca.assembly.builder.impl.CompositeBuilderImpl$1 problem
WARNING: Theres been an exception related to policies... org.apache.tuscany.sca.assembly.builder.impl.PolicyComputationException: The following are unfulfilled intents for binding in service - CalculatorService
Unfulfilled Intents = [{http://test}tuscanyIntent_1, {http://test}tuscanyIntent_3, {http://test}tuscanyIntent_2]
Mar 14, 2008 3:10:48 AM org.apache.tuscany.sca.assembly.builder.impl.CompositeBuilderImpl$1 problem
WARNING: Theres been an exception related to policies... org.apache.tuscany.sca.assembly.builder.impl.PolicyComputationException: The are unfulfilled intents for binding in reference - addService
Unfulfilled Intents = [{http://test}tuscanyIntent_1, {http://test}tuscanyIntent_3, {http://test}tuscanyIntent_2]
Mar 14, 2008 3:10:48 AM org.apache.tuscany.sca.assembly.builder.impl.CompositeBuilderImpl$1 problem
WARNING: Theres been an exception related to policies... org.apache.tuscany.sca.assembly.builder.impl.PolicyComputationException: The are unfulfilled intents for binding in reference - subtractService
Unfulfilled Intents = [{http://test}tuscanyIntent_1, {http://test}tuscanyIntent_3, {http://test}tuscanyIntent_2]
Mar 14, 2008 3:10:48 AM org.apache.tuscany.sca.assembly.builder.impl.CompositeBuilderImpl$1 problem
WARNING: Theres been an exception related to policies... org.apache.tuscany.sca.assembly.builder.impl.PolicyComputationException: The are unfulfilled intents for binding in reference - multiplyService
Unfulfilled Intents = [{http://test}tuscanyIntent_1, {http://test}tuscanyIntent_3, {http://test}tuscanyIntent_2]
Mar 14, 2008 3:10:48 AM org.apache.tuscany.sca.assembly.builder.impl.CompositeBuilderImpl$1 problem
WARNING: Theres been an exception related to policies... org.apache.tuscany.sca.assembly.builder.impl.PolicyComputationException: The are unfulfilled intents for binding in reference - divideService
Unfulfilled Intents = [{http://test}tuscanyIntent_1, {http://test}tuscanyIntent_3, {http://test}tuscanyIntent_2]
Mar 14, 2008 3:10:48 AM org.apache.tuscany.sca.assembly.builder.impl.CompositeBuilderImpl$1 problem
WARNING: Theres been an exception related to policies... org.apache.tuscany.sca.assembly.builder.impl.PolicyComputationException: The following are unfulfilled intents for binding in service - AddService
Unfulfilled Intents = [{http://test}tuscanyIntent_1]
Mar 14, 2008 3:10:48 AM org.apache.tuscany.sca.assembly.builder.impl.CompositeBuilderImpl$1 problem
WARNING: Theres been an exception related to policies... org.apache.tuscany.sca.assembly.builder.impl.PolicyComputationException: The following are unfulfilled intents for binding in service - CalculatorService
Unfulfilled Intents = [{http://test}tuscanyIntent_1]
Mar 14, 2008 3:10:48 AM org.apache.tuscany.sca.assembly.builder.impl.CompositeBuilderImpl$1 problem
WARNING: Component reference target not found, it might be a remote service: DivideServiceComponent
Mar 14, 2008 3:10:48 AM org.apache.tuscany.sca.assembly.builder.impl.CompositeBuilderImpl$1 problem
WARNING: Component reference target not found, it might be a remote service: SubtractServiceComponent
Mar 14, 2008 3:10:48 AM org.apache.tuscany.sca.assembly.builder.impl.CompositeBuilderImpl$1 problem
WARNING: Theres been an exception relation to policies... org.apache.tuscany.sca.assembly.builder.impl.PolicyComputationException: The are unfulfilled intents for binding in reference - addService
Unfulfilled Intents = [{http://test}tuscanyIntent_1, {http://test}tuscanyIntent_3, {http://test}tuscanyIntent_2]
Tests run: 1, Failures: 0, Errors: 0, Skipped: 0, Time elapsed: 0.206 sec
Running org.apache.tuscany.sca.assembly.xml.ResolvePolicyTestCase
Mar 14, 2008 3:10:48 AM org.apache.tuscany.sca.contribution.processor.ExtensibleStAXArtifactProcessor read
WARNING: Element {http://www.osoa.org/xmlns/sca/1.0}interface.java cannot be processed. ([row,col,system-id]: [26,9,"file:/home/continuum/data/working-directory/277/modules/assembly-xml/target/test-classes/org/apache/tuscany/sca/assembly/xml/CalculatorComponent.constrainingType"])
Mar 14, 2008 3:10:48 AM org.apache.tuscany.sca.contribution.processor.ExtensibleStAXArtifactProcessor read
WARNING: Element {http://www.osoa.org/xmlns/sca/1.0}interface.java cannot be processed. ([row,col,system-id]: [30,9,"file:/home/continuum/data/working-directory/277/modules/assembly-xml/target/test-classes/org/apache/tuscany/sca/assembly/xml/CalculatorComponent.constrainingType"])
Mar 14, 2008 3:10:48 AM org.apache.tuscany.sca.contribution.processor.ExtensibleStAXArtifactProcessor read
WARNING: Element {http://extension}testExtension cannot be processed. ([row,col,system-id]: [30,5,"file:/home/continuum/data/working-directory/277/modules/assembly-xml/target/test-classes/org/apache/tuscany/sca/assembly/xml/TestAllCalculator.composite"])
Mar 14, 2008 3:10:48 AM org.apache.tuscany.sca.contribution.processor.ExtensibleStAXArtifactProcessor read
WARNING: Element {http://extension}testExtension cannot be processed. ([row,col,system-id]: [34,9,"file:/home/continuum/data/working-directory/277/modules/assembly-xml/target/test-classes/org/apache/tuscany/sca/assembly/xml/TestAllCalculator.composite"])
Mar 14, 2008 3:10:48 AM org.apache.tuscany.sca.contribution.processor.ExtensibleStAXArtifactProcessor read
WARNING: Element {http://www.osoa.org/xmlns/sca/1.0}interface.java cannot be processed. ([row,col,system-id]: [35,9,"file:/home/continuum/data/working-directory/277/modules/assembly-xml/target/test-classes/org/apache/tuscany/sca/assembly/xml/TestAllCalculator.composite"])
Mar 14, 2008 3:10:48 AM org.apache.tuscany.sca.contribution.processor.ExtensibleStAXArtifactProcessor read
WARNING: Element {http://www.osoa.org/xmlns/sca/1.0}binding.ws cannot be processed. ([row,col,system-id]: [38,9,"file:/home/continuum/data/working-directory/277/modules/assembly-xml/target/test-classes/org/apache/tuscany/sca/assembly/xml/TestAllCalculator.composite"])
Mar 14, 2008 3:10:48 AM org.apache.tuscany.sca.contribution.processor.ExtensibleStAXArtifactProcessor read
WARNING: Element {http://extension}testExtension cannot be processed. ([row,col,system-id]: [43,10,"file:/home/continuum/data/working-directory/277/modules/assembly-xml/target/test-classes/org/apache/tuscany/sca/assembly/xml/TestAllCalculator.composite"])
Mar 14, 2008 3:10:48 AM org.apache.tuscany.sca.contribution.processor.ExtensibleStAXArtifactProcessor read
WARNING: Element {http://www.osoa.org/xmlns/sca/1.0}binding.ws cannot be processed. ([row,col,system-id]: [44,13,"file:/home/continuum/data/working-directory/277/modules/assembly-xml/target/test-classes/org/apache/tuscany/sca/assembly/xml/TestAllCalculator.composite"])
Mar 14, 2008 3:10:48 AM org.apache.tuscany.sca.contribution.processor.ExtensibleStAXArtifactProcessor read
WARNING: Element {http://extension}testExtension cannot be processed. ([row,col,system-id]: [52,9,"file:/home/continuum/data/working-directory/277/modules/assembly-xml/target/test-classes/org/apache/tuscany/sca/assembly/xml/TestAllCalculator.composite"])
Mar 14, 2008 3:10:48 AM org.apache.tuscany.sca.contribution.processor.ExtensibleStAXArtifactProcessor read
WARNING: Element {http://www.osoa.org/xmlns/sca/1.0}interface.java cannot be processed. ([row,col,system-id]: [54,13,"file:/home/continuum/data/working-directory/277/modules/assembly-xml/target/test-classes/org/apache/tuscany/sca/assembly/xml/TestAllCalculator.composite"])
Mar 14, 2008 3:10:48 AM org.apache.tuscany.sca.contribution.processor.ExtensibleStAXArtifactProcessor read
WARNING: Element {http://extension}testExtension cannot be processed. ([row,col,system-id]: [59,13,"file:/home/continuum/data/working-directory/277/modules/assembly-xml/target/test-classes/org/apache/tuscany/sca/assembly/xml/TestAllCalculator.composite"])
Mar 14, 2008 3:10:48 AM org.apache.tuscany.sca.contribution.processor.ExtensibleStAXArtifactProcessor read
WARNING: Element {http://www.osoa.org/xmlns/sca/1.0}interface.java cannot be processed. ([row,col,system-id]: [60,13,"file:/home/continuum/data/working-directory/277/modules/assembly-xml/target/test-classes/org/apache/tuscany/sca/assembly/xml/TestAllCalculator.composite"])
Mar 14, 2008 3:10:48 AM org.apache.tuscany.sca.contribution.processor.ExtensibleStAXArtifactProcessor read
WARNING: Element {http://www.osoa.org/xmlns/sca/1.0}implementation.java cannot be processed. ([row,col,system-id]: [68,9,"file:/home/continuum/data/working-directory/277/modules/assembly-xml/target/test-classes/org/apache/tuscany/sca/assembly/xml/TestAllCalculator.composite"])
Mar 14, 2008 3:10:48 AM org.apache.tuscany.sca.contribution.processor.ExtensibleStAXArtifactProcessor read
WARNING: Element {http://www.osoa.org/xmlns/sca/1.0}interface.java cannot be processed. ([row,col,system-id]: [73,13,"file:/home/continuum/data/working-directory/277/modules/assembly-xml/target/test-classes/org/apache/tuscany/sca/assembly/xml/TestAllCalculator.composite"])
Mar 14, 2008 3:10:48 AM org.apache.tuscany.sca.contribution.processor.ExtensibleStAXArtifactProcessor read
WARNING: Element {http://www.osoa.org/xmlns/sca/1.0}implementation.java cannot be processed. ([row,col,system-id]: [75,9,"file:/home/continuum/data/working-directory/277/modules/assembly-xml/target/test-classes/org/apache/tuscany/sca/assembly/xml/TestAllCalculator.composite"])
Mar 14, 2008 3:10:48 AM org.apache.tuscany.sca.contribution.processor.ExtensibleStAXArtifactProcessor read
WARNING: Element {http://www.osoa.org/xmlns/sca/1.0}interface.java cannot be processed. ([row,col,system-id]: [80,13,"file:/home/continuum/data/working-directory/277/modules/assembly-xml/target/test-classes/org/apache/tuscany/sca/assembly/xml/TestAllCalculator.composite"])
Mar 14, 2008 3:10:48 AM org.apache.tuscany.sca.contribution.processor.ExtensibleStAXArtifactProcessor read
WARNING: Element {http://www.osoa.org/xmlns/sca/1.0}implementation.java cannot be processed. ([row,col,system-id]: [86,9,"file:/home/continuum/data/working-directory/277/modules/assembly-xml/target/test-classes/org/apache/tuscany/sca/assembly/xml/TestAllCalculator.composite"])
Mar 14, 2008 3:10:48 AM org.apache.tuscany.sca.contribution.processor.ExtensibleStAXArtifactProcessor read
WARNING: Element {http://www.osoa.org/xmlns/sca/1.0}implementation.java cannot be processed. ([row,col,system-id]: [90,9,"file:/home/continuum/data/working-directory/277/modules/assembly-xml/target/test-classes/org/apache/tuscany/sca/assembly/xml/TestAllCalculator.composite"])
Mar 14, 2008 3:10:48 AM org.apache.tuscany.sca.contribution.processor.ExtensibleStAXArtifactProcessor read
WARNING: Element {http://www.osoa.org/xmlns/sca/1.0}implementation.java cannot be processed. ([row,col,system-id]: [94,9,"file:/home/continuum/data/working-directory/277/modules/assembly-xml/target/test-classes/org/apache/tuscany/sca/assembly/xml/TestAllCalculator.composite"])
Mar 14, 2008 3:10:48 AM org.apache.tuscany.sca.contribution.processor.ExtensibleStAXArtifactProcessor read
WARNING: Element {http://www.osoa.org/xmlns/sca/1.0}interface.java cannot be processed. ([row,col,system-id]: [99,9,"file:/home/continuum/data/working-directory/277/modules/assembly-xml/target/test-classes/org/apache/tuscany/sca/assembly/xml/TestAllCalculator.composite"])
Mar 14, 2008 3:10:48 AM org.apache.tuscany.sca.contribution.processor.ExtensibleStAXArtifactProcessor read
WARNING: Element {http://www.osoa.org/xmlns/sca/1.0}binding.ws cannot be processed. ([row,col,system-id]: [102,9,"file:/home/continuum/data/working-directory/277/modules/assembly-xml/target/test-classes/org/apache/tuscany/sca/assembly/xml/TestAllCalculator.composite"])
Mar 14, 2008 3:10:48 AM org.apache.tuscany.sca.contribution.processor.ExtensibleStAXArtifactProcessor read
WARNING: Element {http://www.osoa.org/xmlns/sca/1.0}binding.ws cannot be processed. ([row,col,system-id]: [107,13,"file:/home/continuum/data/working-directory/277/modules/assembly-xml/target/test-classes/org/apache/tuscany/sca/assembly/xml/TestAllCalculator.composite"])
Mar 14, 2008 3:10:48 AM org.apache.tuscany.sca.contribution.processor.ExtensibleStAXArtifactProcessor read
WARNING: Element {http://www.osoa.org/xmlns/sca/1.0}interface.java cannot be processed. ([row,col,system-id]: [26,9,"file:/home/continuum/data/working-directory/277/modules/assembly-xml/target/test-classes/org/apache/tuscany/sca/assembly/xml/Calculator.composite"])
Mar 14, 2008 3:10:48 AM org.apache.tuscany.sca.contribution.processor.ExtensibleStAXArtifactProcessor read
WARNING: Element {http://www.osoa.org/xmlns/sca/1.0}implementation.java cannot be processed. ([row,col,system-id]: [30,3,"file:/home/continuum/data/working-directory/277/modules/assembly-xml/target/test-classes/org/apache/tuscany/sca/assembly/xml/Calculator.composite"])
Mar 14, 2008 3:10:48 AM org.apache.tuscany.sca.contribution.processor.ExtensibleStAXArtifactProcessor read
WARNING: Element {http://www.osoa.org/xmlns/sca/1.0}implementation.java cannot be processed. ([row,col,system-id]: [38,9,"file:/home/continuum/data/working-directory/277/modules/assembly-xml/target/test-classes/org/apache/tuscany/sca/assembly/xml/Calculator.composite"])
Mar 14, 2008 3:10:48 AM org.apache.tuscany.sca.contribution.processor.ExtensibleStAXArtifactProcessor read
WARNING: Element {http://www.osoa.org/xmlns/sca/1.0}implementation.java cannot be processed. ([row,col,system-id]: [42,9,"file:/home/continuum/data/working-directory/277/modules/assembly-xml/target/test-classes/org/apache/tuscany/sca/assembly/xml/Calculator.composite"])
Mar 14, 2008 3:10:48 AM org.apache.tuscany.sca.contribution.processor.ExtensibleStAXArtifactProcessor read
WARNING: Element {http://www.osoa.org/xmlns/sca/1.0}implementation.java cannot be processed. ([row,col,system-id]: [46,9,"file:/home/continuum/data/working-directory/277/modules/assembly-xml/target/test-classes/org/apache/tuscany/sca/assembly/xml/Calculator.composite"])
Mar 14, 2008 3:10:48 AM org.apache.tuscany.sca.contribution.processor.ExtensibleStAXArtifactProcessor read
WARNING: Element {http://www.osoa.org/xmlns/sca/1.0}implementation.java cannot be processed. ([row,col,system-id]: [50,9,"file:/home/continuum/data/working-directory/277/modules/assembly-xml/target/test-classes/org/apache/tuscany/sca/assembly/xml/Calculator.composite"])
Mar 14, 2008 3:10:48 AM org.apache.tuscany.sca.contribution.processor.ExtensibleStAXArtifactProcessor read
WARNING: Element {http://extension}testExtension cannot be processed. ([row,col,system-id]: [30,5,"file:/home/continuum/data/working-directory/277/modules/assembly-xml/target/test-classes/org/apache/tuscany/sca/assembly/xml/TestAllCalculator.composite"])
Mar 14, 2008 3:10:48 AM org.apache.tuscany.sca.contribution.processor.ExtensibleStAXArtifactProcessor read
WARNING: Element {http://extension}testExtension cannot be processed. ([row,col,system-id]: [34,9,"file:/home/continuum/data/working-directory/277/modules/assembly-xml/target/test-classes/org/apache/tuscany/sca/assembly/xml/TestAllCalculator.composite"])
Mar 14, 2008 3:10:48 AM org.apache.tuscany.sca.contribution.processor.ExtensibleStAXArtifactProcessor read
WARNING: Element {http://www.osoa.org/xmlns/sca/1.0}interface.java cannot be processed. ([row,col,system-id]: [35,9,"file:/home/continuum/data/working-directory/277/modules/assembly-xml/target/test-classes/org/apache/tuscany/sca/assembly/xml/TestAllCalculator.composite"])
Mar 14, 2008 3:10:48 AM org.apache.tuscany.sca.contribution.processor.ExtensibleStAXArtifactProcessor read
WARNING: Element {http://www.osoa.org/xmlns/sca/1.0}binding.ws cannot be processed. ([row,col,system-id]: [38,9,"file:/home/continuum/data/working-directory/277/modules/assembly-xml/target/test-classes/org/apache/tuscany/sca/assembly/xml/TestAllCalculator.composite"])
Mar 14, 2008 3:10:48 AM org.apache.tuscany.sca.contribution.processor.ExtensibleStAXArtifactProcessor read
WARNING: Element {http://extension}testExtension cannot be processed. ([row,col,system-id]: [43,10,"file:/home/continuum/data/working-directory/277/modules/assembly-xml/target/test-classes/org/apache/tuscany/sca/assembly/xml/TestAllCalculator.composite"])
Mar 14, 2008 3:10:48 AM org.apache.tuscany.sca.contribution.processor.ExtensibleStAXArtifactProcessor read
WARNING: Element {http://www.osoa.org/xmlns/sca/1.0}binding.ws cannot be processed. ([row,col,system-id]: [44,13,"file:/home/continuum/data/working-directory/277/modules/assembly-xml/target/test-classes/org/apache/tuscany/sca/assembly/xml/TestAllCalculator.composite"])
Mar 14, 2008 3:10:48 AM org.apache.tuscany.sca.contribution.processor.ExtensibleStAXArtifactProcessor read
WARNING: Element {http://extension}testExtension cannot be processed. ([row,col,system-id]: [52,9,"file:/home/continuum/data/working-directory/277/modules/assembly-xml/target/test-classes/org/apache/tuscany/sca/assembly/xml/TestAllCalculator.composite"])
Mar 14, 2008 3:10:48 AM org.apache.tuscany.sca.contribution.processor.ExtensibleStAXArtifactProcessor read
WARNING: Element {http://www.osoa.org/xmlns/sca/1.0}interface.java cannot be processed. ([row,col,system-id]: [54,13,"file:/home/continuum/data/working-directory/277/modules/assembly-xml/target/test-classes/org/apache/tuscany/sca/assembly/xml/TestAllCalculator.composite"])
Mar 14, 2008 3:10:48 AM org.apache.tuscany.sca.contribution.processor.ExtensibleStAXArtifactProcessor read
WARNING: Element {http://extension}testExtension cannot be processed. ([row,col,system-id]: [59,13,"file:/home/continuum/data/working-directory/277/modules/assembly-xml/target/test-classes/org/apache/tuscany/sca/assembly/xml/TestAllCalculator.composite"])
Mar 14, 2008 3:10:48 AM org.apache.tuscany.sca.contribution.processor.ExtensibleStAXArtifactProcessor read
WARNING: Element {http://www.osoa.org/xmlns/sca/1.0}interface.java cannot be processed. ([row,col,system-id]: [60,13,"file:/home/continuum/data/working-directory/277/modules/assembly-xml/target/test-classes/org/apache/tuscany/sca/assembly/xml/TestAllCalculator.composite"])
Mar 14, 2008 3:10:48 AM org.apache.tuscany.sca.contribution.processor.ExtensibleStAXArtifactProcessor read
WARNING: Element {http://www.osoa.org/xmlns/sca/1.0}implementation.java cannot be processed. ([row,col,system-id]: [68,9,"file:/home/continuum/data/working-directory/277/modules/assembly-xml/target/test-classes/org/apache/tuscany/sca/assembly/xml/TestAllCalculator.composite"])
Mar 14, 2008 3:10:48 AM org.apache.tuscany.sca.contribution.processor.ExtensibleStAXArtifactProcessor read
WARNING: Element {http://www.osoa.org/xmlns/sca/1.0}interface.java cannot be processed. ([row,col,system-id]: [73,13,"file:/home/continuum/data/working-directory/277/modules/assembly-xml/target/test-classes/org/apache/tuscany/sca/assembly/xml/TestAllCalculator.composite"])
Mar 14, 2008 3:10:48 AM org.apache.tuscany.sca.contribution.processor.ExtensibleStAXArtifactProcessor read
WARNING: Element {http://www.osoa.org/xmlns/sca/1.0}implementation.java cannot be processed. ([row,col,system-id]: [75,9,"file:/home/continuum/data/working-directory/277/modules/assembly-xml/target/test-classes/org/apache/tuscany/sca/assembly/xml/TestAllCalculator.composite"])
Mar 14, 2008 3:10:48 AM org.apache.tuscany.sca.contribution.processor.ExtensibleStAXArtifactProcessor read
WARNING: Element {http://www.osoa.org/xmlns/sca/1.0}interface.java cannot be processed. ([row,col,system-id]: [80,13,"file:/home/continuum/data/working-directory/277/modules/assembly-xml/target/test-classes/org/apache/tuscany/sca/assembly/xml/TestAllCalculator.composite"])
Mar 14, 2008 3:10:48 AM org.apache.tuscany.sca.contribution.processor.ExtensibleStAXArtifactProcessor read
WARNING: Element {http://www.osoa.org/xmlns/sca/1.0}implementation.java cannot be processed. ([row,col,system-id]: [86,9,"file:/home/continuum/data/working-directory/277/modules/assembly-xml/target/test-classes/org/apache/tuscany/sca/assembly/xml/TestAllCalculator.composite"])
Mar 14, 2008 3:10:48 AM org.apache.tuscany.sca.contribution.processor.ExtensibleStAXArtifactProcessor read
WARNING: Element {http://www.osoa.org/xmlns/sca/1.0}implementation.java cannot be processed. ([row,col,system-id]: [90,9,"file:/home/continuum/data/working-directory/277/modules/assembly-xml/target/test-classes/org/apache/tuscany/sca/assembly/xml/TestAllCalculator.composite"])
Mar 14, 2008 3:10:48 AM org.apache.tuscany.sca.contribution.processor.ExtensibleStAXArtifactProcessor read
WARNING: Element {http://www.osoa.org/xmlns/sca/1.0}implementation.java cannot be processed. ([row,col,system-id]: [94,9,"file:/home/continuum/data/working-directory/277/modules/assembly-xml/target/test-classes/org/apache/tuscany/sca/assembly/xml/TestAllCalculator.composite"])
Mar 14, 2008 3:10:48 AM org.apache.tuscany.sca.contribution.processor.ExtensibleStAXArtifactProcessor read
WARNING: Element {http://www.osoa.org/xmlns/sca/1.0}interface.java cannot be processed. ([row,col,system-id]: [99,9,"file:/home/continuum/data/working-directory/277/modules/assembly-xml/target/test-classes/org/apache/tuscany/sca/assembly/xml/TestAllCalculator.composite"])
Mar 14, 2008 3:10:48 AM org.apache.tuscany.sca.contribution.processor.ExtensibleStAXArtifactProcessor read
WARNING: Element {http://www.osoa.org/xmlns/sca/1.0}binding.ws cannot be processed. ([row,col,system-id]: [102,9,"file:/home/continuum/data/working-directory/277/modules/assembly-xml/target/test-classes/org/apache/tuscany/sca/assembly/xml/TestAllCalculator.composite"])
Mar 14, 2008 3:10:48 AM org.apache.tuscany.sca.contribution.processor.ExtensibleStAXArtifactProcessor read
WARNING: Element {http://www.osoa.org/xmlns/sca/1.0}binding.ws cannot be processed. ([row,col,system-id]: [107,13,"file:/home/continuum/data/working-directory/277/modules/assembly-xml/target/test-classes/org/apache/tuscany/sca/assembly/xml/TestAllCalculator.composite"])
Tests run: 2, Failures: 0, Errors: 1, Skipped: 0, Time elapsed: 0.086 sec <<< FAILURE!
testResolveConstrainingType(org.apache.tuscany.sca.assembly.xml.ResolvePolicyTestCase)  Time elapsed: 0.039 sec  <<< ERROR!
org.apache.tuscany.sca.contribution.service.ContributionReadException: javax.xml.xpath.XPathExpressionException
	at org.apache.tuscany.sca.policy.xml.PolicySetProcessor.read(PolicySetProcessor.java:109)
	at org.apache.tuscany.sca.policy.xml.PolicySetProcessor.read(PolicySetProcessor.java:61)
	at org.apache.tuscany.sca.contribution.processor.ExtensibleStAXArtifactProcessor.read(ExtensibleStAXArtifactProcessor.java:83)
	at org.apache.tuscany.sca.definitions.xml.SCADefinitionsProcessor.read(SCADefinitionsProcessor.java:90)
	at org.apache.tuscany.sca.definitions.xml.SCADefinitionsProcessor.read(SCADefinitionsProcessor.java:49)
	at org.apache.tuscany.sca.contribution.processor.ExtensibleStAXArtifactProcessor.read(ExtensibleStAXArtifactProcessor.java:83)
	at org.apache.tuscany.sca.definitions.xml.SCADefinitionsDocumentProcessor.read(SCADefinitionsDocumentProcessor.java:120)
	at org.apache.tuscany.sca.assembly.xml.ResolvePolicyTestCase.testResolveConstrainingType(ResolvePolicyTestCase.java:115)
	at sun.reflect.NativeMethodAccessorImpl.invoke0(Native Method)
	at sun.reflect.NativeMethodAccessorImpl.invoke(NativeMethodAccessorImpl.java:39)
	at sun.reflect.DelegatingMethodAccessorImpl.invoke(DelegatingMethodAccessorImpl.java:25)
	at java.lang.reflect.Method.invoke(Method.java:585)
	at junit.framework.TestCase.runTest(TestCase.java:168)
	at junit.framework.TestCase.runBare(TestCase.java:134)
	at junit.framework.TestResult$1.protect(TestResult.java:110)
	at junit.framework.TestResult.runProtected(TestResult.java:128)
	at junit.framework.TestResult.run(TestResult.java:113)
	at junit.framework.TestCase.run(TestCase.java:124)
	at junit.framework.TestSuite.runTest(TestSuite.java:232)
	at junit.framework.TestSuite.run(TestSuite.java:227)
	at org.junit.internal.runners.OldTestClassRunner.run(OldTestClassRunner.java:35)
	at org.apache.maven.surefire.junit4.JUnit4TestSet.execute(JUnit4TestSet.java:62)
	at org.apache.maven.surefire.suite.AbstractDirectoryTestSuite.executeTestSet(AbstractDirectoryTestSuite.java:138)
	at org.apache.maven.surefire.suite.AbstractDirectoryTestSuite.execute(AbstractDirectoryTestSuite.java:125)
	at org.apache.maven.surefire.Surefire.run(Surefire.java:132)
	at sun.reflect.NativeMethodAccessorImpl.invoke0(Native Method)
	at sun.reflect.NativeMethodAccessorImpl.invoke(NativeMethodAccessorImpl.java:39)
	at sun.reflect.DelegatingMethodAccessorImpl.invoke(DelegatingMethodAccessorImpl.java:25)
	at java.lang.reflect.Method.invoke(Method.java:585)
	at org.apache.maven.surefire.booter.SurefireBooter.runSuitesInProcess(SurefireBooter.java:308)
	at org.apache.maven.surefire.booter.SurefireBooter.main(SurefireBooter.java:879)
Caused by: javax.xml.xpath.XPathExpressionException
	at com.sun.org.apache.xpath.internal.jaxp.XPathImpl.compile(XPathImpl.java:402)
	at org.apache.tuscany.sca.policy.xml.PolicySetProcessor.read(PolicySetProcessor.java:103)
	... 30 more
Caused by: javax.xml.transform.TransformerException: Extra illegal tokens: 'http://www.osoa.org/xmlns/sca/1.0', ':', 'binding.sca'
	at com.sun.org.apache.xpath.internal.compiler.XPathParser.error(XPathParser.java:602)
	at com.sun.org.apache.xpath.internal.compiler.XPathParser.initXPath(XPathParser.java:141)
	at com.sun.org.apache.xpath.internal.XPath.<init>(XPath.java:162)
	at com.sun.org.apache.xpath.internal.XPath.<init>(XPath.java:198)
	at com.sun.org.apache.xpath.internal.jaxp.XPathImpl.compile(XPathImpl.java:394)
	... 31 more

Running org.apache.tuscany.sca.assembly.xml.ReadAllTestCase
Mar 14, 2008 3:10:49 AM org.apache.tuscany.sca.contribution.processor.ExtensibleStAXArtifactProcessor read
WARNING: Element {http://extension}testExtension cannot be processed. ([row,col {unknown-source}]: [30,5])
Mar 14, 2008 3:10:49 AM org.apache.tuscany.sca.contribution.processor.ExtensibleStAXArtifactProcessor read
WARNING: Element {http://extension}testExtension cannot be processed. ([row,col {unknown-source}]: [34,9])
Mar 14, 2008 3:10:49 AM org.apache.tuscany.sca.contribution.processor.ExtensibleStAXArtifactProcessor read
WARNING: Element {http://www.osoa.org/xmlns/sca/1.0}interface.java cannot be processed. ([row,col {unknown-source}]: [35,9])
Mar 14, 2008 3:10:49 AM org.apache.tuscany.sca.contribution.processor.ExtensibleStAXArtifactProcessor read
WARNING: Element {http://www.osoa.org/xmlns/sca/1.0}binding.ws cannot be processed. ([row,col {unknown-source}]: [38,9])
Mar 14, 2008 3:10:49 AM org.apache.tuscany.sca.contribution.processor.ExtensibleStAXArtifactProcessor read
WARNING: Element {http://extension}testExtension cannot be processed. ([row,col {unknown-source}]: [43,10])
Mar 14, 2008 3:10:49 AM org.apache.tuscany.sca.contribution.processor.ExtensibleStAXArtifactProcessor read
WARNING: Element {http://www.osoa.org/xmlns/sca/1.0}binding.ws cannot be processed. ([row,col {unknown-source}]: [44,13])
Mar 14, 2008 3:10:49 AM org.apache.tuscany.sca.contribution.processor.ExtensibleStAXArtifactProcessor read
WARNING: Element {http://extension}testExtension cannot be processed. ([row,col {unknown-source}]: [52,9])
Mar 14, 2008 3:10:49 AM org.apache.tuscany.sca.contribution.processor.ExtensibleStAXArtifactProcessor read
WARNING: Element {http://www.osoa.org/xmlns/sca/1.0}interface.java cannot be processed. ([row,col {unknown-source}]: [54,13])
Mar 14, 2008 3:10:49 AM org.apache.tuscany.sca.contribution.processor.ExtensibleStAXArtifactProcessor read
WARNING: Element {http://extension}testExtension cannot be processed. ([row,col {unknown-source}]: [59,13])
Mar 14, 2008 3:10:49 AM org.apache.tuscany.sca.contribution.processor.ExtensibleStAXArtifactProcessor read
WARNING: Element {http://www.osoa.org/xmlns/sca/1.0}interface.java cannot be processed. ([row,col {unknown-source}]: [60,13])
Mar 14, 2008 3:10:49 AM org.apache.tuscany.sca.contribution.processor.ExtensibleStAXArtifactProcessor read
WARNING: Element {http://www.osoa.org/xmlns/sca/1.0}implementation.java cannot be processed. ([row,col {unknown-source}]: [68,9])
Mar 14, 2008 3:10:49 AM org.apache.tuscany.sca.contribution.processor.ExtensibleStAXArtifactProcessor read
WARNING: Element {http://www.osoa.org/xmlns/sca/1.0}interface.java cannot be processed. ([row,col {unknown-source}]: [73,13])
Mar 14, 2008 3:10:49 AM org.apache.tuscany.sca.contribution.processor.ExtensibleStAXArtifactProcessor read
WARNING: Element {http://www.osoa.org/xmlns/sca/1.0}implementation.java cannot be processed. ([row,col {unknown-source}]: [75,9])
Mar 14, 2008 3:10:49 AM org.apache.tuscany.sca.contribution.processor.ExtensibleStAXArtifactProcessor read
WARNING: Element {http://www.osoa.org/xmlns/sca/1.0}interface.java cannot be processed. ([row,col {unknown-source}]: [80,13])
Mar 14, 2008 3:10:49 AM org.apache.tuscany.sca.contribution.processor.ExtensibleStAXArtifactProcessor read
WARNING: Element {http://www.osoa.org/xmlns/sca/1.0}implementation.java cannot be processed. ([row,col {unknown-source}]: [86,9])
Mar 14, 2008 3:10:49 AM org.apache.tuscany.sca.contribution.processor.ExtensibleStAXArtifactProcessor read
WARNING: Element {http://www.osoa.org/xmlns/sca/1.0}implementation.java cannot be processed. ([row,col {unknown-source}]: [90,9])
Mar 14, 2008 3:10:49 AM org.apache.tuscany.sca.contribution.processor.ExtensibleStAXArtifactProcessor read
WARNING: Element {http://www.osoa.org/xmlns/sca/1.0}implementation.java cannot be processed. ([row,col {unknown-source}]: [94,9])
Mar 14, 2008 3:10:49 AM org.apache.tuscany.sca.contribution.processor.ExtensibleStAXArtifactProcessor read
WARNING: Element {http://www.osoa.org/xmlns/sca/1.0}interface.java cannot be processed. ([row,col {unknown-source}]: [99,9])
Mar 14, 2008 3:10:49 AM org.apache.tuscany.sca.contribution.processor.ExtensibleStAXArtifactProcessor read
WARNING: Element {http://www.osoa.org/xmlns/sca/1.0}binding.ws cannot be processed. ([row,col {unknown-source}]: [102,9])
Mar 14, 2008 3:10:49 AM org.apache.tuscany.sca.contribution.processor.ExtensibleStAXArtifactProcessor read
WARNING: Element {http://www.osoa.org/xmlns/sca/1.0}binding.ws cannot be processed. ([row,col {unknown-source}]: [107,13])
Tests run: 1, Failures: 0, Errors: 0, Skipped: 0, Time elapsed: 0.027 sec

Results :

Tests in error: 
  testResolveConstrainingType(org.apache.tuscany.sca.assembly.xml.WireTestCase)
  testResolveComposite(org.apache.tuscany.sca.assembly.xml.WireTestCase)
  testReadWireWriteComposite(org.apache.tuscany.sca.assembly.xml.WriteAllTestCase)
  testResolveConstrainingType(org.apache.tuscany.sca.assembly.xml.ResolvePolicyTestCase)

Tests run: 23, Failures: 0, Errors: 4, Skipped: 0

[INFO] ------------------------------------------------------------------------
[ERROR] BUILD FAILURE
[INFO] ------------------------------------------------------------------------
[INFO] There are test failures.

Please refer to /home/continuum/data/working-directory/277/modules/assembly-xml/target/surefire-reports for the individual test results.
[INFO] ------------------------------------------------------------------------
[INFO] For more information, run Maven with the -e switch
[INFO] ------------------------------------------------------------------------
[INFO] Total time: 2 minutes 36 seconds
[INFO] Finished at: Fri Mar 14 03:10:49 PDT 2008
[INFO] Final Memory: 20M/43M
[INFO] ------------------------------------------------------------------------

****************************************************************************



---------------------------------------------------------------------
To unsubscribe, e-mail: tuscany-dev-unsubscribe@ws.apache.org
For additional commands, e-mail: tuscany-dev-help@ws.apache.org


Mime
View raw message