tuscany-commits mailing list archives

Site index · List index
Message view « Date » · « Thread »
Top « Date » · « Thread »
From Apache Jenkins Server <jenk...@builds.apache.org>
Subject Build failed in Jenkins: Tuscany-2x-deploy #765
Date Fri, 13 Apr 2012 01:06:12 GMT
See <https://builds.apache.org/job/Tuscany-2x-deploy/765/changes>

Changes:

[antelder] Update changes file for 2.0 release

[antelder] Update release notes for 2.0 release

------------------------------------------
[...truncated 20469 lines...]
[INFO] Tests are skipped.
[INFO] [jar:jar {execution: default-jar}]
[INFO] Building jar: <https://builds.apache.org/job/Tuscany-2x-deploy/ws/sca-2x/modules/implementation-jaxrs/target/tuscany-implementation-jaxrs-2.0-SNAPSHOT.jar>
[INFO] [source:jar-no-fork {execution: attach-sources}]
[INFO] Building jar: <https://builds.apache.org/job/Tuscany-2x-deploy/ws/sca-2x/modules/implementation-jaxrs/target/tuscany-implementation-jaxrs-2.0-SNAPSHOT-sources.jar>
[INFO] [install:install {execution: default-install}]
[INFO] Installing <https://builds.apache.org/job/Tuscany-2x-deploy/ws/sca-2x/modules/implementation-jaxrs/target/tuscany-implementation-jaxrs-2.0-SNAPSHOT.jar>
to <https://builds.apache.org/job/Tuscany-2x-deploy/ws/.repository/org/apache/tuscany/sca/tuscany-implementation-jaxrs/2.0-SNAPSHOT/tuscany-implementation-jaxrs-2.0-SNAPSHOT.jar>
[INFO] Installing <https://builds.apache.org/job/Tuscany-2x-deploy/ws/sca-2x/modules/implementation-jaxrs/target/tuscany-implementation-jaxrs-2.0-SNAPSHOT-sources.jar>
to <https://builds.apache.org/job/Tuscany-2x-deploy/ws/.repository/org/apache/tuscany/sca/tuscany-implementation-jaxrs/2.0-SNAPSHOT/tuscany-implementation-jaxrs-2.0-SNAPSHOT-sources.jar>
[INFO] [deploy:deploy {execution: default-deploy}]
[INFO] Retrieving previous build number from apache.snapshots.https
[WARNING] *** CHECKSUM FAILED - Checksum failed on download: local = '3f868f7664866a4d21597a05cc0c63a0a0b7a598';
remote = '7896ae8ea6c6fd9bcce6f00e8d7b48c462392a6d' - RETRYING
[WARNING] *** CHECKSUM FAILED - Checksum failed on download: local = '3f868f7664866a4d21597a05cc0c63a0a0b7a598';
remote = '7896ae8ea6c6fd9bcce6f00e8d7b48c462392a6d' - IGNORING
Uploading: https://repository.apache.org/content/repositories/snapshots/org/apache/tuscany/sca/tuscany-implementation-jaxrs/2.0-SNAPSHOT/tuscany-implementation-jaxrs-2.0-SNAPSHOT.jar
22K uploaded  (tuscany-implementation-jaxrs-2.0-SNAPSHOT.jar)
[INFO] Uploading project information for tuscany-implementation-jaxrs 2.0-SNAPSHOT
[INFO] Retrieving previous metadata from apache.snapshots.https
[WARNING] *** CHECKSUM FAILED - Checksum failed on download: local = '3f868f7664866a4d21597a05cc0c63a0a0b7a598';
remote = '7896ae8ea6c6fd9bcce6f00e8d7b48c462392a6d' - RETRYING
[WARNING] *** CHECKSUM FAILED - Checksum failed on download: local = '3f868f7664866a4d21597a05cc0c63a0a0b7a598';
remote = '7896ae8ea6c6fd9bcce6f00e8d7b48c462392a6d' - IGNORING
[INFO] Uploading repository metadata for: 'snapshot org.apache.tuscany.sca:tuscany-implementation-jaxrs:2.0-SNAPSHOT'
[INFO] Retrieving previous metadata from apache.snapshots.https
[INFO] Uploading repository metadata for: 'artifact org.apache.tuscany.sca:tuscany-implementation-jaxrs'
[INFO] Retrieving previous build number from apache.snapshots.https
Uploading: https://repository.apache.org/content/repositories/snapshots/org/apache/tuscany/sca/tuscany-implementation-jaxrs/2.0-SNAPSHOT/tuscany-implementation-jaxrs-2.0-SNAPSHOT-sources.jar
19K uploaded  (tuscany-implementation-jaxrs-2.0-SNAPSHOT-sources.jar)
[JENKINS] Archiving disabled - not archiving <https://builds.apache.org/job/Tuscany-2x-deploy/ws/sca-2x/modules/implementation-jaxrs/pom.xml>
[JENKINS] Archiving disabled - not archiving <https://builds.apache.org/job/Tuscany-2x-deploy/ws/sca-2x/modules/implementation-jaxrs/target/tuscany-implementation-jaxrs-2.0-SNAPSHOT.jar>
[JENKINS] Archiving disabled - not archiving <https://builds.apache.org/job/Tuscany-2x-deploy/ws/sca-2x/modules/implementation-jaxrs/target/tuscany-implementation-jaxrs-2.0-SNAPSHOT-sources.jar>
[INFO] ------------------------------------------------------------------------
[INFO] Building Apache Tuscany SCA Python Implementation Model
[INFO]    task-segment: [clean, deploy]
[INFO] ------------------------------------------------------------------------
[INFO] [clean:clean {execution: default-clean}]
[INFO] [enforcer:enforce {execution: enforce-plugin-versions}]
[INFO] [remote-resources:process {execution: default}]
[INFO] [resources:resources {execution: default-resources}]
[INFO] Using 'UTF-8' encoding to copy filtered resources.
[INFO] Copying 3 resources
[INFO] Copying 3 resources
[INFO] Copying 3 resources
[INFO] [compiler:compile {execution: default-compile}]
[INFO] Compiling 4 source files to <https://builds.apache.org/job/Tuscany-2x-deploy/ws/sca-2x/modules/implementation-python/target/classes>
[INFO] [resources:testResources {execution: default-testResources}]
[INFO] Using 'UTF-8' encoding to copy filtered resources.
[INFO] Copying 1 resource
[INFO] Copying 3 resources
[INFO] [compiler:testCompile {execution: default-testCompile}]
[INFO] Compiling 1 source file to <https://builds.apache.org/job/Tuscany-2x-deploy/ws/sca-2x/modules/implementation-python/target/test-classes>
[INFO] [surefire:test {execution: default-test}]
[INFO] Tests are skipped.
[INFO] [jar:jar {execution: default-jar}]
[INFO] Building jar: <https://builds.apache.org/job/Tuscany-2x-deploy/ws/sca-2x/modules/implementation-python/target/tuscany-implementation-python-2.0-SNAPSHOT.jar>
[INFO] [source:jar-no-fork {execution: attach-sources}]
[INFO] Building jar: <https://builds.apache.org/job/Tuscany-2x-deploy/ws/sca-2x/modules/implementation-python/target/tuscany-implementation-python-2.0-SNAPSHOT-sources.jar>
[INFO] [install:install {execution: default-install}]
[INFO] Installing <https://builds.apache.org/job/Tuscany-2x-deploy/ws/sca-2x/modules/implementation-python/target/tuscany-implementation-python-2.0-SNAPSHOT.jar>
to <https://builds.apache.org/job/Tuscany-2x-deploy/ws/.repository/org/apache/tuscany/sca/tuscany-implementation-python/2.0-SNAPSHOT/tuscany-implementation-python-2.0-SNAPSHOT.jar>
[INFO] Installing <https://builds.apache.org/job/Tuscany-2x-deploy/ws/sca-2x/modules/implementation-python/target/tuscany-implementation-python-2.0-SNAPSHOT-sources.jar>
to <https://builds.apache.org/job/Tuscany-2x-deploy/ws/.repository/org/apache/tuscany/sca/tuscany-implementation-python/2.0-SNAPSHOT/tuscany-implementation-python-2.0-SNAPSHOT-sources.jar>
[INFO] [deploy:deploy {execution: default-deploy}]
[INFO] Retrieving previous build number from apache.snapshots.https
[WARNING] *** CHECKSUM FAILED - Checksum failed on download: local = 'd2ec265293f1eea06957701dc2139afed6bb57a8';
remote = 'eb5de86f89e6dbfcfc9adb73d67a02132fe37af2' - RETRYING
[WARNING] *** CHECKSUM FAILED - Checksum failed on download: local = 'd2ec265293f1eea06957701dc2139afed6bb57a8';
remote = 'eb5de86f89e6dbfcfc9adb73d67a02132fe37af2' - IGNORING
Uploading: https://repository.apache.org/content/repositories/snapshots/org/apache/tuscany/sca/tuscany-implementation-python/2.0-SNAPSHOT/tuscany-implementation-python-2.0-SNAPSHOT.jar
22K uploaded  (tuscany-implementation-python-2.0-SNAPSHOT.jar)
[INFO] Retrieving previous metadata from apache.snapshots.https
[WARNING] *** CHECKSUM FAILED - Checksum failed on download: local = 'd2ec265293f1eea06957701dc2139afed6bb57a8';
remote = 'eb5de86f89e6dbfcfc9adb73d67a02132fe37af2' - RETRYING
[WARNING] *** CHECKSUM FAILED - Checksum failed on download: local = 'd2ec265293f1eea06957701dc2139afed6bb57a8';
remote = 'eb5de86f89e6dbfcfc9adb73d67a02132fe37af2' - IGNORING
[INFO] Uploading repository metadata for: 'snapshot org.apache.tuscany.sca:tuscany-implementation-python:2.0-SNAPSHOT'
[INFO] Uploading project information for tuscany-implementation-python 2.0-SNAPSHOT
[INFO] Retrieving previous metadata from apache.snapshots.https
[INFO] Uploading repository metadata for: 'artifact org.apache.tuscany.sca:tuscany-implementation-python'
[INFO] Retrieving previous build number from apache.snapshots.https
Uploading: https://repository.apache.org/content/repositories/snapshots/org/apache/tuscany/sca/tuscany-implementation-python/2.0-SNAPSHOT/tuscany-implementation-python-2.0-SNAPSHOT-sources.jar
17K uploaded  (tuscany-implementation-python-2.0-SNAPSHOT-sources.jar)
[JENKINS] Archiving disabled - not archiving <https://builds.apache.org/job/Tuscany-2x-deploy/ws/sca-2x/modules/implementation-python/pom.xml>
[JENKINS] Archiving disabled - not archiving <https://builds.apache.org/job/Tuscany-2x-deploy/ws/sca-2x/modules/implementation-python/target/tuscany-implementation-python-2.0-SNAPSHOT.jar>
[JENKINS] Archiving disabled - not archiving <https://builds.apache.org/job/Tuscany-2x-deploy/ws/sca-2x/modules/implementation-python/target/tuscany-implementation-python-2.0-SNAPSHOT-sources.jar>
[INFO] ------------------------------------------------------------------------
[INFO] Building Apache Tuscany SCA Base Runtime POM
[INFO]    task-segment: [clean, deploy]
[INFO] ------------------------------------------------------------------------
[INFO] [clean:clean {execution: default-clean}]
[INFO] [enforcer:enforce {execution: enforce-plugin-versions}]
[INFO] [remote-resources:process {execution: default}]
[INFO] [site:attach-descriptor {execution: default-attach-descriptor}]
[INFO] [source:jar-no-fork {execution: attach-sources}]
[INFO] [install:install {execution: default-install}]
[INFO] Installing <https://builds.apache.org/job/Tuscany-2x-deploy/ws/sca-2x/modules/base-runtime-pom/pom.xml>
to <https://builds.apache.org/job/Tuscany-2x-deploy/ws/.repository/org/apache/tuscany/sca/tuscany-base-runtime-pom/2.0-SNAPSHOT/tuscany-base-runtime-pom-2.0-SNAPSHOT.pom>
[INFO] [deploy:deploy {execution: default-deploy}]
[INFO] Retrieving previous build number from apache.snapshots.https
[WARNING] *** CHECKSUM FAILED - Checksum failed on download: local = 'f004207be820baaa3a82e01dfd8b64e5be14bf9e';
remote = '508db868fb64b024ce6c2706978b6408171ccb94' - RETRYING
[WARNING] *** CHECKSUM FAILED - Checksum failed on download: local = 'f004207be820baaa3a82e01dfd8b64e5be14bf9e';
remote = '508db868fb64b024ce6c2706978b6408171ccb94' - IGNORING
Uploading: https://repository.apache.org/content/repositories/snapshots/org/apache/tuscany/sca/tuscany-base-runtime-pom/2.0-SNAPSHOT/tuscany-base-runtime-pom-2.0-SNAPSHOT.pom
8K uploaded  (tuscany-base-runtime-pom-2.0-SNAPSHOT.pom)
[INFO] Retrieving previous metadata from apache.snapshots.https
[INFO] Uploading repository metadata for: 'artifact org.apache.tuscany.sca:tuscany-base-runtime-pom'
[INFO] Retrieving previous metadata from apache.snapshots.https
[WARNING] *** CHECKSUM FAILED - Checksum failed on download: local = 'f004207be820baaa3a82e01dfd8b64e5be14bf9e';
remote = '508db868fb64b024ce6c2706978b6408171ccb94' - RETRYING
[WARNING] *** CHECKSUM FAILED - Checksum failed on download: local = 'f004207be820baaa3a82e01dfd8b64e5be14bf9e';
remote = '508db868fb64b024ce6c2706978b6408171ccb94' - IGNORING
[INFO] Uploading repository metadata for: 'snapshot org.apache.tuscany.sca:tuscany-base-runtime-pom:2.0-SNAPSHOT'
[JENKINS] Archiving disabled - not archiving <https://builds.apache.org/job/Tuscany-2x-deploy/ws/sca-2x/modules/base-runtime-pom/pom.xml>
[JENKINS] Archiving disabled - not archiving <https://builds.apache.org/job/Tuscany-2x-deploy/ws/.repository/org/apache/tuscany/sca/tuscany-base-runtime-pom/2.0-SNAPSHOT/tuscany-base-runtime-pom-2.0-SNAPSHOT.pom>
[INFO] ------------------------------------------------------------------------
[INFO] Building Apache Tuscany SCA Comet Binding Runtime
[INFO]    task-segment: [clean, deploy]
[INFO] ------------------------------------------------------------------------
[INFO] [clean:clean {execution: default-clean}]
Downloading: http://svn.apache.org/repos/asf/tuscany/maven/com/google/code/gson/gson/1.4/gson-1.4.pom
[INFO] Unable to find resource 'com.google.code.gson:gson:pom:1.4' in repository tuscany.repo
(http://svn.apache.org/repos/asf/tuscany/maven)
Downloading: http://repo1.maven.org/maven2/com/google/code/gson/gson/1.4/gson-1.4.pom

Downloading: http://svn.apache.org/repos/asf/tuscany/maven/org/apache/geronimo/specs/geronimo-servlet_3.0_spec/1.0/geronimo-servlet_3.0_spec-1.0.pom
[INFO] Unable to find resource 'org.apache.geronimo.specs:geronimo-servlet_3.0_spec:pom:1.0'
in repository tuscany.repo (http://svn.apache.org/repos/asf/tuscany/maven)
Downloading: http://repo1.maven.org/maven2/org/apache/geronimo/specs/geronimo-servlet_3.0_spec/1.0/geronimo-servlet_3.0_spec-1.0.pom

Downloading: http://svn.apache.org/repos/asf/tuscany/maven/org/mortbay/jetty/servlet-api/2.5-20081211/servlet-api-2.5-20081211.pom
[INFO] Unable to find resource 'org.mortbay.jetty:servlet-api:pom:2.5-20081211' in repository
tuscany.repo (http://svn.apache.org/repos/asf/tuscany/maven)
Downloading: http://repo1.maven.org/maven2/org/mortbay/jetty/servlet-api/2.5-20081211/servlet-api-2.5-20081211.pom

Downloading: http://svn.apache.org/repos/asf/tuscany/maven/org/mortbay/jetty/jetty-parent/7/jetty-parent-7.pom
[INFO] Unable to find resource 'org.mortbay.jetty:jetty-parent:pom:7' in repository tuscany.repo
(http://svn.apache.org/repos/asf/tuscany/maven)
Downloading: http://repo1.maven.org/maven2/org/mortbay/jetty/jetty-parent/7/jetty-parent-7.pom

Downloading: http://svn.apache.org/repos/asf/tuscany/maven/org/atmosphere/atmosphere-jersey/0.7.2/atmosphere-jersey-0.7.2.pom
[INFO] Unable to find resource 'org.atmosphere:atmosphere-jersey:pom:0.7.2' in repository
tuscany.repo (http://svn.apache.org/repos/asf/tuscany/maven)
Downloading: http://repo1.maven.org/maven2/org/atmosphere/atmosphere-jersey/0.7.2/atmosphere-jersey-0.7.2.pom

Downloading: http://svn.apache.org/repos/asf/tuscany/maven/org/atmosphere/atmosphere-project/0.7.2/atmosphere-project-0.7.2.pom
[INFO] Unable to find resource 'org.atmosphere:atmosphere-project:pom:0.7.2' in repository
tuscany.repo (http://svn.apache.org/repos/asf/tuscany/maven)
Downloading: http://repo1.maven.org/maven2/org/atmosphere/atmosphere-project/0.7.2/atmosphere-project-0.7.2.pom

Downloading: http://oss.sonatype.org/content/repositories/releases/org/sonatype/oss/oss-parent/5/oss-parent-5.pom
[INFO] Unable to find resource 'org.sonatype.oss:oss-parent:pom:5' in repository oss.sonatype.org
(http://oss.sonatype.org/content/repositories/releases)
Downloading: http://oss.sonatype.org/content/repositories/snapshots/org/sonatype/oss/oss-parent/5/oss-parent-5.pom
[INFO] Unable to find resource 'org.sonatype.oss:oss-parent:pom:5' in repository oss.sonatype.org-snapshot
(http://oss.sonatype.org/content/repositories/snapshots)
Downloading: http://scala-tools.org/repo-releases/org/sonatype/oss/oss-parent/5/oss-parent-5.pom
[INFO] Unable to find resource 'org.sonatype.oss:oss-parent:pom:5' in repository scala-tools.org
(http://scala-tools.org/repo-releases)
Downloading: https://repository.jboss.org/nexus/content/groups/public//org/sonatype/oss/oss-parent/5/oss-parent-5.pom
[INFO] Unable to find resource 'org.sonatype.oss:oss-parent:pom:5' in repository jboss (https://repository.jboss.org/nexus/content/groups/public/)
Downloading: http://repository.codehaus.org/org/sonatype/oss/oss-parent/5/oss-parent-5.pom
[INFO] Unable to find resource 'org.sonatype.oss:oss-parent:pom:5' in repository codehaus
(http://repository.codehaus.org)
Downloading: http://download.java.net/maven/2//org/sonatype/oss/oss-parent/5/oss-parent-5.pom
[INFO] Unable to find resource 'org.sonatype.oss:oss-parent:pom:5' in repository maven2-repository.dev.java.net
(http://download.java.net/maven/2/)
Downloading: http://download.java.net/maven/glassfish//org/sonatype/oss/oss-parent/5/oss-parent-5.pom
[INFO] Unable to find resource 'org.sonatype.oss:oss-parent:pom:5' in repository glassfish
maven2-repository.dev.java.net (http://download.java.net/maven/glassfish/)
Downloading: http://svn.apache.org/repos/asf/tuscany/maven/org/sonatype/oss/oss-parent/5/oss-parent-5.pom
[INFO] Unable to find resource 'org.sonatype.oss:oss-parent:pom:5' in repository tuscany.repo
(http://svn.apache.org/repos/asf/tuscany/maven)
Downloading: http://repo1.maven.org/maven2/org/sonatype/oss/oss-parent/5/oss-parent-5.pom

Downloading: http://svn.apache.org/repos/asf/tuscany/maven/org/atmosphere/atmosphere-annotations/0.7.2/atmosphere-annotations-0.7.2.pom
[INFO] Unable to find resource 'org.atmosphere:atmosphere-annotations:pom:0.7.2' in repository
tuscany.repo (http://svn.apache.org/repos/asf/tuscany/maven)
Downloading: http://oss.sonatype.org/content/repositories/releases/org/atmosphere/atmosphere-annotations/0.7.2/atmosphere-annotations-0.7.2.pom

Downloading: http://svn.apache.org/repos/asf/tuscany/maven/org/atmosphere/atmosphere-runtime/0.7.2/atmosphere-runtime-0.7.2.pom
[INFO] Unable to find resource 'org.atmosphere:atmosphere-runtime:pom:0.7.2' in repository
tuscany.repo (http://svn.apache.org/repos/asf/tuscany/maven)
Downloading: http://oss.sonatype.org/content/repositories/releases/org/atmosphere/atmosphere-runtime/0.7.2/atmosphere-runtime-0.7.2.pom

Downloading: http://svn.apache.org/repos/asf/tuscany/maven/org/atmosphere/atmosphere-ping/0.7.2/atmosphere-ping-0.7.2.pom
[INFO] Unable to find resource 'org.atmosphere:atmosphere-ping:pom:0.7.2' in repository tuscany.repo
(http://svn.apache.org/repos/asf/tuscany/maven)
Downloading: http://oss.sonatype.org/content/repositories/releases/org/atmosphere/atmosphere-ping/0.7.2/atmosphere-ping-0.7.2.pom

Downloading: http://svn.apache.org/repos/asf/tuscany/maven/org/slf4j/slf4j-api/1.6.1/slf4j-api-1.6.1.pom
[INFO] Unable to find resource 'org.slf4j:slf4j-api:pom:1.6.1' in repository tuscany.repo
(http://svn.apache.org/repos/asf/tuscany/maven)
Downloading: http://oss.sonatype.org/content/repositories/releases/org/slf4j/slf4j-api/1.6.1/slf4j-api-1.6.1.pom
[INFO] Unable to find resource 'org.slf4j:slf4j-api:pom:1.6.1' in repository oss.sonatype.org
(http://oss.sonatype.org/content/repositories/releases)
Downloading: http://oss.sonatype.org/content/repositories/snapshots/org/slf4j/slf4j-api/1.6.1/slf4j-api-1.6.1.pom
[INFO] Unable to find resource 'org.slf4j:slf4j-api:pom:1.6.1' in repository oss.sonatype.org-snapshot
(http://oss.sonatype.org/content/repositories/snapshots)
Downloading: http://scala-tools.org/repo-releases/org/slf4j/slf4j-api/1.6.1/slf4j-api-1.6.1.pom
[INFO] Unable to find resource 'org.slf4j:slf4j-api:pom:1.6.1' in repository scala-tools.org
(http://scala-tools.org/repo-releases)
Downloading: https://repository.jboss.org/nexus/content/groups/public//org/slf4j/slf4j-api/1.6.1/slf4j-api-1.6.1.pom
[INFO] Unable to find resource 'org.slf4j:slf4j-api:pom:1.6.1' in repository jboss (https://repository.jboss.org/nexus/content/groups/public/)
Downloading: http://repository.codehaus.org/org/slf4j/slf4j-api/1.6.1/slf4j-api-1.6.1.pom
[INFO] Unable to find resource 'org.slf4j:slf4j-api:pom:1.6.1' in repository codehaus (http://repository.codehaus.org)
Downloading: http://download.java.net/maven/2//org/slf4j/slf4j-api/1.6.1/slf4j-api-1.6.1.pom
[INFO] Unable to find resource 'org.slf4j:slf4j-api:pom:1.6.1' in repository maven2-repository.dev.java.net
(http://download.java.net/maven/2/)
Downloading: http://download.java.net/maven/glassfish//org/slf4j/slf4j-api/1.6.1/slf4j-api-1.6.1.pom
[INFO] Unable to find resource 'org.slf4j:slf4j-api:pom:1.6.1' in repository glassfish maven2-repository.dev.java.net
(http://download.java.net/maven/glassfish/)
Downloading: http://repo1.maven.org/maven2/org/slf4j/slf4j-api/1.6.1/slf4j-api-1.6.1.pom

Downloading: http://svn.apache.org/repos/asf/tuscany/maven/org/slf4j/slf4j-parent/1.6.1/slf4j-parent-1.6.1.pom
[INFO] Unable to find resource 'org.slf4j:slf4j-parent:pom:1.6.1' in repository tuscany.repo
(http://svn.apache.org/repos/asf/tuscany/maven)
Downloading: http://oss.sonatype.org/content/repositories/releases/org/slf4j/slf4j-parent/1.6.1/slf4j-parent-1.6.1.pom
[INFO] Unable to find resource 'org.slf4j:slf4j-parent:pom:1.6.1' in repository oss.sonatype.org
(http://oss.sonatype.org/content/repositories/releases)
Downloading: http://oss.sonatype.org/content/repositories/snapshots/org/slf4j/slf4j-parent/1.6.1/slf4j-parent-1.6.1.pom
[INFO] Unable to find resource 'org.slf4j:slf4j-parent:pom:1.6.1' in repository oss.sonatype.org-snapshot
(http://oss.sonatype.org/content/repositories/snapshots)
Downloading: http://scala-tools.org/repo-releases/org/slf4j/slf4j-parent/1.6.1/slf4j-parent-1.6.1.pom
[INFO] Unable to find resource 'org.slf4j:slf4j-parent:pom:1.6.1' in repository scala-tools.org
(http://scala-tools.org/repo-releases)
Downloading: https://repository.jboss.org/nexus/content/groups/public//org/slf4j/slf4j-parent/1.6.1/slf4j-parent-1.6.1.pom
[INFO] Unable to find resource 'org.slf4j:slf4j-parent:pom:1.6.1' in repository jboss (https://repository.jboss.org/nexus/content/groups/public/)
Downloading: http://repository.codehaus.org/org/slf4j/slf4j-parent/1.6.1/slf4j-parent-1.6.1.pom
[INFO] Unable to find resource 'org.slf4j:slf4j-parent:pom:1.6.1' in repository codehaus (http://repository.codehaus.org)
Downloading: http://download.java.net/maven/2//org/slf4j/slf4j-parent/1.6.1/slf4j-parent-1.6.1.pom
[INFO] Unable to find resource 'org.slf4j:slf4j-parent:pom:1.6.1' in repository maven2-repository.dev.java.net
(http://download.java.net/maven/2/)
Downloading: http://download.java.net/maven/glassfish//org/slf4j/slf4j-parent/1.6.1/slf4j-parent-1.6.1.pom
[INFO] Unable to find resource 'org.slf4j:slf4j-parent:pom:1.6.1' in repository glassfish
maven2-repository.dev.java.net (http://download.java.net/maven/glassfish/)
Downloading: http://repo1.maven.org/maven2/org/slf4j/slf4j-parent/1.6.1/slf4j-parent-1.6.1.pom

Downloading: http://svn.apache.org/repos/asf/tuscany/maven/org/atmosphere/atmosphere-compat-jbossweb/0.7.2/atmosphere-compat-jbossweb-0.7.2.pom
[INFO] Unable to find resource 'org.atmosphere:atmosphere-compat-jbossweb:pom:0.7.2' in repository
tuscany.repo (http://svn.apache.org/repos/asf/tuscany/maven)
Downloading: http://oss.sonatype.org/content/repositories/releases/org/atmosphere/atmosphere-compat-jbossweb/0.7.2/atmosphere-compat-jbossweb-0.7.2.pom

Downloading: http://svn.apache.org/repos/asf/tuscany/maven/org/atmosphere/atmosphere-compat-tomcat/0.7.2/atmosphere-compat-tomcat-0.7.2.pom
[INFO] Unable to find resource 'org.atmosphere:atmosphere-compat-tomcat:pom:0.7.2' in repository
tuscany.repo (http://svn.apache.org/repos/asf/tuscany/maven)
Downloading: http://oss.sonatype.org/content/repositories/releases/org/atmosphere/atmosphere-compat-tomcat/0.7.2/atmosphere-compat-tomcat-0.7.2.pom

Downloading: http://svn.apache.org/repos/asf/tuscany/maven/org/atmosphere/atmosphere-compat-weblogic/0.7.2/atmosphere-compat-weblogic-0.7.2.pom
[INFO] Unable to find resource 'org.atmosphere:atmosphere-compat-weblogic:pom:0.7.2' in repository
tuscany.repo (http://svn.apache.org/repos/asf/tuscany/maven)
Downloading: http://oss.sonatype.org/content/repositories/releases/org/atmosphere/atmosphere-compat-weblogic/0.7.2/atmosphere-compat-weblogic-0.7.2.pom

Downloading: http://svn.apache.org/repos/asf/tuscany/maven/com/sun/jersey/jersey-server/1.6/jersey-server-1.6.pom
[INFO] Unable to find resource 'com.sun.jersey:jersey-server:pom:1.6' in repository tuscany.repo
(http://svn.apache.org/repos/asf/tuscany/maven)
Downloading: http://oss.sonatype.org/content/repositories/releases/com/sun/jersey/jersey-server/1.6/jersey-server-1.6.pom
[INFO] Unable to find resource 'com.sun.jersey:jersey-server:pom:1.6' in repository oss.sonatype.org
(http://oss.sonatype.org/content/repositories/releases)
Downloading: http://oss.sonatype.org/content/repositories/snapshots/com/sun/jersey/jersey-server/1.6/jersey-server-1.6.pom
[INFO] Unable to find resource 'com.sun.jersey:jersey-server:pom:1.6' in repository oss.sonatype.org-snapshot
(http://oss.sonatype.org/content/repositories/snapshots)
Downloading: http://scala-tools.org/repo-releases/com/sun/jersey/jersey-server/1.6/jersey-server-1.6.pom
[INFO] Unable to find resource 'com.sun.jersey:jersey-server:pom:1.6' in repository scala-tools.org
(http://scala-tools.org/repo-releases)
Downloading: https://repository.jboss.org/nexus/content/groups/public//com/sun/jersey/jersey-server/1.6/jersey-server-1.6.pom
[INFO] Unable to find resource 'com.sun.jersey:jersey-server:pom:1.6' in repository jboss
(https://repository.jboss.org/nexus/content/groups/public/)
Downloading: http://repository.codehaus.org/com/sun/jersey/jersey-server/1.6/jersey-server-1.6.pom
[INFO] Unable to find resource 'com.sun.jersey:jersey-server:pom:1.6' in repository codehaus
(http://repository.codehaus.org)
Downloading: http://download.java.net/maven/2//com/sun/jersey/jersey-server/1.6/jersey-server-1.6.pom
11K downloaded  (jersey-server-1.6.pom)
Downloading: http://maven.glassfish.org/content/groups/glassfish/com/sun/jersey/jersey-project/1.6/jersey-project-1.6.pom
185b downloaded  (jersey-project-1.6.pom)
[WARNING] *** CHECKSUM FAILED - Checksum failed on download: local = '6c9fd3d150b8a5f0ca676f49b8ed603793cabebb';
remote = '<html>
<head><title>301' - RETRYING
Downloading: http://maven.glassfish.org/content/groups/glassfish/com/sun/jersey/jersey-project/1.6/jersey-project-1.6.pom
185b downloaded  (jersey-project-1.6.pom)
[WARNING] *** CHECKSUM FAILED - Checksum failed on download: local = '6c9fd3d150b8a5f0ca676f49b8ed603793cabebb';
remote = '<html>
<head><title>301' - IGNORING
[JENKINS] Archiving disabled - not archiving <https://builds.apache.org/job/Tuscany-2x-deploy/ws/sca-2x/modules/binding-comet-runtime/pom.xml>
[INFO] ------------------------------------------------------------------------
[ERROR] BUILD ERROR
[INFO] ------------------------------------------------------------------------
[INFO] Error building POM (may not be this project's POM).


Project ID: null:jersey-server:bundle:null

Reason: Cannot find parent: com.sun.jersey:jersey-project for project: null:jersey-server:bundle:null
for project null:jersey-server:bundle:null


[INFO] ------------------------------------------------------------------------
[INFO] For more information, run Maven with the -e switch
[INFO] ------------------------------------------------------------------------
[INFO] Total time: 43 minutes 45 seconds
[INFO] Finished at: Fri Apr 13 01:05:52 GMT+00:00 2012
[INFO] Final Memory: 177M/708M
[INFO] ------------------------------------------------------------------------
channel stopped

Mime
View raw message