tuscany-commits mailing list archives

Site index · List index
Message view « Date » · « Thread »
Top « Date » · « Thread »
From Apache Jenkins Server <jenk...@builds.apache.org>
Subject Build failed in Jenkins: Tuscany-2x-deploy #610
Date Mon, 02 Jan 2012 01:23:29 GMT
See <https://builds.apache.org/job/Tuscany-2x-deploy/610/>

------------------------------------------
[...truncated 9183 lines...]
[INFO] --- maven-enforcer-plugin:1.0:enforce (enforce-plugin-versions) @ helloworld-webapp
---
[INFO] 
[INFO] --- maven-remote-resources-plugin:1.1:process (default) @ helloworld-webapp ---
[INFO] [INFO] Using 'UTF-8' encoding to copy filtered resources.
[INFO] skip non existing resourceDirectory <https://builds.apache.org/job/Tuscany-2x-deploy/ws/sca-2x/samples/getting-started/helloworld-webapp/src/main/resources>
[INFO] Copying 1 resource
[INFO] Copying 3 resources
[INFO] Copying 3 resources

[INFO] --- maven-resources-plugin:2.4.2:resources (default-resources) @ helloworld-webapp
---
[INFO] [INFO] Nothing to compile - all classes are up to date

[INFO] --- maven-compiler-plugin:2.2:compile (default-compile) @ helloworld-webapp ---
[INFO] [INFO] Configured Artifact: org.apache.tuscany.sca.samples:helloworld:2.0-SNAPSHOT:jar
[INFO] org.apache.tuscany.sca.samples:helloworld:2.0-SNAPSHOT:jar already exists in <https://builds.apache.org/job/Tuscany-2x-deploy/ws/sca-2x/samples/getting-started/helloworld-webapp/src/main/webapp/WEB-INF/sca-contributions>

[INFO] --- maven-dependency-plugin:2.1:copy (copy) @ helloworld-webapp ---
[INFO] [INFO] Using 'UTF-8' encoding to copy filtered resources.
[INFO] Copying 1 resource
[INFO] Copying 3 resources
[INFO] Copying 3 resources

[INFO] --- maven-resources-plugin:2.4.2:testResources (default-testResources) @ helloworld-webapp
---
[INFO] [INFO] Nothing to compile - all classes are up to date

[INFO] --- maven-compiler-plugin:2.2:testCompile (default-testCompile) @ helloworld-webapp
---
[JENKINS] Archiving disabled - not archiving <https://builds.apache.org/job/Tuscany-2x-deploy/ws/sca-2x/samples/getting-started/helloworld-webapp/pom.xml>
[JENKINS] Archiving disabled - not archiving <https://builds.apache.org/job/Tuscany-2x-deploy/ws/sca-2x/samples/getting-started/helloworld-webapp/pom.xml>
[INFO] ------------------------------------------------------------------------
[INFO] Reactor Summary:
[INFO] 
[INFO] Apache Tuscany SCA Implementation Project (2.x) ... SUCCESS [53.261s]
[INFO] Apache Tuscany SCA Implementation Modules ......... SUCCESS [5.677s]
[INFO] Apache Tuscany SCA Monitor ........................ SUCCESS [5.547s]
[INFO] Apache Tuscany SCA Extensibility .................. SUCCESS [5.299s]
[INFO] Apache Tuscany SCA Assembly Model ................. SUCCESS [5.230s]
[INFO] Apache Tuscany SCA Assembly Model XSD Files ....... SUCCESS [4.052s]
[INFO] Apache Tuscany SCA Common XML ..................... SUCCESS [5.930s]
[INFO] Apache Tuscany SCA API ............................ SUCCESS [5.284s]
[INFO] Apache Tuscany SCA Common Java .................... SUCCESS [4.754s]
[INFO] Apache Tuscany SCA Contribution Model ............. SUCCESS [5.854s]
[INFO] Apache Tuscany SCA Node API ....................... SUCCESS [4.166s]
[INFO] Apache Tuscany SCA Core SPI ....................... SUCCESS [8.035s]
[INFO] Apache Tuscany SCA XSD Model ...................... SUCCESS [4.417s]
[INFO] Apache Tuscany SCA Assembly XML Model ............. SUCCESS [5.519s]
[INFO] Apache Tuscany SCA WSDL Interface Model ........... SUCCESS [5.423s]
[INFO] Apache Tuscany SCA Interface Java Model ........... SUCCESS [4.801s]
[INFO] Apache Tuscany SCA Core Runtime ................... SUCCESS [5.400s]
[INFO] Apache Tuscany SCA DataBinding Framework .......... SUCCESS [5.411s]
[INFO] Apache Tuscany SCA DataBinding for JAXB ........... SUCCESS [7.150s]
[INFO] Apache Tuscany SCA Model Builders ................. SUCCESS [5.125s]
[INFO] Apache Tuscany SCA Deployment ..................... SUCCESS [4.899s]
[INFO] Apache Tuscany SCA WS Binding Model ............... SUCCESS [4.514s]
[INFO] Apache Tuscany SCA Interface Java For JAXWS ....... SUCCESS [9.075s]
[INFO] Apache Tuscany SCA Core/DataBinding Integration ... SUCCESS [4.372s]
[INFO] Apache Tuscany SCA Web Service binding WSDL Generator  SUCCESS [4.738s]
[INFO] Apache Tuscany SCA Binding SCA Runtime ............ SUCCESS [4.921s]
[INFO] Apache Tuscany SCA Implementation Java Model ...... SUCCESS [5.505s]
[INFO] Apache Tuscany SCA Implementation Java Runtime .... SUCCESS [4.813s]
[INFO] Apache Tuscany SCA Node Implementation ............ SUCCESS [5.058s]
[INFO] Apache Tuscany SCA Data API ....................... SUCCESS [3.876s]
[INFO] Apache Tuscany SCA Domain Node .................... SUCCESS [5.024s]
[INFO] Apache Tuscany SCA Web Implementation Model ....... SUCCESS [4.464s]
[INFO] Apache Tuscany SCA HTTP Servlet Host Extension Point  SUCCESS [3.956s]
[INFO] Apache Tuscany SCA Webapp Host .................... SUCCESS [4.400s]
[INFO] Apache Tuscany SCA Web Implementation Runtime ..... SUCCESS [4.423s]
[INFO] Apache Tuscany SCA Launcher ....................... SUCCESS [4.110s]
[INFO] Apache Tuscany SCA Client Impl .................... SUCCESS [5.391s]
[INFO] Apache Tuscany SCA Jetty Servlet Host Extension ... SUCCESS [4.328s]
[INFO] Apache Tuscany SCA Shell .......................... SUCCESS [4.347s]
[INFO] Apache Tuscany SCA Stripes Web Framework Integration  SUCCESS [4.341s]
[INFO] Apache Tuscany SCA Apache Wink JAX-RS Integration . SUCCESS [4.368s]
[INFO] Apache Tuscany SCA JAXWS-based WS Binding Extension  SUCCESS [4.187s]
[INFO] Apache Tuscany SCA JAXWS RI based WS Binding Extension  SUCCESS [4.461s]
[INFO] Apache Tuscany SCA Common HTTP .................... SUCCESS [3.839s]
[INFO] Apache Tuscany SCA Core Runtime POM ............... SUCCESS [3.289s]
[INFO] Apache Tuscany SCA Policy Security Model .......... SUCCESS [5.571s]
[INFO] Apache Tuscany SCA Atom Feed Binding Extension .... SUCCESS [4.076s]
[INFO] Apache Tuscany SCA Comet Binding Model ............ SUCCESS [3.464s]
[INFO] Apache Tuscany SCA CORBA Host Extension Point ..... SUCCESS [4.836s]
[INFO] Apache Tuscany SCA CORBA Binding Extension ........ SUCCESS [4.512s]
[INFO] Apache Tuscany SCA EJB Binding Model .............. SUCCESS [3.621s]
[INFO] Apache Tuscany SCA HTTP Binding Model ............. SUCCESS [4.539s]
[INFO] Apache Tuscany SCA JMS Binding Model .............. SUCCESS [4.662s]
[INFO] Apache Tuscany SCA JSONP Binding Model ............ SUCCESS [5.963s]
[INFO] Apache Tuscany SCA JSON-RPC Binding Model ......... SUCCESS [3.571s]
[INFO] Apache Tuscany SCA REST Binding Model ............. SUCCESS [4.584s]
[INFO] Apache Tuscany SCA RMI Binding Model .............. SUCCESS [4.101s]
[INFO] Apache Tuscany SCA BPEL Implementation Extension .. SUCCESS [4.893s]
[INFO] Apache Tuscany SCA Script Implementation Model .... SUCCESS [3.687s]
[INFO] Apache Tuscany SCA Spring Implementation Model .... SUCCESS [3.967s]
[INFO] Apache Tuscany SCA Widget Implementation Model .... SUCCESS [3.672s]
[INFO] Apache Tuscany SCA Base Runtime Jar ............... SUCCESS [9.981s]
[INFO] Apache Tuscany SCA EndPoint Registry using Hazelcast  SUCCESS [4.745s]
[INFO] Apache Tuscany Maven Tuscany Plugin ............... SUCCESS [4.993s]
[INFO] Create an SCA JAR contribution project ............ SUCCESS [3.528s]
[INFO] Create an SCA ZIP contribution project ............ SUCCESS [3.183s]
[INFO] Tuscany SCA ZIP contribution Shared Assembly Descriptor  SUCCESS [3.050s]
[INFO] Create a simple Apache Tuscany SCA webapp project . SUCCESS [3.825s]
[INFO] Create a Tuscany SCA and JSF project .............. SUCCESS [4.556s]
[INFO] Create a simple Apache Tuscany SCA webapp project using the Stripes Web Framework 
SUCCESS [4.254s]
[INFO] Create an SCA Webapp project using BPEL ........... SUCCESS [3.107s]
[INFO] Create a Tuscany binding extension project ........ SUCCESS [3.644s]
[INFO] Apache Tuscany SCA Maven Archetypes ............... SUCCESS [1.661s]
[INFO] Apache Tuscany SCA Web JavaScript ................. SUCCESS [3.548s]
[INFO] Apache Tuscany SCA Abdera Atom Feed Binding Extension  SUCCESS [6.457s]
[INFO] Apache Tuscany SCA JAX-RS Implementation Model .... SUCCESS [4.123s]
[INFO] Apache Tuscany SCA Python Implementation Model .... SUCCESS [4.464s]
[INFO] Apache Tuscany SCA Base Runtime POM ............... SUCCESS [2.091s]
[INFO] Apache Tuscany SCA Comet Binding Runtime .......... SUCCESS [6.472s]
[INFO] Apache Tuscany SCA EJB Binding Runtime ............ SUCCESS [5.640s]
[INFO] Apache Tuscany SCA Data Binding for JSON .......... SUCCESS [4.989s]
[INFO] Apache Tuscany SCA HTTP Binding Runtime ........... SUCCESS [4.822s]
[INFO] Apache Tuscany SCA JMS Binding Runtime ............ SUCCESS [5.278s]
[INFO] Apache Tuscany SCA JMS Binding Runtime AcytiveMQ .. SUCCESS [4.405s]
[INFO] Apache Tuscany SCA JSONP Binding Runtime .......... SUCCESS [4.343s]
[INFO] Apache Tuscany SCA JSON-RPC Binding Runtime ....... SUCCESS [4.550s]
[INFO] Apache Tuscany SCA Interface Java For JAX_RS ...... SUCCESS [4.652s]
[INFO] Apache Tuscany SCA REST Binding Runtime ........... SUCCESS [5.537s]
[INFO] Apache Tuscany SCA RMI Host Extension Point ....... SUCCESS [4.201s]
[INFO] Apache Tuscany SCA RMI Binding Extension .......... SUCCESS [4.623s]
[INFO] Apache Tuscany SCA Websocket Binding Extension .... SUCCESS [5.339s]
[INFO] Apache Tuscany SCA Policy WS-Policy Model ......... SUCCESS [4.854s]
[INFO] Apache Tuscany SCA Data Binding for Axiom ......... SUCCESS [5.539s]
[INFO] Apache Tuscany SCA Data Binding for JAXB-AXIOM .... SUCCESS [4.869s]
[INFO] Apache Tuscany SCA Axis2-1.5-based WS Binding Runtime  SUCCESS [5.981s]
[INFO] Apache Tuscany SCA Resource Import/Export Model ... SUCCESS [4.657s]
[INFO] Apache Tuscany SCA Data Binding for SDO ........... SUCCESS [7.253s]
[INFO] Apache Tuscany SCA Data Binding for SDO/AXIOM ..... SUCCESS [5.603s]
[INFO] Apache Tuscany SCA Tomcat Tribes Based EndPoint Registry  SUCCESS [5.474s]
[INFO] Apache Tuscany SCA Extensibility for Eclipse Equinox  SUCCESS [5.466s]
[INFO] Apache Tuscany SCA Node Equinox OSGi Launcher ..... SUCCESS [7.914s]
[INFO] Apache Tuscany SCA OSGi HTTP Service Based Servlet Host Extension  SUCCESS [4.625s]
[INFO] Apache Tuscany SCA BPEL ODE Implementation Extension  SUCCESS [8.547s]
[INFO] Apache Tuscany SCA JAX-RS Implementation Runtime .. SUCCESS [5.001s]
[INFO] Apache Tuscany SCA Python Implementation Extension  SUCCESS [4.974s]
[INFO] Apache Tuscany SCA Script Implementation Extension  SUCCESS [5.307s]
[INFO] Apache Tuscany SCA Spring Implementation Runtime Model  SUCCESS [4.707s]
[INFO] Apache Tuscany SCA Spring Implementation WebApp Integration  SUCCESS [4.871s]
[INFO] Apache Tuscany SCA Spring Implementation Runtime Stub  SUCCESS [6.068s]
[INFO] Apache Tuscany SCA Spring Implementation Runtime Tie  SUCCESS [4.012s]
[INFO] Apache Tuscany SCA Web Implementation Client ...... SUCCESS [4.062s]
[INFO] Apache Tuscany SCA Widget Implementation Runtime .. SUCCESS [3.656s]
[INFO] Apache Tuscany SCA Web JavaScript for DOJO ........ SUCCESS [18.944s]
[INFO] Apache Tuscany SCA Widget Implementation Runtime (Dojo)  SUCCESS [3.757s]
[INFO] Apache Tuscany SCA MyFaces JSF Integration ........ SUCCESS [4.147s]
[INFO] Apache Tuscany SCA Node Launcher .................. SUCCESS [4.487s]
[INFO] Apache Tuscany SCA Node Manager ................... SUCCESS [4.534s]
[INFO] Apache Tuscany SCA Extension Policy Logging Model . SUCCESS [3.998s]
[INFO] Apache Tuscany SCA Java JSR250 Implementation ..... SUCCESS [4.539s]
[INFO] Apache Tuscany SCA Transaction Policy Model ....... SUCCESS [4.391s]
[INFO] Apache Tuscany SCA Transaction Policy Runtime ..... SUCCESS [5.353s]
[INFO] Apache Tuscany SCA Transaction Policy Runtime (Geronimo)  SUCCESS [7.060s]
[INFO] Apache Tuscany SCA AOP-based Logging and Tracing .. SUCCESS [4.566s]
[INFO] Apache Tuscany SCA Contribution OSGi Bundle ....... SUCCESS [3.806s]
[INFO] Apache Tuscany SCA OSGi Implementation Extension .. SUCCESS [5.302s]
[INFO] Apache Tuscany SCA OSGi Implementation Extension Runtime  SUCCESS [4.266s]
[INFO] Apache Tuscany SCA OSGi Node Implementation ....... SUCCESS [4.905s]
[INFO] Apache Tuscany SCA JSE built-in CORBA Host ........ SUCCESS [4.025s]
[INFO] Apache Tuscany SCA JEE environment CORBA Host ..... SUCCESS [4.227s]
[INFO] Apache Tuscany SCA CORBA Binding Runtime .......... SUCCESS [4.873s]
[INFO] Apache Tuscany SCA Transient Name Server CORBA Host  SUCCESS [4.186s]
[INFO] Apache Tuscany SCA Composite Diagram Generator Application  SUCCESS [6.049s]
[INFO] Apache Tuscany SCA OSGi Runtime POM ............... SUCCESS [1.930s]
[INFO] Apache Tuscany SCA Samples ........................ SUCCESS [1.366s]
[INFO] Apache Tuscany SCA Samples Helloworld ............. SUCCESS [3.160s]
[INFO] Apache Tuscany SCA Samples Helloworld JAX-RS ...... SUCCESS [3.716s]
[INFO] Apache Tuscany SCA Samples Helloworld JSONP ....... SUCCESS [3.788s]
[INFO] Apache Tuscany SCA Samples Helloworld JSON-RPC .... SUCCESS [3.135s]
[INFO] Apache Tuscany SCA Samples Helloworld SCAClient ... SUCCESS [3.541s]
[INFO] Apache Tuscany SCA Samples Helloworld Spring ...... SUCCESS [3.169s]
[INFO] Apache Tuscany SCA Samples Helloworld WebApp ...... FAILURE [3.850s]
[INFO] Apache Tuscany SCA Samples Helloworld Web Service . SKIPPED
[INFO] Apache Tuscany SCA Samples Helloworld With Dependencies  SKIPPED
[INFO] Apache Tuscany SCA Samples Getting Started ........ SKIPPED
[INFO] Apache Tuscany SCA Samples Running Tuscany ........ SKIPPED
[INFO] Apache Tuscany SCA Samples JSE .................... SKIPPED
[INFO] Apache Tuscany SCA Samples JUnit .................. SKIPPED
[INFO] Apache Tuscany SCA Sample Async Invocation ........ SKIPPED
[INFO] Apache Tuscany SCA Sample Learning More ........... SKIPPED
[INFO] Apache Tuscany SCA Sample binding.comet ........... SKIPPED
[INFO] Apache Tuscany SCA Sample binding.comet Real-Time Suggestions Webapp  SKIPPED
[INFO] Apache Tuscany SCA Sample binding.comet Weather Monitor Webapp  SKIPPED
[INFO] Apache Tuscany SCA Sample binding.comet PubSub Webapp  SKIPPED
[INFO] Apache Tuscany SCA Sample binding.comet Chat Webapp  SKIPPED
[INFO] Apache Tuscany SCA Sample binding.websocket ....... SKIPPED
[INFO] Apache Tuscany SCA Sample binding.websocket Autocomplete Webapp  SKIPPED
[INFO] Apache Tuscany SCA Sample binding.websocket Weather Monitor Webapp  SKIPPED
[INFO] Apache Tuscany SCA Sample binding.websocket Chat Webapp  SKIPPED
[INFO] Apache Tuscany SCA Sample binding.websocket PubSub Webapp  SKIPPED
[INFO] Apache Tuscany SCA Sample Calculator OSGi ......... SKIPPED
[INFO] Apache Tuscany SCA Sample OSGi Remote Services Calculator  SKIPPED
[INFO] Apache Tuscany SCA Sample OSGi Remote Services Calculator Operations  SKIPPED
[INFO] Apache Tuscany SCA Distributed OSGI Statically Configured Samples  SKIPPED
[INFO] Apache Tuscany SCA All-in-one Distribution ........ SKIPPED
[INFO] ------------------------------------------------------------------------
[INFO] BUILD FAILURE
[INFO] ------------------------------------------------------------------------
[INFO] Total time: 14:41.772s
[INFO] Finished at: Mon Jan 02 01:23:26 UTC 2012
[INFO] Final Memory: 88M/744M
[INFO] ------------------------------------------------------------------------
mavenExecutionResult exceptions not empty
message : Internal error: java.lang.NullPointerException
cause : null
Stack trace : 
org.apache.maven.InternalErrorException: Internal error: java.lang.NullPointerException
	at org.apache.maven.lifecycle.internal.BuilderCommon.handleBuildError(BuilderCommon.java:128)
	at org.apache.maven.lifecycle.internal.LifecycleModuleBuilder.buildProject(LifecycleModuleBuilder.java:95)
	at org.apache.maven.lifecycle.internal.LifecycleModuleBuilder.buildProject(LifecycleModuleBuilder.java:59)
	at org.apache.maven.lifecycle.internal.LifecycleStarter.singleThreadedBuild(LifecycleStarter.java:183)
	at org.apache.maven.lifecycle.internal.LifecycleStarter.execute(LifecycleStarter.java:161)
	at org.apache.maven.DefaultMaven.doExecute(DefaultMaven.java:319)
	at org.apache.maven.DefaultMaven.execute(DefaultMaven.java:156)
	at org.jvnet.hudson.maven3.launcher.Maven3Launcher.main(Maven3Launcher.java:79)
	at sun.reflect.NativeMethodAccessorImpl.invoke0(Native Method)
	at sun.reflect.NativeMethodAccessorImpl.invoke(NativeMethodAccessorImpl.java:39)
	at sun.reflect.DelegatingMethodAccessorImpl.invoke(DelegatingMethodAccessorImpl.java:25)
	at java.lang.reflect.Method.invoke(Method.java:597)
	at org.codehaus.plexus.classworlds.launcher.Launcher.launchStandard(Launcher.java:329)
	at org.codehaus.plexus.classworlds.launcher.Launcher.launch(Launcher.java:239)
	at org.jvnet.hudson.maven3.agent.Maven3Main.launch(Maven3Main.java:158)
	at hudson.maven.Maven3Builder.call(Maven3Builder.java:112)
	at hudson.maven.Maven3Builder.call(Maven3Builder.java:70)
	at hudson.remoting.UserRequest.perform(UserRequest.java:118)
	at hudson.remoting.UserRequest.perform(UserRequest.java:48)
	at hudson.remoting.Request$2.run(Request.java:287)
	at java.util.concurrent.Executors$RunnableAdapter.call(Executors.java:441)
	at java.util.concurrent.FutureTask$Sync.innerRun(FutureTask.java:303)
	at java.util.concurrent.FutureTask.run(FutureTask.java:138)
	at java.util.concurrent.ThreadPoolExecutor$Worker.runTask(ThreadPoolExecutor.java:886)
	at java.util.concurrent.ThreadPoolExecutor$Worker.run(ThreadPoolExecutor.java:908)
	at java.lang.Thread.run(Thread.java:662)
Caused by: java.lang.NullPointerException
	at hudson.maven.ExecutedMojo.getMojoClass(ExecutedMojo.java:114)
	at hudson.maven.ExecutedMojo.<init>(ExecutedMojo.java:99)
	at hudson.maven.Maven3Builder$MavenExecutionListener.recordExecutionTime(Maven3Builder.java:524)
	at hudson.maven.Maven3Builder$MavenExecutionListener.recordMojoSucceeded(Maven3Builder.java:493)
	at hudson.maven.Maven3Builder$MavenExecutionListener.forkSucceeded(Maven3Builder.java:601)
	at org.apache.maven.lifecycle.internal.DefaultExecutionEventCatapult.fire(DefaultExecutionEventCatapult.java:97)
	at org.apache.maven.lifecycle.internal.DefaultExecutionEventCatapult.fire(DefaultExecutionEventCatapult.java:42)
	at org.apache.maven.lifecycle.internal.MojoExecutor.executeForkedExecutions(MojoExecutor.java:383)
	at org.apache.maven.lifecycle.internal.MojoExecutor.execute(MojoExecutor.java:199)
	at org.apache.maven.lifecycle.internal.MojoExecutor.execute(MojoExecutor.java:153)
	at org.apache.maven.lifecycle.internal.MojoExecutor.execute(MojoExecutor.java:145)
	at org.apache.maven.lifecycle.internal.LifecycleModuleBuilder.buildProject(LifecycleModuleBuilder.java:84)
	... 24 more
Sending e-mails to: commits@tuscany.apache.org
channel stopped


Mime
View raw message