tuscany-commits mailing list archives

Site index · List index
Message view « Date » · « Thread »
Top « Date » · « Thread »
From Apache Jenkins Server <jenk...@builds.apache.org>
Subject Build failed in Jenkins: Tuscany-2x-deploy #609
Date Mon, 02 Jan 2012 00:14:48 GMT
See <https://builds.apache.org/job/Tuscany-2x-deploy/609/>

------------------------------------------
[...truncated 9184 lines...]
[INFO] 
[INFO] --- maven-remote-resources-plugin:1.1:process (default) @ helloworld-webapp ---
[INFO] [INFO] Using 'UTF-8' encoding to copy filtered resources.
[INFO] skip non existing resourceDirectory <https://builds.apache.org/job/Tuscany-2x-deploy/ws/sca-2x/samples/getting-started/helloworld-webapp/src/main/resources>
[INFO] Copying 1 resource
[INFO] Copying 3 resources
[INFO] Copying 3 resources

[INFO] --- maven-resources-plugin:2.4.2:resources (default-resources) @ helloworld-webapp
---
[INFO] 
[INFO] Nothing to compile - all classes are up to date
[INFO] --- maven-compiler-plugin:2.2:compile (default-compile) @ helloworld-webapp ---
[INFO] [INFO] Configured Artifact: org.apache.tuscany.sca.samples:helloworld:2.0-SNAPSHOT:jar
[INFO] org.apache.tuscany.sca.samples:helloworld:2.0-SNAPSHOT:jar already exists in <https://builds.apache.org/job/Tuscany-2x-deploy/ws/sca-2x/samples/getting-started/helloworld-webapp/src/main/webapp/WEB-INF/sca-contributions>

[INFO] --- maven-dependency-plugin:2.1:copy (copy) @ helloworld-webapp ---
[INFO] [INFO] Using 'UTF-8' encoding to copy filtered resources.
[INFO] Copying 1 resource
[INFO] Copying 3 resources

[INFO] [INFO] Copying 3 resources
--- maven-resources-plugin:2.4.2:testResources (default-testResources) @ helloworld-webapp
---
[INFO] [INFO] Nothing to compile - all classes are up to date

[INFO] --- maven-compiler-plugin:2.2:testCompile (default-testCompile) @ helloworld-webapp
---
[JENKINS] Archiving disabled - not archiving <https://builds.apache.org/job/Tuscany-2x-deploy/ws/sca-2x/samples/getting-started/helloworld-webapp/pom.xml>
[JENKINS] Archiving disabled - not archiving <https://builds.apache.org/job/Tuscany-2x-deploy/ws/sca-2x/samples/getting-started/helloworld-webapp/pom.xml>
[INFO] ------------------------------------------------------------------------
[INFO] Reactor Summary:
[INFO] 
[INFO] Apache Tuscany SCA Implementation Project (2.x) ... SUCCESS [9.459s]
[INFO] Apache Tuscany SCA Implementation Modules ......... SUCCESS [3.536s]
[INFO] Apache Tuscany SCA Monitor ........................ SUCCESS [4.149s]
[INFO] Apache Tuscany SCA Extensibility .................. SUCCESS [3.524s]
[INFO] Apache Tuscany SCA Assembly Model ................. SUCCESS [3.838s]
[INFO] Apache Tuscany SCA Assembly Model XSD Files ....... SUCCESS [2.311s]
[INFO] Apache Tuscany SCA Common XML ..................... SUCCESS [3.544s]
[INFO] Apache Tuscany SCA API ............................ SUCCESS [2.501s]
[INFO] Apache Tuscany SCA Common Java .................... SUCCESS [3.052s]
[INFO] Apache Tuscany SCA Contribution Model ............. SUCCESS [5.912s]
[INFO] Apache Tuscany SCA Node API ....................... SUCCESS [2.483s]
[INFO] Apache Tuscany SCA Core SPI ....................... SUCCESS [6.065s]
[INFO] Apache Tuscany SCA XSD Model ...................... SUCCESS [2.825s]
[INFO] Apache Tuscany SCA Assembly XML Model ............. SUCCESS [5.671s]
[INFO] Apache Tuscany SCA WSDL Interface Model ........... SUCCESS [4.137s]
[INFO] Apache Tuscany SCA Interface Java Model ........... SUCCESS [3.873s]
[INFO] Apache Tuscany SCA Core Runtime ................... SUCCESS [5.919s]
[INFO] Apache Tuscany SCA DataBinding Framework .......... SUCCESS [4.283s]
[INFO] Apache Tuscany SCA DataBinding for JAXB ........... SUCCESS [4.825s]
[INFO] Apache Tuscany SCA Model Builders ................. SUCCESS [3.374s]
[INFO] Apache Tuscany SCA Deployment ..................... SUCCESS [2.847s]
[INFO] Apache Tuscany SCA WS Binding Model ............... SUCCESS [5.105s]
[INFO] Apache Tuscany SCA Interface Java For JAXWS ....... SUCCESS [6.530s]
[INFO] Apache Tuscany SCA Core/DataBinding Integration ... SUCCESS [2.583s]
[INFO] Apache Tuscany SCA Web Service binding WSDL Generator  SUCCESS [3.674s]
[INFO] Apache Tuscany SCA Binding SCA Runtime ............ SUCCESS [3.529s]
[INFO] Apache Tuscany SCA Implementation Java Model ...... SUCCESS [4.583s]
[INFO] Apache Tuscany SCA Implementation Java Runtime .... SUCCESS [3.613s]
[INFO] Apache Tuscany SCA Node Implementation ............ SUCCESS [3.893s]
[INFO] Apache Tuscany SCA Data API ....................... SUCCESS [3.483s]
[INFO] Apache Tuscany SCA Domain Node .................... SUCCESS [3.675s]
[INFO] Apache Tuscany SCA Web Implementation Model ....... SUCCESS [4.264s]
[INFO] Apache Tuscany SCA HTTP Servlet Host Extension Point  SUCCESS [2.242s]
[INFO] Apache Tuscany SCA Webapp Host .................... SUCCESS [2.852s]
[INFO] Apache Tuscany SCA Web Implementation Runtime ..... SUCCESS [3.869s]
[INFO] Apache Tuscany SCA Launcher ....................... SUCCESS [2.390s]
[INFO] Apache Tuscany SCA Client Impl .................... SUCCESS [2.609s]
[INFO] Apache Tuscany SCA Jetty Servlet Host Extension ... SUCCESS [3.537s]
[INFO] Apache Tuscany SCA Shell .......................... SUCCESS [2.663s]
[INFO] Apache Tuscany SCA Stripes Web Framework Integration  SUCCESS [2.453s]
[INFO] Apache Tuscany SCA Apache Wink JAX-RS Integration . SUCCESS [3.334s]
[INFO] Apache Tuscany SCA JAXWS-based WS Binding Extension  SUCCESS [3.853s]
[INFO] Apache Tuscany SCA JAXWS RI based WS Binding Extension  SUCCESS [3.949s]
[INFO] Apache Tuscany SCA Common HTTP .................... SUCCESS [2.363s]
[INFO] Apache Tuscany SCA Core Runtime POM ............... SUCCESS [1.336s]
[INFO] Apache Tuscany SCA Policy Security Model .......... SUCCESS [4.253s]
[INFO] Apache Tuscany SCA Atom Feed Binding Extension .... SUCCESS [3.875s]
[INFO] Apache Tuscany SCA Comet Binding Model ............ SUCCESS [2.103s]
[INFO] Apache Tuscany SCA CORBA Host Extension Point ..... SUCCESS [3.369s]
[INFO] Apache Tuscany SCA CORBA Binding Extension ........ SUCCESS [2.996s]
[INFO] Apache Tuscany SCA EJB Binding Model .............. SUCCESS [3.896s]
[INFO] Apache Tuscany SCA HTTP Binding Model ............. SUCCESS [3.390s]
[INFO] Apache Tuscany SCA JMS Binding Model .............. SUCCESS [4.182s]
[INFO] Apache Tuscany SCA JSONP Binding Model ............ SUCCESS [3.045s]
[INFO] Apache Tuscany SCA JSON-RPC Binding Model ......... SUCCESS [3.650s]
[INFO] Apache Tuscany SCA REST Binding Model ............. SUCCESS [3.222s]
[INFO] Apache Tuscany SCA RMI Binding Model .............. SUCCESS [2.354s]
[INFO] Apache Tuscany SCA BPEL Implementation Extension .. SUCCESS [4.406s]
[INFO] Apache Tuscany SCA Script Implementation Model .... SUCCESS [3.383s]
[INFO] Apache Tuscany SCA Spring Implementation Model .... SUCCESS [3.087s]
[INFO] Apache Tuscany SCA Widget Implementation Model .... SUCCESS [2.793s]
[INFO] Apache Tuscany SCA Base Runtime Jar ............... SUCCESS [6.185s]
[INFO] Apache Tuscany SCA EndPoint Registry using Hazelcast  SUCCESS [3.234s]
[INFO] Apache Tuscany Maven Tuscany Plugin ............... SUCCESS [3.674s]
[INFO] Create an SCA JAR contribution project ............ SUCCESS [2.455s]
[INFO] Create an SCA ZIP contribution project ............ SUCCESS [1.552s]
[INFO] Tuscany SCA ZIP contribution Shared Assembly Descriptor  SUCCESS [1.631s]
[INFO] Create a simple Apache Tuscany SCA webapp project . SUCCESS [2.172s]
[INFO] Create a Tuscany SCA and JSF project .............. SUCCESS [1.535s]
[INFO] Create a simple Apache Tuscany SCA webapp project using the Stripes Web Framework 
SUCCESS [1.592s]
[INFO] Create an SCA Webapp project using BPEL ........... SUCCESS [1.704s]
[INFO] Create a Tuscany binding extension project ........ SUCCESS [2.721s]
[INFO] Apache Tuscany SCA Maven Archetypes ............... SUCCESS [1.076s]
[INFO] Apache Tuscany SCA Web JavaScript ................. SUCCESS [3.343s]
[INFO] Apache Tuscany SCA Abdera Atom Feed Binding Extension  SUCCESS [4.004s]
[INFO] Apache Tuscany SCA JAX-RS Implementation Model .... SUCCESS [3.222s]
[INFO] Apache Tuscany SCA Python Implementation Model .... SUCCESS [4.191s]
[INFO] Apache Tuscany SCA Base Runtime POM ............... SUCCESS [2.121s]
[INFO] Apache Tuscany SCA Comet Binding Runtime .......... SUCCESS [3.143s]
[INFO] Apache Tuscany SCA EJB Binding Runtime ............ SUCCESS [4.388s]
[INFO] Apache Tuscany SCA Data Binding for JSON .......... SUCCESS [3.673s]
[INFO] Apache Tuscany SCA HTTP Binding Runtime ........... SUCCESS [3.740s]
[INFO] Apache Tuscany SCA JMS Binding Runtime ............ SUCCESS [3.751s]
[INFO] Apache Tuscany SCA JMS Binding Runtime AcytiveMQ .. SUCCESS [2.432s]
[INFO] Apache Tuscany SCA JSONP Binding Runtime .......... SUCCESS [3.425s]
[INFO] Apache Tuscany SCA JSON-RPC Binding Runtime ....... SUCCESS [4.090s]
[INFO] Apache Tuscany SCA Interface Java For JAX_RS ...... SUCCESS [2.653s]
[INFO] Apache Tuscany SCA REST Binding Runtime ........... SUCCESS [4.176s]
[INFO] Apache Tuscany SCA RMI Host Extension Point ....... SUCCESS [3.514s]
[INFO] Apache Tuscany SCA RMI Binding Extension .......... SUCCESS [3.930s]
[INFO] Apache Tuscany SCA Websocket Binding Extension .... SUCCESS [2.936s]
[INFO] Apache Tuscany SCA Policy WS-Policy Model ......... SUCCESS [3.372s]
[INFO] Apache Tuscany SCA Data Binding for Axiom ......... SUCCESS [3.387s]
[INFO] Apache Tuscany SCA Data Binding for JAXB-AXIOM .... SUCCESS [3.753s]
[INFO] Apache Tuscany SCA Axis2-1.5-based WS Binding Runtime  SUCCESS [4.730s]
[INFO] Apache Tuscany SCA Resource Import/Export Model ... SUCCESS [3.371s]
[INFO] Apache Tuscany SCA Data Binding for SDO ........... SUCCESS [4.953s]
[INFO] Apache Tuscany SCA Data Binding for SDO/AXIOM ..... SUCCESS [3.812s]
[INFO] Apache Tuscany SCA Tomcat Tribes Based EndPoint Registry  SUCCESS [3.782s]
[INFO] Apache Tuscany SCA Extensibility for Eclipse Equinox  SUCCESS [3.426s]
[INFO] Apache Tuscany SCA Node Equinox OSGi Launcher ..... SUCCESS [5.643s]
[INFO] Apache Tuscany SCA OSGi HTTP Service Based Servlet Host Extension  SUCCESS [3.022s]
[INFO] Apache Tuscany SCA BPEL ODE Implementation Extension  SUCCESS [4.722s]
[INFO] Apache Tuscany SCA JAX-RS Implementation Runtime .. SUCCESS [3.326s]
[INFO] Apache Tuscany SCA Python Implementation Extension  SUCCESS [3.675s]
[INFO] Apache Tuscany SCA Script Implementation Extension  SUCCESS [4.406s]
[INFO] Apache Tuscany SCA Spring Implementation Runtime Model  SUCCESS [3.030s]
[INFO] Apache Tuscany SCA Spring Implementation WebApp Integration  SUCCESS [5.472s]
[INFO] Apache Tuscany SCA Spring Implementation Runtime Stub  SUCCESS [3.026s]
[INFO] Apache Tuscany SCA Spring Implementation Runtime Tie  SUCCESS [4.023s]
[INFO] Apache Tuscany SCA Web Implementation Client ...... SUCCESS [2.989s]
[INFO] Apache Tuscany SCA Widget Implementation Runtime .. SUCCESS [4.043s]
[INFO] Apache Tuscany SCA Web JavaScript for DOJO ........ SUCCESS [11.943s]
[INFO] Apache Tuscany SCA Widget Implementation Runtime (Dojo)  SUCCESS [2.435s]
[INFO] Apache Tuscany SCA MyFaces JSF Integration ........ SUCCESS [4.192s]
[INFO] Apache Tuscany SCA Node Launcher .................. SUCCESS [2.730s]
[INFO] Apache Tuscany SCA Node Manager ................... SUCCESS [4.663s]
[INFO] Apache Tuscany SCA Extension Policy Logging Model . SUCCESS [3.729s]
[INFO] Apache Tuscany SCA Java JSR250 Implementation ..... SUCCESS [4.101s]
[INFO] Apache Tuscany SCA Transaction Policy Model ....... SUCCESS [3.935s]
[INFO] Apache Tuscany SCA Transaction Policy Runtime ..... SUCCESS [4.578s]
[INFO] Apache Tuscany SCA Transaction Policy Runtime (Geronimo)  SUCCESS [2.837s]
[INFO] Apache Tuscany SCA AOP-based Logging and Tracing .. SUCCESS [4.984s]
[INFO] Apache Tuscany SCA Contribution OSGi Bundle ....... SUCCESS [2.892s]
[INFO] Apache Tuscany SCA OSGi Implementation Extension .. SUCCESS [3.363s]
[INFO] Apache Tuscany SCA OSGi Implementation Extension Runtime  SUCCESS [2.632s]
[INFO] Apache Tuscany SCA OSGi Node Implementation ....... SUCCESS [4.104s]
[INFO] Apache Tuscany SCA JSE built-in CORBA Host ........ SUCCESS [3.235s]
[INFO] Apache Tuscany SCA JEE environment CORBA Host ..... SUCCESS [3.042s]
[INFO] Apache Tuscany SCA CORBA Binding Runtime .......... SUCCESS [4.115s]
[INFO] Apache Tuscany SCA Transient Name Server CORBA Host  SUCCESS [3.072s]
[INFO] Apache Tuscany SCA Composite Diagram Generator Application  SUCCESS [4.793s]
[INFO] Apache Tuscany SCA OSGi Runtime POM ............... SUCCESS [1.097s]
[INFO] Apache Tuscany SCA Samples ........................ SUCCESS [0.968s]
[INFO] Apache Tuscany SCA Samples Helloworld ............. SUCCESS [2.292s]
[INFO] Apache Tuscany SCA Samples Helloworld JAX-RS ...... SUCCESS [2.503s]
[INFO] Apache Tuscany SCA Samples Helloworld JSONP ....... SUCCESS [2.202s]
[INFO] Apache Tuscany SCA Samples Helloworld JSON-RPC .... SUCCESS [2.391s]
[INFO] Apache Tuscany SCA Samples Helloworld SCAClient ... SUCCESS [2.165s]
[INFO] Apache Tuscany SCA Samples Helloworld Spring ...... SUCCESS [2.405s]
[INFO] Apache Tuscany SCA Samples Helloworld WebApp ...... FAILURE [2.431s]
[INFO] Apache Tuscany SCA Samples Helloworld Web Service . SKIPPED
[INFO] Apache Tuscany SCA Samples Helloworld With Dependencies  SKIPPED
[INFO] Apache Tuscany SCA Samples Getting Started ........ SKIPPED
[INFO] Apache Tuscany SCA Samples Running Tuscany ........ SKIPPED
[INFO] Apache Tuscany SCA Samples JSE .................... SKIPPED
[INFO] Apache Tuscany SCA Samples JUnit .................. SKIPPED
[INFO] Apache Tuscany SCA Sample Async Invocation ........ SKIPPED
[INFO] Apache Tuscany SCA Sample Learning More ........... SKIPPED
[INFO] Apache Tuscany SCA Sample binding.comet ........... SKIPPED
[INFO] Apache Tuscany SCA Sample binding.comet Real-Time Suggestions Webapp  SKIPPED
[INFO] Apache Tuscany SCA Sample binding.comet Weather Monitor Webapp  SKIPPED
[INFO] Apache Tuscany SCA Sample binding.comet PubSub Webapp  SKIPPED
[INFO] Apache Tuscany SCA Sample binding.comet Chat Webapp  SKIPPED
[INFO] Apache Tuscany SCA Sample binding.websocket ....... SKIPPED
[INFO] Apache Tuscany SCA Sample binding.websocket Autocomplete Webapp  SKIPPED
[INFO] Apache Tuscany SCA Sample binding.websocket Weather Monitor Webapp  SKIPPED
[INFO] Apache Tuscany SCA Sample binding.websocket Chat Webapp  SKIPPED
[INFO] Apache Tuscany SCA Sample binding.websocket PubSub Webapp  SKIPPED
[INFO] Apache Tuscany SCA Sample Calculator OSGi ......... SKIPPED
[INFO] Apache Tuscany SCA Sample OSGi Remote Services Calculator  SKIPPED
[INFO] Apache Tuscany SCA Sample OSGi Remote Services Calculator Operations  SKIPPED
[INFO] Apache Tuscany SCA Distributed OSGI Statically Configured Samples  SKIPPED
[INFO] Apache Tuscany SCA All-in-one Distribution ........ SKIPPED
[INFO] ------------------------------------------------------------------------
[INFO] BUILD FAILURE
[INFO] ------------------------------------------------------------------------
[INFO] Total time: 8:55.901s
[INFO] Finished at: Mon Jan 02 00:14:45 UTC 2012
[INFO] Final Memory: 89M/744M
[INFO] ------------------------------------------------------------------------
Waiting for Jenkins to finish collecting data
mavenExecutionResult exceptions not empty
message : Internal error: java.lang.NullPointerException
cause : null
Stack trace : 
org.apache.maven.InternalErrorException: Internal error: java.lang.NullPointerException
	at org.apache.maven.lifecycle.internal.BuilderCommon.handleBuildError(BuilderCommon.java:128)
	at org.apache.maven.lifecycle.internal.LifecycleModuleBuilder.buildProject(LifecycleModuleBuilder.java:95)
	at org.apache.maven.lifecycle.internal.LifecycleModuleBuilder.buildProject(LifecycleModuleBuilder.java:59)
	at org.apache.maven.lifecycle.internal.LifecycleStarter.singleThreadedBuild(LifecycleStarter.java:183)
	at org.apache.maven.lifecycle.internal.LifecycleStarter.execute(LifecycleStarter.java:161)
	at org.apache.maven.DefaultMaven.doExecute(DefaultMaven.java:319)
	at org.apache.maven.DefaultMaven.execute(DefaultMaven.java:156)
	at org.jvnet.hudson.maven3.launcher.Maven3Launcher.main(Maven3Launcher.java:79)
	at sun.reflect.NativeMethodAccessorImpl.invoke0(Native Method)
	at sun.reflect.NativeMethodAccessorImpl.invoke(NativeMethodAccessorImpl.java:39)
	at sun.reflect.DelegatingMethodAccessorImpl.invoke(DelegatingMethodAccessorImpl.java:25)
	at java.lang.reflect.Method.invoke(Method.java:597)
	at org.codehaus.plexus.classworlds.launcher.Launcher.launchStandard(Launcher.java:329)
	at org.codehaus.plexus.classworlds.launcher.Launcher.launch(Launcher.java:239)
	at org.jvnet.hudson.maven3.agent.Maven3Main.launch(Maven3Main.java:158)
	at hudson.maven.Maven3Builder.call(Maven3Builder.java:112)
	at hudson.maven.Maven3Builder.call(Maven3Builder.java:70)
	at hudson.remoting.UserRequest.perform(UserRequest.java:118)
	at hudson.remoting.UserRequest.perform(UserRequest.java:48)
	at hudson.remoting.Request$2.run(Request.java:287)
	at java.util.concurrent.Executors$RunnableAdapter.call(Executors.java:441)
	at java.util.concurrent.FutureTask$Sync.innerRun(FutureTask.java:303)
	at java.util.concurrent.FutureTask.run(FutureTask.java:138)
	at java.util.concurrent.ThreadPoolExecutor$Worker.runTask(ThreadPoolExecutor.java:886)
	at java.util.concurrent.ThreadPoolExecutor$Worker.run(ThreadPoolExecutor.java:908)
	at java.lang.Thread.run(Thread.java:662)
Caused by: java.lang.NullPointerException
	at hudson.maven.ExecutedMojo.getMojoClass(ExecutedMojo.java:114)
	at hudson.maven.ExecutedMojo.<init>(ExecutedMojo.java:99)
	at hudson.maven.Maven3Builder$MavenExecutionListener.recordExecutionTime(Maven3Builder.java:524)
	at hudson.maven.Maven3Builder$MavenExecutionListener.recordMojoSucceeded(Maven3Builder.java:493)
	at hudson.maven.Maven3Builder$MavenExecutionListener.forkSucceeded(Maven3Builder.java:601)
	at org.apache.maven.lifecycle.internal.DefaultExecutionEventCatapult.fire(DefaultExecutionEventCatapult.java:97)
	at org.apache.maven.lifecycle.internal.DefaultExecutionEventCatapult.fire(DefaultExecutionEventCatapult.java:42)
	at org.apache.maven.lifecycle.internal.MojoExecutor.executeForkedExecutions(MojoExecutor.java:383)
	at org.apache.maven.lifecycle.internal.MojoExecutor.execute(MojoExecutor.java:199)
	at org.apache.maven.lifecycle.internal.MojoExecutor.execute(MojoExecutor.java:153)
	at org.apache.maven.lifecycle.internal.MojoExecutor.execute(MojoExecutor.java:145)
	at org.apache.maven.lifecycle.internal.LifecycleModuleBuilder.buildProject(LifecycleModuleBuilder.java:84)
	... 24 more
Sending e-mails to: commits@tuscany.apache.org
channel stopped


Mime
View raw message