tuscany-commits mailing list archives

Site index · List index
Message view « Date » · « Thread »
Top « Date » · « Thread »
From Apache Jenkins Server <jenk...@builds.apache.org>
Subject Build failed in Jenkins: Tuscany-2x #294
Date Mon, 25 Jul 2011 00:13:02 GMT
See <https://builds.apache.org/job/Tuscany-2x/294/changes>

Changes:

[antelder] Update sample README

[antelder] Update sample README

[antelder] Update sample README

[antelder] Update sample README

[antelder] Update sample README

[antelder] Update sample README

[antelder] Include all the samples in build

------------------------------------------
[...truncated 12129 lines...]
A         testing/itest/scabindingmapper/src/main/java/itest
A         testing/itest/scabindingmapper/src/main/java/itest/scabindingmapper
AU        testing/itest/scabindingmapper/src/main/java/itest/scabindingmapper/MyUnknownEndpointHandler.java
AU        testing/itest/scabindingmapper/src/main/java/itest/scabindingmapper/MyMapper.java
A         testing/itest/scabindingmapper/src/main/resources
A         testing/itest/scabindingmapper/src/main/resources/META-INF
A         testing/itest/scabindingmapper/src/main/resources/META-INF/services
A         testing/itest/scabindingmapper/src/main/resources/META-INF/services/org.apache.tuscany.sca.provider.SCABindingMapper
A         testing/itest/scabindingmapper/src/main/resources/META-INF/services/org.apache.tuscany.sca.runtime.UnknownEndpointHandler
AU        testing/itest/scabindingmapper/pom.xml
A         testing/itest/operation-overloading
A         testing/itest/operation-overloading/src
A         testing/itest/operation-overloading/src/test
A         testing/itest/operation-overloading/src/test/java
A         testing/itest/operation-overloading/src/test/java/org
A         testing/itest/operation-overloading/src/test/java/org/apache
A         testing/itest/operation-overloading/src/test/java/org/apache/tuscany
A         testing/itest/operation-overloading/src/test/java/org/apache/tuscany/sca
A         testing/itest/operation-overloading/src/test/java/org/apache/tuscany/sca/test
A         testing/itest/operation-overloading/src/test/java/org/apache/tuscany/sca/test/opoverload
A         testing/itest/operation-overloading/src/test/java/org/apache/tuscany/sca/test/opoverload/impl
AU        testing/itest/operation-overloading/src/test/java/org/apache/tuscany/sca/test/opoverload/impl/OverloadATestCase.java
A         testing/itest/operation-overloading/src/main
A         testing/itest/operation-overloading/src/main/java
A         testing/itest/operation-overloading/src/main/java/org
A         testing/itest/operation-overloading/src/main/java/org/apache
A         testing/itest/operation-overloading/src/main/java/org/apache/tuscany
A         testing/itest/operation-overloading/src/main/java/org/apache/tuscany/sca
A         testing/itest/operation-overloading/src/main/java/org/apache/tuscany/sca/test
A         testing/itest/operation-overloading/src/main/java/org/apache/tuscany/sca/test/opoverload
A         testing/itest/operation-overloading/src/main/java/org/apache/tuscany/sca/test/opoverload/impl
AU        testing/itest/operation-overloading/src/main/java/org/apache/tuscany/sca/test/opoverload/impl/OverloadATarget.java
AU        testing/itest/operation-overloading/src/main/java/org/apache/tuscany/sca/test/opoverload/impl/OverloadASource.java
AU        testing/itest/operation-overloading/src/main/java/org/apache/tuscany/sca/test/opoverload/OverloadASourceTarget.java
A         testing/itest/operation-overloading/src/main/resources
AU        testing/itest/operation-overloading/src/main/resources/OperationOverload.composite
AU        testing/itest/operation-overloading/pom.xml
A         testing/itest/base
A         testing/itest/base/dependencies
A         testing/itest/base/dependencies/src
A         testing/itest/base/dependencies/src/test
A         testing/itest/base/dependencies/src/test/java
A         testing/itest/base/dependencies/src/test/java/org
A         testing/itest/base/dependencies/src/test/java/org/apache
A         testing/itest/base/dependencies/src/test/java/org/apache/tuscany
A         testing/itest/base/dependencies/src/test/java/org/apache/tuscany/sca
A         testing/itest/base/dependencies/src/test/java/org/apache/tuscany/sca/itest
A         testing/itest/base/dependencies/src/test/java/org/apache/tuscany/sca/itest/base
A         testing/itest/base/dependencies/src/test/java/org/apache/tuscany/sca/itest/base/dependencies
A         testing/itest/base/dependencies/src/test/java/org/apache/tuscany/sca/itest/base/dependencies/ValidateDependenciesTestCase.java
A         testing/itest/base/dependencies/pom.xml
A         testing/itest/base/pom.xml
A         testing/itest/node-launcher-equinox
A         testing/itest/node-launcher-equinox/src
A         testing/itest/node-launcher-equinox/src/test
A         testing/itest/node-launcher-equinox/src/test/java
A         testing/itest/node-launcher-equinox/src/test/java/hello
AU        testing/itest/node-launcher-equinox/src/test/java/hello/HelloWorldClient.java
AU        testing/itest/node-launcher-equinox/src/test/java/hello/HelloWorld.java
AU        testing/itest/node-launcher-equinox/src/test/java/hello/HelloWorldImpl.java
A         testing/itest/node-launcher-equinox/src/test/java/org
A         testing/itest/node-launcher-equinox/src/test/java/org/apache
A         testing/itest/node-launcher-equinox/src/test/java/org/apache/tuscany
A         testing/itest/node-launcher-equinox/src/test/java/org/apache/tuscany/sca
A         testing/itest/node-launcher-equinox/src/test/java/org/apache/tuscany/sca/node
A         testing/itest/node-launcher-equinox/src/test/java/org/apache/tuscany/sca/node/equinox
A         testing/itest/node-launcher-equinox/src/test/java/org/apache/tuscany/sca/node/equinox/launcher
AU        testing/itest/node-launcher-equinox/src/test/java/org/apache/tuscany/sca/node/equinox/launcher/NodeLauncherTestCase.java
AU        testing/itest/node-launcher-equinox/src/test/java/org/apache/tuscany/sca/node/equinox/launcher/EquinoxOSGiHostTestCase.java
A         testing/itest/node-launcher-equinox/src/test/resources
AU        testing/itest/node-launcher-equinox/src/test/resources/HelloWorld.composite
A         testing/itest/node-launcher-equinox/pom.xml
A         testing/itest/callback-basic
A         testing/itest/callback-basic/src
A         testing/itest/callback-basic/src/test
A         testing/itest/callback-basic/src/test/java
A         testing/itest/callback-basic/src/test/java/org
A         testing/itest/callback-basic/src/test/java/org/apache
A         testing/itest/callback-basic/src/test/java/org/apache/tuscany
A         testing/itest/callback-basic/src/test/java/org/apache/tuscany/sca
A         testing/itest/callback-basic/src/test/java/org/apache/tuscany/sca/test
AU        testing/itest/callback-basic/src/test/java/org/apache/tuscany/sca/test/CallBackBasicTestCase.java
A         testing/itest/callback-basic/src/main
A         testing/itest/callback-basic/src/main/java
A         testing/itest/callback-basic/src/main/java/org
A         testing/itest/callback-basic/src/main/java/org/apache
A         testing/itest/callback-basic/src/main/java/org/apache/tuscany
A         testing/itest/callback-basic/src/main/java/org/apache/tuscany/sca
A         testing/itest/callback-basic/src/main/java/org/apache/tuscany/sca/test
AU        testing/itest/callback-basic/src/main/java/org/apache/tuscany/sca/test/CallBackBasicClientImpl.java
AU        testing/itest/callback-basic/src/main/java/org/apache/tuscany/sca/test/CallBackBasicService.java
AU        testing/itest/callback-basic/src/main/java/org/apache/tuscany/sca/test/CallBackBasicServiceImpl.java
AU        testing/itest/callback-basic/src/main/java/org/apache/tuscany/sca/test/CallBackBasicCallBack.java
AU        testing/itest/callback-basic/src/main/java/org/apache/tuscany/sca/test/CallBackBasicClient.java
A         testing/itest/callback-basic/src/main/resources
AU        testing/itest/callback-basic/src/main/resources/CallBackBasicTest.composite
A         testing/itest/callback-basic/src/main/resources/META-INF
AU        testing/itest/callback-basic/src/main/resources/META-INF/sca-contribution.xml
AU        testing/itest/callback-basic/pom.xml
A         testing/compliance-tests
A         testing/compliance-tests/assembly
A         testing/compliance-tests/assembly/src
A         testing/compliance-tests/assembly/src/test
A         testing/compliance-tests/assembly/src/test/java
A         testing/compliance-tests/assembly/src/test/java/org
A         testing/compliance-tests/assembly/src/test/java/org/apache
A         testing/compliance-tests/assembly/src/test/java/org/apache/tuscany
A         testing/compliance-tests/assembly/src/test/java/org/apache/tuscany/sca
A         testing/compliance-tests/assembly/src/test/java/org/apache/tuscany/sca/otest
A         testing/compliance-tests/assembly/src/test/java/org/apache/tuscany/sca/otest/TuscanyRuntimeBridge.java
A         testing/compliance-tests/assembly/src/test/resources
A         testing/compliance-tests/assembly/src/test/resources/tuscany-oasis-sca-tests-errors.properties
A         testing/compliance-tests/assembly/src/test/resources/oasis-sca-tests.properties
A         testing/compliance-tests/assembly/src/main
A         testing/compliance-tests/assembly/pom.xml
A         testing/compliance-tests/policy
A         testing/compliance-tests/policy/src
A         testing/compliance-tests/policy/src/test
A         testing/compliance-tests/policy/src/test/java
A         testing/compliance-tests/policy/src/test/java/org
A         testing/compliance-tests/policy/src/test/java/org/apache
A         testing/compliance-tests/policy/src/test/java/org/apache/tuscany
A         testing/compliance-tests/policy/src/test/java/org/apache/tuscany/sca
A         testing/compliance-tests/policy/src/test/java/org/apache/tuscany/sca/otest
A         testing/compliance-tests/policy/src/test/java/org/apache/tuscany/sca/otest/TuscanyRuntimeBridge.java
A         testing/compliance-tests/policy/src/test/resources
A         testing/compliance-tests/policy/src/test/resources/tuscany-oasis-sca-tests-errors.properties
A         testing/compliance-tests/policy/src/test/resources/oasis-sca-tests.properties
A         testing/compliance-tests/policy/pom.xml
A         testing/compliance-tests/binding-jms
A         testing/compliance-tests/binding-jms/src
A         testing/compliance-tests/binding-jms/src/test
A         testing/compliance-tests/binding-jms/src/test/java
A         testing/compliance-tests/binding-jms/src/test/java/org
A         testing/compliance-tests/binding-jms/src/test/java/org/apache
A         testing/compliance-tests/binding-jms/src/test/java/org/apache/tuscany
A         testing/compliance-tests/binding-jms/src/test/java/org/apache/tuscany/sca
A         testing/compliance-tests/binding-jms/src/test/java/org/apache/tuscany/sca/otest
AU        testing/compliance-tests/binding-jms/src/test/java/org/apache/tuscany/sca/otest/TuscanyRuntimeBridge.java
A         testing/compliance-tests/binding-jms/src/test/resources
AU        testing/compliance-tests/binding-jms/src/test/resources/tuscany-oasis-sca-tests-errors.properties
AU        testing/compliance-tests/binding-jms/src/test/resources/oasis-sca-tests.properties
AU        testing/compliance-tests/binding-jms/pom.xml
A         testing/compliance-tests/binding-ws
A         testing/compliance-tests/binding-ws/src
A         testing/compliance-tests/binding-ws/src/test
A         testing/compliance-tests/binding-ws/src/test/java
A         testing/compliance-tests/binding-ws/src/test/java/org
A         testing/compliance-tests/binding-ws/src/test/java/org/apache
A         testing/compliance-tests/binding-ws/src/test/java/org/apache/tuscany
A         testing/compliance-tests/binding-ws/src/test/java/org/apache/tuscany/sca
A         testing/compliance-tests/binding-ws/src/test/java/org/apache/tuscany/sca/otest
AU        testing/compliance-tests/binding-ws/src/test/java/org/apache/tuscany/sca/otest/TuscanyRuntimeBridge.java
A         testing/compliance-tests/binding-ws/src/test/resources
AU        testing/compliance-tests/binding-ws/src/test/resources/tuscany-oasis-sca-tests-errors.properties
AU        testing/compliance-tests/binding-ws/src/test/resources/oasis-sca-tests.properties
A         testing/compliance-tests/binding-ws/sca_variables.dtd
AU        testing/compliance-tests/binding-ws/pom.xml
A         testing/compliance-tests/java-caa
A         testing/compliance-tests/java-caa/src
A         testing/compliance-tests/java-caa/src/test
A         testing/compliance-tests/java-caa/src/test/java
A         testing/compliance-tests/java-caa/src/test/java/org
A         testing/compliance-tests/java-caa/src/test/java/org/apache
A         testing/compliance-tests/java-caa/src/test/java/org/apache/tuscany
A         testing/compliance-tests/java-caa/src/test/java/org/apache/tuscany/sca
A         testing/compliance-tests/java-caa/src/test/java/org/apache/tuscany/sca/otest
A         testing/compliance-tests/java-caa/src/test/java/org/apache/tuscany/sca/otest/TuscanyRuntimeBridge.java
A         testing/compliance-tests/java-caa/src/test/resources
A         testing/compliance-tests/java-caa/src/test/resources/tuscany-oasis-sca-tests-errors.properties
A         testing/compliance-tests/java-caa/src/test/resources/oasis-sca-tests.properties
A         testing/compliance-tests/java-caa/pom.xml
A         testing/compliance-tests/java-ci
A         testing/compliance-tests/java-ci/src
A         testing/compliance-tests/java-ci/src/test
A         testing/compliance-tests/java-ci/src/test/java
A         testing/compliance-tests/java-ci/src/test/java/org
A         testing/compliance-tests/java-ci/src/test/java/org/apache
A         testing/compliance-tests/java-ci/src/test/java/org/apache/tuscany
A         testing/compliance-tests/java-ci/src/test/java/org/apache/tuscany/sca
A         testing/compliance-tests/java-ci/src/test/java/org/apache/tuscany/sca/otest
A         testing/compliance-tests/java-ci/src/test/java/org/apache/tuscany/sca/otest/TuscanyRuntimeBridge.java
A         testing/compliance-tests/java-ci/src/test/resources
A         testing/compliance-tests/java-ci/src/test/resources/tuscany-oasis-sca-tests-errors.properties
A         testing/compliance-tests/java-ci/src/test/resources/oasis-sca-tests.properties
A         testing/compliance-tests/java-ci/pom.xml
A         testing/compliance-tests/pom.xml
A         features
A         features/web20
AU        features/web20/pom.xml
A         features/osgi
AU        features/osgi/pom.xml
A         features/sdo
AU        features/sdo/pom.xml
A         features/ejava
AU        features/ejava/pom.xml
A         features/all
AU        features/all/pom.xml
A         features/core
AU        features/core/pom.xml
A         features/api
AU        features/api/pom.xml
A         features/eclipse-pde
AU        features/eclipse-pde/pom.xml
AU        features/pom.xml
A         features/process
AU        features/process/pom.xml
A         features/webapp
AU        features/webapp/pom.xml
A         features/webservice
AU        features/webservice/pom.xml
 U        .
At revision 1150525
ERROR: Ignore Problem expanding maven opts macros org.jenkinsci.plugins.tokenmacro.TokenMacro
Found mavenVersion 2.2.1 from file jar:file:/home/hudson/tools/maven/latest/lib/maven-2.2.1-uber.jar!/META-INF/maven/org.apache.maven/maven-core/pom.properties
Parsing POMs
failed to transfer Unable to locate resource in repository
downloaded artifact http://repo1.maven.org/maven2//org/apache/apache/8/apache-8.pom
Discovered a new module org.apache.tuscany.sca.samples:helloworld-jaxrs Apache Tuscany SCA
Samples Helloworld JAX-RS
Discovered a new module org.apache.tuscany.sca.samples:helloworld-jsonp Apache Tuscany SCA
Samples Helloworld JSONP
Discovered a new module org.apache.tuscany.sca.samples:helloworld-jsonrpc Apache Tuscany SCA
Samples Helloworld JSON-RPC
Discovered a new module org.apache.tuscany.sca.samples:helloworld-spring Apache Tuscany SCA
Samples Helloworld Spring
Discovered a new module org.apache.tuscany.sca.samples:helloworld-webservice Apache Tuscany
SCA Samples Helloworld Web Service
Discovered a new module org.apache.tuscany.sca.samples:helloworld-withdeps Apache Tuscany
SCA Samples Helloworld With Dependencies
ERROR: Ignore Problem expanding maven opts macros org.jenkinsci.plugins.tokenmacro.TokenMacro
[sca-2x] $ /home/hudson/tools/java/latest1.6/bin/java -Xmx756m -Xms756m -XX:MaxPermSize=512m
-cp /home/jenkins/jenkins-slave/maven-agent.jar:/home/jenkins/jenkins-slave/classworlds.jar
hudson.maven.agent.Main /home/hudson/tools/maven/latest /home/jenkins/jenkins-slave/slave.jar
/home/jenkins/jenkins-slave/maven-interceptor.jar 55269 /home/jenkins/jenkins-slave/maven2.1-interceptor.jar
ERROR: Failed to parse POMs
java.io.IOException: Cannot run program "/home/hudson/tools/java/latest1.6/bin/java" (in directory
"<https://builds.apache.org/job/Tuscany-2x/ws/sca-2x")>: java.io.IOException: error=2,
No such file or directory
	at java.lang.ProcessBuilder.start(ProcessBuilder.java:459)
	at hudson.Proc$LocalProc.<init>(Proc.java:244)
	at hudson.Proc$LocalProc.<init>(Proc.java:216)
	at hudson.Launcher$LocalLauncher.launch(Launcher.java:698)
	at hudson.Launcher$ProcStarter.start(Launcher.java:329)
	at hudson.Launcher$RemoteLaunchCallable.call(Launcher.java:923)
	at hudson.Launcher$RemoteLaunchCallable.call(Launcher.java:890)
	at hudson.remoting.UserRequest.perform(UserRequest.java:118)
	at hudson.remoting.UserRequest.perform(UserRequest.java:48)
	at hudson.remoting.Request$2.run(Request.java:270)
	at java.util.concurrent.Executors$RunnableAdapter.call(Executors.java:441)
	at java.util.concurrent.FutureTask$Sync.innerRun(FutureTask.java:303)
	at java.util.concurrent.FutureTask.run(FutureTask.java:138)
	at java.util.concurrent.ThreadPoolExecutor$Worker.runTask(ThreadPoolExecutor.java:886)
	at java.util.concurrent.ThreadPoolExecutor$Worker.run(ThreadPoolExecutor.java:908)
	at java.lang.Thread.run(Thread.java:619)
Caused by: java.io.IOException: java.io.IOException: error=2, No such file or directory
	at java.lang.UNIXProcess.<init>(UNIXProcess.java:148)
	at java.lang.ProcessImpl.start(ProcessImpl.java:65)
	at java.lang.ProcessBuilder.start(ProcessBuilder.java:452)
	... 15 more


Mime
View raw message