tuscany-commits mailing list archives

Site index · List index
Message view « Date » · « Thread »
Top « Date » · « Thread »
From Apache Hudson Server <hud...@hudson.zones.apache.org>
Subject Build failed in Hudson: Tuscany-2x #259
Date Fri, 16 Oct 2009 06:36:23 GMT
See <http://hudson.zones.apache.org/hudson/job/Tuscany-2x/259/changes>

Changes:

[rfeng] This is to change the Monitor to be request scoped for most of the cases:
Refactor the ArtifactProcessor/ModelResolver to take a ProcessorContext that holds context
such as Monitor, Contribution for the contribution/artifact processing methods
Refactor the Builder to take a BuilderContext that holds context such as Monitor, Definitions,
Base binding mapping for the building methods
Change the processor/resolver/builder implementation classes to not cache the Monitor

------------------------------------------
[...truncated 2092 lines...]
SEVERE: Element {http://schemas.xmlsoap.org/ws/2004/09/policy}PolicyAttachment cannot be processed.
([row,col,system-id]: [86,17,"<http://hudson.zones.apache.org/hudson/job/Tuscany-2x/ws/sca/modules/assembly-xml/target/test-classes/org/apache/tuscany/sca/assembly/xml/test_definitions.xml"])>
Oct 16, 2009 6:35:30 AM org.apache.tuscany.sca.contribution.processor.ExtensibleStAXArtifactProcessor
[Definitions: <http://hudson.zones.apache.org/hudson/job/Tuscany-2x/ws/sca/modules/assembly-xml/target/test-classes/org/apache/tuscany/sca/assembly/xml/test_definitions.xml]>
(ElementCannotBeProcessed)
SEVERE: Element {http://schemas.xmlsoap.org/ws/2004/09/policy}PolicyAttachment cannot be processed.
([row,col,system-id]: [89,17,"<http://hudson.zones.apache.org/hudson/job/Tuscany-2x/ws/sca/modules/assembly-xml/target/test-classes/org/apache/tuscany/sca/assembly/xml/test_definitions.xml"])>
Oct 16, 2009 6:35:30 AM org.apache.tuscany.sca.contribution.processor.ExtensibleStAXArtifactProcessor
[Definitions: <http://hudson.zones.apache.org/hudson/job/Tuscany-2x/ws/sca/modules/assembly-xml/target/test-classes/org/apache/tuscany/sca/assembly/xml/test_definitions.xml]>
(ElementCannotBeProcessed)
SEVERE: Element {http://schemas.xmlsoap.org/ws/2004/09/policy}PolicyAttachment cannot be processed.
([row,col,system-id]: [94,17,"<http://hudson.zones.apache.org/hudson/job/Tuscany-2x/ws/sca/modules/assembly-xml/target/test-classes/org/apache/tuscany/sca/assembly/xml/test_definitions.xml"])>
Oct 16, 2009 6:35:30 AM org.apache.tuscany.sca.contribution.processor.ExtensibleStAXArtifactProcessor
[Definitions: <http://hudson.zones.apache.org/hudson/job/Tuscany-2x/ws/sca/modules/assembly-xml/target/test-classes/org/apache/tuscany/sca/assembly/xml/test_definitions.xml]>
(ElementCannotBeProcessed)
SEVERE: Element {http://schemas.xmlsoap.org/ws/2004/09/policy}PolicyAttachment cannot be processed.
([row,col,system-id]: [109,9,"<http://hudson.zones.apache.org/hudson/job/Tuscany-2x/ws/sca/modules/assembly-xml/target/test-classes/org/apache/tuscany/sca/assembly/xml/test_definitions.xml"])>
Oct 16, 2009 6:35:30 AM org.apache.tuscany.sca.contribution.processor.ExtensibleStAXArtifactProcessor
[Definitions: <http://hudson.zones.apache.org/hudson/job/Tuscany-2x/ws/sca/modules/assembly-xml/target/test-classes/org/apache/tuscany/sca/assembly/xml/test_definitions.xml]>
(ElementCannotBeProcessed)
SEVERE: Element {http://schemas.xmlsoap.org/ws/2004/09/policy}PolicyAttachment cannot be processed.
([row,col,system-id]: [119,17,"<http://hudson.zones.apache.org/hudson/job/Tuscany-2x/ws/sca/modules/assembly-xml/target/test-classes/org/apache/tuscany/sca/assembly/xml/test_definitions.xml"])>
Oct 16, 2009 6:35:30 AM org.apache.tuscany.sca.contribution.processor.ExtensibleStAXArtifactProcessor
[Definitions: <http://hudson.zones.apache.org/hudson/job/Tuscany-2x/ws/sca/modules/assembly-xml/target/test-classes/org/apache/tuscany/sca/assembly/xml/test_definitions.xml]>
(ElementCannotBeProcessed)
SEVERE: Element {http://schemas.xmlsoap.org/ws/2004/09/policy}PolicyAttachment cannot be processed.
([row,col,system-id]: [123,17,"<http://hudson.zones.apache.org/hudson/job/Tuscany-2x/ws/sca/modules/assembly-xml/target/test-classes/org/apache/tuscany/sca/assembly/xml/test_definitions.xml"])>
Oct 16, 2009 6:35:30 AM org.apache.tuscany.sca.contribution.processor.ExtensibleStAXArtifactProcessor
[Definitions: <http://hudson.zones.apache.org/hudson/job/Tuscany-2x/ws/sca/modules/assembly-xml/target/test-classes/org/apache/tuscany/sca/assembly/xml/test_definitions.xml]>
(ElementCannotBeProcessed)
SEVERE: Element {http://schemas.xmlsoap.org/ws/2004/09/policy}PolicyAttachment cannot be processed.
([row,col,system-id]: [126,17,"<http://hudson.zones.apache.org/hudson/job/Tuscany-2x/ws/sca/modules/assembly-xml/target/test-classes/org/apache/tuscany/sca/assembly/xml/test_definitions.xml"])>
Oct 16, 2009 6:35:30 AM org.apache.tuscany.sca.contribution.processor.ExtensibleStAXArtifactProcessor
[Definitions: <http://hudson.zones.apache.org/hudson/job/Tuscany-2x/ws/sca/modules/assembly-xml/target/test-classes/org/apache/tuscany/sca/assembly/xml/test_definitions.xml]>
(ElementCannotBeProcessed)
SEVERE: Element {http://schemas.xmlsoap.org/ws/2004/09/policy}Policy cannot be processed.
([row,col,system-id]: [138,9,"<http://hudson.zones.apache.org/hudson/job/Tuscany-2x/ws/sca/modules/assembly-xml/target/test-classes/org/apache/tuscany/sca/assembly/xml/test_definitions.xml"])>
Oct 16, 2009 6:35:30 AM org.apache.tuscany.sca.assembly.xml.CompositeProcessor [Composite:
{http://calc}TestAllCalculator] (ContributionResolveException)
SEVERE: ContributionResolveException occured due to : {0}
org.apache.tuscany.sca.contribution.processor.ContributionResolveException: Error: Composite
{http://calc}TestAllDivide is not a valid composite within the domain
	at org.apache.tuscany.sca.assembly.xml.CompositeProcessor.resolve(CompositeProcessor.java:973)
	at org.apache.tuscany.sca.assembly.xml.CompositeProcessor.resolve(CompositeProcessor.java:1)
	at org.apache.tuscany.sca.contribution.processor.DefaultStAXArtifactProcessorExtensionPoint$LazyStAXArtifactProcessor.resolve(DefaultStAXArtifactProcessorExtensionPoint.java:324)
	at org.apache.tuscany.sca.contribution.processor.ExtensibleStAXArtifactProcessor.resolve(ExtensibleStAXArtifactProcessor.java:203)
	at org.apache.tuscany.sca.assembly.xml.WriteAllTestCase.testReadWireWriteComposite(WriteAllTestCase.java:112)
	at sun.reflect.NativeMethodAccessorImpl.invoke0(Native Method)
	at sun.reflect.NativeMethodAccessorImpl.invoke(NativeMethodAccessorImpl.java:39)
	at sun.reflect.DelegatingMethodAccessorImpl.invoke(DelegatingMethodAccessorImpl.java:25)
	at java.lang.reflect.Method.invoke(Method.java:597)
	at org.junit.runners.model.FrameworkMethod$1.runReflectiveCall(FrameworkMethod.java:44)
	at org.junit.internal.runners.model.ReflectiveCallable.run(ReflectiveCallable.java:15)
	at org.junit.runners.model.FrameworkMethod.invokeExplosively(FrameworkMethod.java:41)
	at org.junit.internal.runners.statements.InvokeMethod.evaluate(InvokeMethod.java:20)
	at org.junit.internal.runners.statements.RunBefores.evaluate(RunBefores.java:28)
	at org.junit.internal.runners.statements.RunAfters.evaluate(RunAfters.java:31)
	at org.junit.runners.BlockJUnit4ClassRunner.runChild(BlockJUnit4ClassRunner.java:73)
	at org.junit.runners.BlockJUnit4ClassRunner.runChild(BlockJUnit4ClassRunner.java:46)
	at org.junit.runners.ParentRunner.runChildren(ParentRunner.java:180)
	at org.junit.runners.ParentRunner.access$000(ParentRunner.java:41)
	at org.junit.runners.ParentRunner$1.evaluate(ParentRunner.java:173)
	at org.junit.internal.runners.statements.RunBefores.evaluate(RunBefores.java:28)
	at org.junit.internal.runners.statements.RunAfters.evaluate(RunAfters.java:31)
	at org.junit.runners.ParentRunner.run(ParentRunner.java:220)
	at org.apache.maven.surefire.junit4.JUnit4TestSet.execute(JUnit4TestSet.java:62)
	at org.apache.maven.surefire.suite.AbstractDirectoryTestSuite.executeTestSet(AbstractDirectoryTestSuite.java:140)
	at org.apache.maven.surefire.suite.AbstractDirectoryTestSuite.execute(AbstractDirectoryTestSuite.java:127)
	at org.apache.maven.surefire.Surefire.run(Surefire.java:177)
	at sun.reflect.NativeMethodAccessorImpl.invoke0(Native Method)
	at sun.reflect.NativeMethodAccessorImpl.invoke(NativeMethodAccessorImpl.java:39)
	at sun.reflect.DelegatingMethodAccessorImpl.invoke(DelegatingMethodAccessorImpl.java:25)
	at java.lang.reflect.Method.invoke(Method.java:597)
	at org.apache.maven.surefire.booter.SurefireBooter.runSuitesInProcess(SurefireBooter.java:345)
	at org.apache.maven.surefire.booter.SurefireBooter.main(SurefireBooter.java:1009)
Oct 16, 2009 6:35:30 AM org.apache.tuscany.sca.contribution.processor.ExtensibleStAXArtifactProcessor
[] (ElementCannotBeProcessed)
SEVERE: Element {http://docs.oasis-open.org/ns/opencsa/sca/200903}interface.java cannot be
processed. ([row,col {unknown-source}]: [23,9])
Oct 16, 2009 6:35:30 AM org.apache.tuscany.sca.contribution.processor.ExtensibleStAXArtifactProcessor
[] (ElementCannotBeProcessed)
SEVERE: Element {http://docs.oasis-open.org/ns/opencsa/sca/200903}interface.java cannot be
processed. ([row,col {unknown-source}]: [27,9])
Oct 16, 2009 6:35:30 AM org.apache.tuscany.sca.contribution.processor.ExtensibleStAXArtifactProcessor
[] (ElementCannotBeProcessed)
SEVERE: Element {http://docs.oasis-open.org/ns/opencsa/sca/200903}interface.java cannot be
processed. ([row,col {unknown-source}]: [26,9])
Oct 16, 2009 6:35:30 AM org.apache.tuscany.sca.contribution.processor.ExtensibleStAXArtifactProcessor
[] (ElementCannotBeProcessed)
SEVERE: Element {http://docs.oasis-open.org/ns/opencsa/sca/200903}interface.java cannot be
processed. ([row,col {unknown-source}]: [30,9])
Tests run: 4, Failures: 0, Errors: 0, Skipped: 0, Time elapsed: 0.838 sec
Running org.apache.tuscany.sca.assembly.xml.ReadTestCase
Oct 16, 2009 6:35:30 AM org.apache.tuscany.sca.contribution.processor.ExtensibleStAXArtifactProcessor
[] (ElementCannotBeProcessed)
SEVERE: Element {http://docs.oasis-open.org/ns/opencsa/sca/200903}interface.java cannot be
processed. ([row,col {unknown-source}]: [27,9])
Oct 16, 2009 6:35:30 AM org.apache.tuscany.sca.contribution.processor.ExtensibleStAXArtifactProcessor
[] (ElementCannotBeProcessed)
SEVERE: Element {http://docs.oasis-open.org/ns/opencsa/sca/200903}implementation.java cannot
be processed. ([row,col {unknown-source}]: [31,3])
Oct 16, 2009 6:35:30 AM org.apache.tuscany.sca.contribution.processor.ExtensibleStAXArtifactProcessor
[] (ElementCannotBeProcessed)
SEVERE: Element {http://docs.oasis-open.org/ns/opencsa/sca/200903}implementation.java cannot
be processed. ([row,col {unknown-source}]: [39,9])
Oct 16, 2009 6:35:30 AM org.apache.tuscany.sca.contribution.processor.ExtensibleStAXArtifactProcessor
[] (ElementCannotBeProcessed)
SEVERE: Element {http://docs.oasis-open.org/ns/opencsa/sca/200903}implementation.java cannot
be processed. ([row,col {unknown-source}]: [43,9])
Oct 16, 2009 6:35:30 AM org.apache.tuscany.sca.contribution.processor.ExtensibleStAXArtifactProcessor
[] (ElementCannotBeProcessed)
SEVERE: Element {http://docs.oasis-open.org/ns/opencsa/sca/200903}implementation.java cannot
be processed. ([row,col {unknown-source}]: [47,9])
Oct 16, 2009 6:35:30 AM org.apache.tuscany.sca.contribution.processor.ExtensibleStAXArtifactProcessor
[] (ElementCannotBeProcessed)
SEVERE: Element {http://docs.oasis-open.org/ns/opencsa/sca/200903}implementation.java cannot
be processed. ([row,col {unknown-source}]: [51,9])
Oct 16, 2009 6:35:30 AM org.apache.tuscany.sca.contribution.processor.ExtensibleStAXArtifactProcessor
[] (ElementCannotBeProcessed)
SEVERE: Element {http://x}unknownElement cannot be processed. ([row,col {unknown-source}]:
[54,5])
Oct 16, 2009 6:35:30 AM org.apache.tuscany.sca.contribution.processor.ExtensibleStAXArtifactProcessor
[] (ElementCannotBeProcessed)
SEVERE: Element {http://docs.oasis-open.org/ns/opencsa/sca/200903}interface.java cannot be
processed. ([row,col {unknown-source}]: [23,9])
Oct 16, 2009 6:35:30 AM org.apache.tuscany.sca.contribution.processor.ExtensibleStAXArtifactProcessor
[] (ElementCannotBeProcessed)
SEVERE: Element {http://docs.oasis-open.org/ns/opencsa/sca/200903}interface.java cannot be
processed. ([row,col {unknown-source}]: [27,9])
Oct 16, 2009 6:35:30 AM org.apache.tuscany.sca.contribution.processor.ExtensibleStAXArtifactProcessor
[] (ElementCannotBeProcessed)
SEVERE: Element {http://docs.oasis-open.org/ns/opencsa/sca/200903}interface.java cannot be
processed. ([row,col {unknown-source}]: [26,9])
Oct 16, 2009 6:35:30 AM org.apache.tuscany.sca.contribution.processor.ExtensibleStAXArtifactProcessor
[] (ElementCannotBeProcessed)
SEVERE: Element {http://docs.oasis-open.org/ns/opencsa/sca/200903}interface.java cannot be
processed. ([row,col {unknown-source}]: [30,9])
Oct 16, 2009 6:35:30 AM org.apache.tuscany.sca.contribution.processor.ExtensibleStAXArtifactProcessor
[] (ElementCannotBeProcessed)
SEVERE: Element {http://docs.oasis-open.org/ns/opencsa/sca/200903}interface.java cannot be
processed. ([row,col {unknown-source}]: [27,9])
Oct 16, 2009 6:35:30 AM org.apache.tuscany.sca.contribution.processor.ExtensibleStAXArtifactProcessor
[] (ElementCannotBeProcessed)
SEVERE: Element {http://docs.oasis-open.org/ns/opencsa/sca/200903}implementation.java cannot
be processed. ([row,col {unknown-source}]: [31,3])
Oct 16, 2009 6:35:30 AM org.apache.tuscany.sca.contribution.processor.ExtensibleStAXArtifactProcessor
[] (ElementCannotBeProcessed)
SEVERE: Element {http://docs.oasis-open.org/ns/opencsa/sca/200903}implementation.java cannot
be processed. ([row,col {unknown-source}]: [39,9])
Oct 16, 2009 6:35:30 AM org.apache.tuscany.sca.contribution.processor.ExtensibleStAXArtifactProcessor
[] (ElementCannotBeProcessed)
SEVERE: Element {http://docs.oasis-open.org/ns/opencsa/sca/200903}implementation.java cannot
be processed. ([row,col {unknown-source}]: [43,9])
Oct 16, 2009 6:35:30 AM org.apache.tuscany.sca.contribution.processor.ExtensibleStAXArtifactProcessor
[] (ElementCannotBeProcessed)
SEVERE: Element {http://docs.oasis-open.org/ns/opencsa/sca/200903}implementation.java cannot
be processed. ([row,col {unknown-source}]: [47,9])
Oct 16, 2009 6:35:30 AM org.apache.tuscany.sca.contribution.processor.ExtensibleStAXArtifactProcessor
[] (ElementCannotBeProcessed)
SEVERE: Element {http://docs.oasis-open.org/ns/opencsa/sca/200903}implementation.java cannot
be processed. ([row,col {unknown-source}]: [51,9])
Oct 16, 2009 6:35:30 AM org.apache.tuscany.sca.contribution.processor.ExtensibleStAXArtifactProcessor
[] (ElementCannotBeProcessed)
SEVERE: Element {http://x}unknownElement cannot be processed. ([row,col {unknown-source}]:
[54,5])
Tests run: 4, Failures: 0, Errors: 0, Skipped: 0, Time elapsed: 0.025 sec
Running org.apache.tuscany.sca.definitions.xml.ReadDocumentTestCase
Oct 16, 2009 6:35:30 AM org.apache.tuscany.sca.contribution.processor.ExtensibleStAXArtifactProcessor
[Definitions: <http://hudson.zones.apache.org/hudson/job/Tuscany-2x/ws/sca/modules/assembly-xml/target/test-classes/org/apache/tuscany/sca/definitions/xml/test_definitions.xml]>
(ElementCannotBeProcessed)
SEVERE: Element {http://schemas.xmlsoap.org/ws/2004/09/policy}Policy cannot be processed.
([row,col,system-id]: [139,9,"<http://hudson.zones.apache.org/hudson/job/Tuscany-2x/ws/sca/modules/assembly-xml/target/test-classes/org/apache/tuscany/sca/definitions/xml/test_definitions.xml"])>
Tests run: 2, Failures: 0, Errors: 0, Skipped: 0, Time elapsed: 0.519 sec
Running org.apache.tuscany.sca.assembly.xml.ReadAllTestCase
Oct 16, 2009 6:35:30 AM org.apache.tuscany.sca.contribution.processor.ExtensibleStAXArtifactProcessor
[] (ElementCannotBeProcessed)
SEVERE: Element {http://extension}testExtension cannot be processed. ([row,col {unknown-source}]:
[30,5])
Oct 16, 2009 6:35:30 AM org.apache.tuscany.sca.contribution.processor.ExtensibleStAXArtifactProcessor
[] (ElementCannotBeProcessed)
SEVERE: Element {http://extension}testExtension cannot be processed. ([row,col {unknown-source}]:
[34,9])
Oct 16, 2009 6:35:30 AM org.apache.tuscany.sca.contribution.processor.ExtensibleStAXArtifactProcessor
[] (ElementCannotBeProcessed)
SEVERE: Element {http://docs.oasis-open.org/ns/opencsa/sca/200903}interface.java cannot be
processed. ([row,col {unknown-source}]: [35,9])
Oct 16, 2009 6:35:30 AM org.apache.tuscany.sca.contribution.processor.ExtensibleStAXArtifactProcessor
[] (ElementCannotBeProcessed)
SEVERE: Element {http://docs.oasis-open.org/ns/opencsa/sca/200903}operation cannot be processed.
([row,col {unknown-source}]: [36,9])
Oct 16, 2009 6:35:30 AM org.apache.tuscany.sca.contribution.processor.ExtensibleStAXArtifactProcessor
[] (ElementCannotBeProcessed)
SEVERE: Element {http://docs.oasis-open.org/ns/opencsa/sca/200903}binding.ws cannot be processed.
([row,col {unknown-source}]: [38,9])
Oct 16, 2009 6:35:30 AM org.apache.tuscany.sca.contribution.processor.ExtensibleStAXArtifactProcessor
[] (ElementCannotBeProcessed)
SEVERE: Element {http://extension}testExtension cannot be processed. ([row,col {unknown-source}]:
[42,10])
Oct 16, 2009 6:35:30 AM org.apache.tuscany.sca.contribution.processor.ExtensibleStAXArtifactProcessor
[] (ElementCannotBeProcessed)
SEVERE: Element {http://docs.oasis-open.org/ns/opencsa/sca/200903}binding.ws cannot be processed.
([row,col {unknown-source}]: [43,13])
Oct 16, 2009 6:35:30 AM org.apache.tuscany.sca.contribution.processor.ExtensibleStAXArtifactProcessor
[] (ElementCannotBeProcessed)
SEVERE: Element {http://extension}testExtension cannot be processed. ([row,col {unknown-source}]:
[50,9])
Oct 16, 2009 6:35:30 AM org.apache.tuscany.sca.contribution.processor.ExtensibleStAXArtifactProcessor
[] (ElementCannotBeProcessed)
SEVERE: Element {http://docs.oasis-open.org/ns/opencsa/sca/200903}interface.java cannot be
processed. ([row,col {unknown-source}]: [52,13])
Oct 16, 2009 6:35:30 AM org.apache.tuscany.sca.contribution.processor.ExtensibleStAXArtifactProcessor
[] (ElementCannotBeProcessed)
SEVERE: Element {http://extension}testExtension cannot be processed. ([row,col {unknown-source}]:
[57,13])
Oct 16, 2009 6:35:30 AM org.apache.tuscany.sca.contribution.processor.ExtensibleStAXArtifactProcessor
[] (ElementCannotBeProcessed)
SEVERE: Element {http://docs.oasis-open.org/ns/opencsa/sca/200903}interface.java cannot be
processed. ([row,col {unknown-source}]: [58,13])
Oct 16, 2009 6:35:30 AM org.apache.tuscany.sca.contribution.processor.ExtensibleStAXArtifactProcessor
[] (ElementCannotBeProcessed)
SEVERE: Element {http://docs.oasis-open.org/ns/opencsa/sca/200903}implementation.java cannot
be processed. ([row,col {unknown-source}]: [66,9])
Oct 16, 2009 6:35:30 AM org.apache.tuscany.sca.contribution.processor.ExtensibleStAXArtifactProcessor
[] (ElementCannotBeProcessed)
SEVERE: Element {http://docs.oasis-open.org/ns/opencsa/sca/200903}interface.java cannot be
processed. ([row,col {unknown-source}]: [71,13])
Oct 16, 2009 6:35:30 AM org.apache.tuscany.sca.contribution.processor.ExtensibleStAXArtifactProcessor
[] (ElementCannotBeProcessed)
SEVERE: Element {http://docs.oasis-open.org/ns/opencsa/sca/200903}implementation.java cannot
be processed. ([row,col {unknown-source}]: [73,9])
Oct 16, 2009 6:35:30 AM org.apache.tuscany.sca.contribution.processor.ExtensibleStAXArtifactProcessor
[] (ElementCannotBeProcessed)
SEVERE: Element {http://docs.oasis-open.org/ns/opencsa/sca/200903}interface.java cannot be
processed. ([row,col {unknown-source}]: [78,13])
Oct 16, 2009 6:35:30 AM org.apache.tuscany.sca.contribution.processor.ExtensibleStAXArtifactProcessor
[] (ElementCannotBeProcessed)
SEVERE: Element {http://docs.oasis-open.org/ns/opencsa/sca/200903}implementation.java cannot
be processed. ([row,col {unknown-source}]: [84,9])
Oct 16, 2009 6:35:30 AM org.apache.tuscany.sca.contribution.processor.ExtensibleStAXArtifactProcessor
[] (ElementCannotBeProcessed)
SEVERE: Element {http://docs.oasis-open.org/ns/opencsa/sca/200903}implementation.java cannot
be processed. ([row,col {unknown-source}]: [88,9])
Oct 16, 2009 6:35:30 AM org.apache.tuscany.sca.contribution.processor.ExtensibleStAXArtifactProcessor
[] (ElementCannotBeProcessed)
SEVERE: Element {http://docs.oasis-open.org/ns/opencsa/sca/200903}implementation.java cannot
be processed. ([row,col {unknown-source}]: [92,9])
Oct 16, 2009 6:35:30 AM org.apache.tuscany.sca.contribution.processor.ExtensibleStAXArtifactProcessor
[] (ElementCannotBeProcessed)
SEVERE: Element {http://docs.oasis-open.org/ns/opencsa/sca/200903}interface.java cannot be
processed. ([row,col {unknown-source}]: [97,9])
Oct 16, 2009 6:35:30 AM org.apache.tuscany.sca.contribution.processor.ExtensibleStAXArtifactProcessor
[] (ElementCannotBeProcessed)
SEVERE: Element {http://docs.oasis-open.org/ns/opencsa/sca/200903}binding.ws cannot be processed.
([row,col {unknown-source}]: [99,9])
Oct 16, 2009 6:35:30 AM org.apache.tuscany.sca.contribution.processor.ExtensibleStAXArtifactProcessor
[] (ElementCannotBeProcessed)
SEVERE: Element {http://docs.oasis-open.org/ns/opencsa/sca/200903}binding.ws cannot be processed.
([row,col {unknown-source}]: [103,13])
Tests run: 1, Failures: 0, Errors: 0, Skipped: 0, Time elapsed: 0.026 sec
Running org.apache.tuscany.sca.assembly.xml.MultiplicityReadWriteTestCase
Oct 16, 2009 6:35:30 AM org.apache.tuscany.sca.contribution.processor.ExtensibleStAXArtifactProcessor
[] (ElementCannotBeProcessed)
SEVERE: Element {http://docs.oasis-open.org/ns/opencsa/sca/200903}implementation.java cannot
be processed. ([row,col {unknown-source}]: [24,5])
Oct 16, 2009 6:35:30 AM org.apache.tuscany.sca.contribution.processor.ExtensibleStAXArtifactProcessor
[] (ElementCannotBeProcessed)
SEVERE: Element {http://docs.oasis-open.org/ns/opencsa/sca/200903}interface.wsdl cannot be
processed. ([row,col {unknown-source}]: [26,7])
Oct 16, 2009 6:35:30 AM org.apache.tuscany.sca.contribution.processor.ExtensibleStAXArtifactProcessor
[] (ElementCannotBeProcessed)
SEVERE: Element {http://docs.oasis-open.org/ns/opencsa/sca/200903}implementation.java cannot
be processed. ([row,col {unknown-source}]: [1,179])
Oct 16, 2009 6:35:30 AM org.apache.tuscany.sca.contribution.processor.ExtensibleStAXArtifactProcessor
[] (ElementCannotBeProcessed)
SEVERE: Element {http://docs.oasis-open.org/ns/opencsa/sca/200903}interface.wsdl cannot be
processed. ([row,col {unknown-source}]: [1,245])
Tests run: 1, Failures: 0, Errors: 0, Skipped: 0, Time elapsed: 0.015 sec

Results :

Tests run: 38, Failures: 0, Errors: 0, Skipped: 0

[HUDSON] Recording test results
[INFO] [jar:jar]
[INFO] Building jar: <http://hudson.zones.apache.org/hudson/job/Tuscany-2x/ws/sca/modules/assembly-xml/target/tuscany-assembly-xml-2.0-SNAPSHOT.jar>
[INFO] [install:install]
[INFO] Installing <http://hudson.zones.apache.org/hudson/job/Tuscany-2x/ws/sca/modules/assembly-xml/target/tuscany-assembly-xml-2.0-SNAPSHOT.jar>
to /export/home/hudson/.m2/repository/org/apache/tuscany/sca/tuscany-assembly-xml/2.0-SNAPSHOT/tuscany-assembly-xml-2.0-SNAPSHOT.jar
[HUDSON] Archiving <http://hudson.zones.apache.org/hudson/job/Tuscany-2x/ws/sca/modules/assembly-xml/pom.xml>
to /export/home/hudson/hudson/jobs/Tuscany-2x/modules/org.apache.tuscany.sca$tuscany-assembly-xml/builds/2009-10-16_06-33-09/archive/org.apache.tuscany.sca/tuscany-assembly-xml/2.0-SNAPSHOT/pom.xml
[HUDSON] Archiving <http://hudson.zones.apache.org/hudson/job/Tuscany-2x/ws/sca/modules/assembly-xml/target/tuscany-assembly-xml-2.0-SNAPSHOT.jar>
to /export/home/hudson/hudson/jobs/Tuscany-2x/modules/org.apache.tuscany.sca$tuscany-assembly-xml/builds/2009-10-16_06-33-09/archive/org.apache.tuscany.sca/tuscany-assembly-xml/2.0-SNAPSHOT/tuscany-assembly-xml-2.0-SNAPSHOT.jar
[INFO] ------------------------------------------------------------------------
[INFO] Building Apache Tuscany SCA Atom Feed Binding Extension
[INFO]    task-segment: [clean, install]
[INFO] ------------------------------------------------------------------------
[INFO] [clean:clean]
[INFO] Deleting directory <http://hudson.zones.apache.org/hudson/job/Tuscany-2x/ws/sca/modules/binding-atom/target>
[INFO] [resources:resources]
[INFO] Using default encoding to copy filtered resources.
[INFO] [compiler:compile]
[INFO] Invoking Tuscany Eclipse JDT compiler
[INFO] Compiling 4 to <http://hudson.zones.apache.org/hudson/job/Tuscany-2x/ws/sca/modules/binding-atom/target/classes>
[INFO] Resolving OSGi bundle: org.apache.tuscany.sca.binding.atom
[ERROR] --> [org.apache.tuscany.sca.binding.atom] Missing Constraint: Import-Package: org.apache.tuscany.sca.assembly.xml;
version="2.0.0"
[INFO] [resources:testResources]
[INFO] Using default encoding to copy filtered resources.
[INFO] [compiler:testCompile]
[INFO] Invoking Tuscany Eclipse JDT compiler
[INFO] Compiling 1 to <http://hudson.zones.apache.org/hudson/job/Tuscany-2x/ws/sca/modules/binding-atom/target/test-classes>
[INFO] [surefire:test]
[INFO] Surefire report directory: <http://hudson.zones.apache.org/hudson/job/Tuscany-2x/ws/sca/modules/binding-atom/target/surefire-reports>

-------------------------------------------------------
 T E S T S
-------------------------------------------------------
Running org.apache.tuscany.sca.binding.atom.AtomBindingProcessorTestCase
Oct 16, 2009 6:35:35 AM org.apache.tuscany.sca.contribution.processor.ExtensibleStAXArtifactProcessor
[] (ElementCannotBeProcessed)
SEVERE: Element {http://docs.oasis-open.org/ns/opencsa/sca/200903}implementation.java cannot
be processed. ([row,col {unknown-source}]: [1,263])
Tests run: 1, Failures: 0, Errors: 0, Skipped: 0, Time elapsed: 0.353 sec

Results :

Tests run: 1, Failures: 0, Errors: 0, Skipped: 0

[HUDSON] Recording test results
[INFO] [jar:jar]
[INFO] Building jar: <http://hudson.zones.apache.org/hudson/job/Tuscany-2x/ws/sca/modules/binding-atom/target/tuscany-binding-atom-2.0-SNAPSHOT.jar>
[INFO] [install:install]
[INFO] Installing <http://hudson.zones.apache.org/hudson/job/Tuscany-2x/ws/sca/modules/binding-atom/target/tuscany-binding-atom-2.0-SNAPSHOT.jar>
to /export/home/hudson/.m2/repository/org/apache/tuscany/sca/tuscany-binding-atom/2.0-SNAPSHOT/tuscany-binding-atom-2.0-SNAPSHOT.jar
[HUDSON] Archiving <http://hudson.zones.apache.org/hudson/job/Tuscany-2x/ws/sca/modules/binding-atom/pom.xml>
to /export/home/hudson/hudson/jobs/Tuscany-2x/modules/org.apache.tuscany.sca$tuscany-binding-atom/builds/2009-10-16_06-33-09/archive/org.apache.tuscany.sca/tuscany-binding-atom/2.0-SNAPSHOT/pom.xml
[HUDSON] Archiving <http://hudson.zones.apache.org/hudson/job/Tuscany-2x/ws/sca/modules/binding-atom/target/tuscany-binding-atom-2.0-SNAPSHOT.jar>
to /export/home/hudson/hudson/jobs/Tuscany-2x/modules/org.apache.tuscany.sca$tuscany-binding-atom/builds/2009-10-16_06-33-09/archive/org.apache.tuscany.sca/tuscany-binding-atom/2.0-SNAPSHOT/tuscany-binding-atom-2.0-SNAPSHOT.jar
[INFO] ------------------------------------------------------------------------
[INFO] Building Apache Tuscany SCA Interface Java Model
[INFO]    task-segment: [clean, install]
[INFO] ------------------------------------------------------------------------
[INFO] [clean:clean]
[INFO] Deleting directory <http://hudson.zones.apache.org/hudson/job/Tuscany-2x/ws/sca/modules/interface-java/target>
[INFO] [resources:resources]
[INFO] Using default encoding to copy filtered resources.
[INFO] [compiler:compile]
[INFO] Invoking Tuscany Eclipse JDT compiler
[INFO] Compiling 15 to <http://hudson.zones.apache.org/hudson/job/Tuscany-2x/ws/sca/modules/interface-java/target/classes>
[INFO] Resolving OSGi bundle: org.apache.tuscany.sca.interface.java
[INFO] OSGi bundle is resolved: org.apache.tuscany.sca.interface.java
[HUDSON] Archiving <http://hudson.zones.apache.org/hudson/job/Tuscany-2x/ws/sca/modules/interface-java/pom.xml>
to /export/home/hudson/hudson/jobs/Tuscany-2x/modules/org.apache.tuscany.sca$tuscany-interface-java/builds/2009-10-16_06-33-10/archive/org.apache.tuscany.sca/tuscany-interface-java/2.0-SNAPSHOT/pom.xml
[INFO] ------------------------------------------------------------------------
[ERROR] BUILD FAILURE
[INFO] ------------------------------------------------------------------------
[INFO] Compilation failure

org/apache/tuscany/sca/interfacedef/java/xml/JavaInterfaceProcessor.java:[253,11991] The method
error(Monitor, String, Object, Exception) in the type JavaInterfaceProcessor is not applicable
for the arguments (String, JavaInterfaceContract, Class<capture#11-of ? extends Annotation>,
String)
org/apache/tuscany/sca/interfacedef/java/xml/JavaInterfaceProcessor.java:[257,12251] The method
error(Monitor, String, Object, Exception) in the type JavaInterfaceProcessor is not applicable
for the arguments (String, JavaInterfaceContract, Class<capture#14-of ? extends Annotation>,
String)
org/apache/tuscany/sca/interfacedef/java/xml/JavaInterfaceProcessor.java:[266,12687] The method
error(Monitor, String, Object, Exception) in the type JavaInterfaceProcessor is not applicable
for the arguments (String, JavaInterfaceContract, Class<capture#19-of ? extends Annotation>,
String)
org/apache/tuscany/sca/interfacedef/java/xml/JavaInterfaceProcessor.java:[270,12947] The method
error(Monitor, String, Object, Exception) in the type JavaInterfaceProcessor is not applicable
for the arguments (String, JavaInterfaceContract, Class<capture#22-of ? extends Annotation>,
String)
org/apache/tuscany/sca/interfacedef/java/xml/JavaInterfaceProcessor.java:[279,13381] The method
error(Monitor, String, Object, Exception) in the type JavaInterfaceProcessor is not applicable
for the arguments (String, JavaInterfaceContract, Class<capture#27-of ? extends Annotation>,
String)
org/apache/tuscany/sca/interfacedef/java/xml/JavaInterfaceProcessor.java:[283,13641] The method
error(Monitor, String, Object, Exception) in the type JavaInterfaceProcessor is not applicable
for the arguments (String, JavaInterfaceContract, Class<capture#30-of ? extends Annotation>,
String)
org/apache/tuscany/sca/interfacedef/java/xml/JavaInterfaceProcessor.java:[296,14255] The method
error(Monitor, String, Object, Exception) in the type JavaInterfaceProcessor is not applicable
for the arguments (String, JavaInterfaceContract, Class<capture#37-of ? extends Annotation>,
String)
org/apache/tuscany/sca/interfacedef/java/xml/JavaInterfaceProcessor.java:[300,14515] The method
error(Monitor, String, Object, Exception) in the type JavaInterfaceProcessor is not applicable
for the arguments (String, JavaInterfaceContract, Class<capture#40-of ? extends Annotation>,
String)
org/apache/tuscany/sca/interfacedef/java/xml/JavaInterfaceProcessor.java:[309,14951] The method
error(Monitor, String, Object, Exception) in the type JavaInterfaceProcessor is not applicable
for the arguments (String, JavaInterfaceContract, Class<capture#45-of ? extends Annotation>,
String)
org/apache/tuscany/sca/interfacedef/java/xml/JavaInterfaceProcessor.java:[313,15211] The method
error(Monitor, String, Object, Exception) in the type JavaInterfaceProcessor is not applicable
for the arguments (String, JavaInterfaceContract, Class<capture#48-of ? extends Annotation>,
String)
org/apache/tuscany/sca/interfacedef/java/xml/JavaInterfaceProcessor.java:[322,15645] The method
error(Monitor, String, Object, Exception) in the type JavaInterfaceProcessor is not applicable
for the arguments (String, JavaInterfaceContract, Class<capture#53-of ? extends Annotation>,
String)
org/apache/tuscany/sca/interfacedef/java/xml/JavaInterfaceProcessor.java:[326,15905] The method
error(Monitor, String, Object, Exception) in the type JavaInterfaceProcessor is not applicable
for the arguments (String, JavaInterfaceContract, Class<capture#56-of ? extends Annotation>,
String)

[INFO] ------------------------------------------------------------------------
[INFO] For more information, run Maven with the -e switch
[INFO] ------------------------------------------------------------------------
[INFO] Total time: 2 minutes 9 seconds
[INFO] Finished at: Fri Oct 16 06:35:39 UTC 2009
[INFO] Final Memory: 31M/752M
[INFO] ------------------------------------------------------------------------
Sending e-mails to: commits@tuscany.apache.org
channel stopped


Mime
View raw message