tuscany-commits mailing list archives

Site index · List index
Message view « Date » · « Thread »
Top « Date » · « Thread »
From Apache Hudson Server <hud...@hudson.zones.apache.org>
Subject Build failed in Hudson: Tuscany-SCA-J-CAA #1
Date Thu, 22 Oct 2009 09:56:15 GMT
See <http://hudson.zones.apache.org/hudson/job/Tuscany-SCA-J-CAA/1/>

------------------------------------------
[...truncated 3929 lines...]
A         sca-java-caa/JCA_10010/src/main
A         sca-java-caa/JCA_10010/src/main/java
A         sca-java-caa/JCA_10010/src/main/java/org
A         sca-java-caa/JCA_10010/src/main/java/org/oasisopen
A         sca-java-caa/JCA_10010/src/main/java/org/oasisopen/sca
A         sca-java-caa/JCA_10010/src/main/java/org/oasisopen/sca/test
A         sca-java-caa/JCA_10010/src/main/java/org/oasisopen/sca/test/service1ConstrBadPropImpl.java
A         sca-java-caa/JCA_10010/src/main/resources
A         sca-java-caa/JCA_10010/src/main/resources/META-INF
A         sca-java-caa/JCA_10010/src/main/resources/META-INF/sca-contribution.xml
A         sca-java-caa/JCA_10010/src/main/resources/Test_JCA_10010.composite
A         sca-java-caa/JCA_10010/pom.xml
At revision 99
Fetching 'https://svn.apache.org/repos/asf/tuscany/java/sca/otest/newlayout/tuscany-java-caa-test-runner'
at -1 into '/zonestorage/hudson/home/hudson/hudson/jobs/Tuscany-SCA-J-CAA/workspace/scajcaa/tuscany-java-caa-test-runner'
A         tuscany-java-caa-test-runner/src
A         tuscany-java-caa-test-runner/src/test
A         tuscany-java-caa-test-runner/src/test/java
A         tuscany-java-caa-test-runner/src/test/tjava
A         tuscany-java-caa-test-runner/src/test/tjava/org
A         tuscany-java-caa-test-runner/src/test/tjava/org/apache
A         tuscany-java-caa-test-runner/src/test/tjava/org/apache/tuscany
A         tuscany-java-caa-test-runner/src/test/tjava/org/apache/tuscany/sca
A         tuscany-java-caa-test-runner/src/test/tjava/org/apache/tuscany/sca/otest
AU        tuscany-java-caa-test-runner/src/test/tjava/org/apache/tuscany/sca/otest/TuscanyRuntimeBridge.java
AU        tuscany-java-caa-test-runner/src/test/tjava/org/apache/tuscany/sca/otest/TuscanyOSGiRuntimeBridge.java
A         tuscany-java-caa-test-runner/src/test/resources
AU        tuscany-java-caa-test-runner/src/test/resources/tuscany-oasis-sca-tests-errors.properties
AU        tuscany-java-caa-test-runner/src/test/resources/oasis-sca-tests.properties
A         tuscany-java-caa-test-runner/src/main
A         tuscany-java-caa-test-runner/src/main/resources
AU        tuscany-java-caa-test-runner/pom.xml
 U        tuscany-java-caa-test-runner
At revision 828627
Fetching 'http://tools.oasis-open.org/version-control/svn/sca-assembly/TestCases/Test_Client'
at -1 into '/zonestorage/hudson/home/hudson/hudson/jobs/Tuscany-SCA-J-CAA/workspace/scajcaa/sca-assembly/Test_Client'
A         sca-assembly/Test_Client/META-INF
A         sca-assembly/Test_Client/META-INF/MANIFEST.MF
A         sca-assembly/Test_Client/src
A         sca-assembly/Test_Client/src/main
A         sca-assembly/Test_Client/src/main/java
A         sca-assembly/Test_Client/src/main/java/client
AU        sca-assembly/Test_Client/src/main/java/client/ASM_12005_TestCase.java
AU        sca-assembly/Test_Client/src/main/java/client/ASM_12009_TestCase.java
AU        sca-assembly/Test_Client/src/main/java/client/ASM_5010_TestCase.java
AU        sca-assembly/Test_Client/src/main/java/client/ASM_6001_TestCase.java
AU        sca-assembly/Test_Client/src/main/java/client/ASM_6020_TestCase.java
AU        sca-assembly/Test_Client/src/main/java/client/ASM_4004_TestCase.java
AU        sca-assembly/Test_Client/src/main/java/client/ASM_8002_TestCase.java
AU        sca-assembly/Test_Client/src/main/java/client/ASM_5014_TestCase.java
AU        sca-assembly/Test_Client/src/main/java/client/ASM_6005_TestCase.java
AU        sca-assembly/Test_Client/src/main/java/client/ASM_5033_TestCase.java
AU        sca-assembly/Test_Client/src/main/java/client/ASM_6024_TestCase.java
AU        sca-assembly/Test_Client/src/main/java/client/ASM_4008_TestCase.java
AU        sca-assembly/Test_Client/src/main/java/client/ASM_8006_TestCase.java
AU        sca-assembly/Test_Client/src/main/java/client/ASM_5018_TestCase.java
AU        sca-assembly/Test_Client/src/main/java/client/ASM_6009_TestCase.java
AU        sca-assembly/Test_Client/src/main/java/client/ASM_5037_TestCase.java
AU        sca-assembly/Test_Client/src/main/java/client/ASM_6028_TestCase.java
AU        sca-assembly/Test_Client/src/main/java/client/ASM_12010_TestCase.java
AU        sca-assembly/Test_Client/src/main/java/client/ASM_13001_TestCase.java
AU        sca-assembly/Test_Client/src/main/java/client/ASM_13005_TestCase.java
AU        sca-assembly/Test_Client/src/main/java/client/ASM_6010_TestCase.java
AU        sca-assembly/Test_Client/src/main/java/client/ASM_7001_TestCase.java
AU        sca-assembly/Test_Client/src/main/java/client/ASM_5004_TestCase.java
AU        sca-assembly/Test_Client/src/main/java/client/ASM_5023_TestCase.java
AU        sca-assembly/Test_Client/src/main/java/client/ASM_8011_TestCase.java
AU        sca-assembly/Test_Client/src/main/java/client/ASM_9002_TestCase.java
AU        sca-assembly/Test_Client/src/main/java/client/ASM_6014_TestCase.java
AU        sca-assembly/Test_Client/src/main/java/client/ASM_6033_TestCase.java
AU        sca-assembly/Test_Client/src/main/java/client/ASM_7005_TestCase.java
AU        sca-assembly/Test_Client/src/main/java/client/ASM_5008_TestCase.java
AU        sca-assembly/Test_Client/src/main/java/client/ASM_5027_TestCase.java
AU        sca-assembly/Test_Client/src/main/java/client/ASM_8015_TestCase.java
AU        sca-assembly/Test_Client/src/main/java/client/ASM_6018_TestCase.java
AU        sca-assembly/Test_Client/src/main/java/client/ASM_7009_TestCase.java
AU        sca-assembly/Test_Client/src/main/java/client/ASM_8019_TestCase.java
AU        sca-assembly/Test_Client/src/main/java/client/ASM_10003_TestCase.java
AU        sca-assembly/Test_Client/src/main/java/client/ASM_12004_TestCase.java
AU        sca-assembly/Test_Client/src/main/java/client/ASM_12008_TestCase.java
AU        sca-assembly/Test_Client/src/main/java/client/TestConfiguration.java
AU        sca-assembly/Test_Client/src/main/java/client/TuscanyRuntimeBridge.java
AU        sca-assembly/Test_Client/src/main/java/client/ASM_4003_TestCase.java
AU        sca-assembly/Test_Client/src/main/java/client/ASM_7010_TestCase.java
AU        sca-assembly/Test_Client/src/main/java/client/ASM_8001_TestCase.java
AU        sca-assembly/Test_Client/src/main/java/client/ASM_5013_TestCase.java
AU        sca-assembly/Test_Client/src/main/java/client/ASM_6004_TestCase.java
AU        sca-assembly/Test_Client/src/main/java/client/ASM_5032_TestCase.java
AU        sca-assembly/Test_Client/src/main/java/client/ASM_6023_TestCase.java
AU        sca-assembly/Test_Client/src/main/java/client/ASM_4007_TestCase.java
AU        sca-assembly/Test_Client/src/main/java/client/ASM_8005_TestCase.java
AU        sca-assembly/Test_Client/src/main/java/client/ASM_5017_TestCase.java
AU        sca-assembly/Test_Client/src/main/java/client/ASM_6008_TestCase.java
AU        sca-assembly/Test_Client/src/main/java/client/ASM_5036_TestCase.java
AU        sca-assembly/Test_Client/src/main/java/client/ASM_6027_TestCase.java
AU        sca-assembly/Test_Client/src/main/java/client/ASM_8009_TestCase.java
AU        sca-assembly/Test_Client/src/main/java/client/ASM_12013_TestCase.java
AU        sca-assembly/Test_Client/src/main/java/client/ASM_13004_TestCase.java
AU        sca-assembly/Test_Client/src/main/java/client/ASM_13008_TestCase.java
AU        sca-assembly/Test_Client/src/main/java/client/ASM_9999_TestCase.java
AU        sca-assembly/Test_Client/src/main/java/client/ASM_5003_TestCase.java
AU        sca-assembly/Test_Client/src/main/java/client/ASM_8010_TestCase.java
AU        sca-assembly/Test_Client/src/main/java/client/ASM_5022_TestCase.java
AU        sca-assembly/Test_Client/src/main/java/client/ASM_6013_TestCase.java
AU        sca-assembly/Test_Client/src/main/java/client/ASM_9001_TestCase.java
AU        sca-assembly/Test_Client/src/main/java/client/ASM_6032_TestCase.java
AU        sca-assembly/Test_Client/src/main/java/client/ASM_7004_TestCase.java
AU        sca-assembly/Test_Client/src/main/java/client/ASM_5007_TestCase.java
AU        sca-assembly/Test_Client/src/main/java/client/ASM_5026_TestCase.java
AU        sca-assembly/Test_Client/src/main/java/client/ASM_8014_TestCase.java
AU        sca-assembly/Test_Client/src/main/java/client/ASM_6017_TestCase.java
AU        sca-assembly/Test_Client/src/main/java/client/ASM_7008_TestCase.java
AU        sca-assembly/Test_Client/src/main/java/client/ASM_8018_TestCase.java
AU        sca-assembly/Test_Client/src/main/java/client/ASM_10002_TestCase.java
AU        sca-assembly/Test_Client/src/main/java/client/ASM_12003_TestCase.java
AU        sca-assembly/Test_Client/src/main/java/client/ASM_12007_TestCase.java
AU        sca-assembly/Test_Client/src/main/java/client/ASM_4002_TestCase.java
AU        sca-assembly/Test_Client/src/main/java/client/ASM_5012_TestCase.java
AU        sca-assembly/Test_Client/src/main/java/client/BaseJAXWSTestCase.java
AU        sca-assembly/Test_Client/src/main/java/client/ASM_5031_TestCase.java
AU        sca-assembly/Test_Client/src/main/java/client/ASM_6003_TestCase.java
AU        sca-assembly/Test_Client/src/main/java/client/ASM_4006_TestCase.java
AU        sca-assembly/Test_Client/src/main/java/client/ASM_6022_TestCase.java
AU        sca-assembly/Test_Client/src/main/java/client/ASM_5016_TestCase.java
AU        sca-assembly/Test_Client/src/main/java/client/ASM_8004_TestCase.java
AU        sca-assembly/Test_Client/src/main/java/client/ASM_5035_TestCase.java
AU        sca-assembly/Test_Client/src/main/java/client/ASM_6007_TestCase.java
AU        sca-assembly/Test_Client/src/main/java/client/ASM_6026_TestCase.java
AU        sca-assembly/Test_Client/src/main/java/client/ASM_8008_TestCase.java
AU        sca-assembly/Test_Client/src/main/java/client/ASM_12012_TestCase.java
AU        sca-assembly/Test_Client/src/main/java/client/ASM_13003_TestCase.java
AU        sca-assembly/Test_Client/src/main/java/client/ASM_13007_TestCase.java
AU        sca-assembly/Test_Client/src/main/java/client/ASM_5002_TestCase.java
AU        sca-assembly/Test_Client/src/main/java/client/ASM_5021_TestCase.java
AU        sca-assembly/Test_Client/src/main/java/client/ASM_6012_TestCase.java
AU        sca-assembly/Test_Client/src/main/java/client/ASM_6031_TestCase.java
AU        sca-assembly/Test_Client/src/main/java/client/ASM_7003_TestCase.java
AU        sca-assembly/Test_Client/src/main/java/client/ASM_5006_TestCase.java
AU        sca-assembly/Test_Client/src/main/java/client/ASM_5025_TestCase.java
AU        sca-assembly/Test_Client/src/main/java/client/ASM_8013_TestCase.java
AU        sca-assembly/Test_Client/src/main/java/client/ASM_9004_TestCase.java
AU        sca-assembly/Test_Client/src/main/java/client/ASM_6016_TestCase.java
AU        sca-assembly/Test_Client/src/main/java/client/ASM_7007_TestCase.java
AU        sca-assembly/Test_Client/src/main/java/client/ASM_5029_TestCase.java
AU        sca-assembly/Test_Client/src/main/java/client/ASM_8017_TestCase.java
AU        sca-assembly/Test_Client/src/main/java/client/AllTests.java
AU        sca-assembly/Test_Client/src/main/java/client/ASM_10001_TestCase.java
AU        sca-assembly/Test_Client/src/main/java/client/ASM_12002_TestCase.java
AU        sca-assembly/Test_Client/src/main/java/client/ASM_12006_TestCase.java
AU        sca-assembly/Test_Client/src/main/java/client/ASM_4001_TestCase.java
AU        sca-assembly/Test_Client/src/main/java/client/ASM_5011_TestCase.java
AU        sca-assembly/Test_Client/src/main/java/client/ASM_5030_TestCase.java
AU        sca-assembly/Test_Client/src/main/java/client/ASM_6002_TestCase.java
AU        sca-assembly/Test_Client/src/main/java/client/ASM_4005_TestCase.java
AU        sca-assembly/Test_Client/src/main/java/client/ASM_6021_TestCase.java
AU        sca-assembly/Test_Client/src/main/java/client/ASM_5015_TestCase.java
AU        sca-assembly/Test_Client/src/main/java/client/ASM_8003_TestCase.java
AU        sca-assembly/Test_Client/src/main/java/client/ASM_5034_TestCase.java
AU        sca-assembly/Test_Client/src/main/java/client/ASM_6006_TestCase.java
AU        sca-assembly/Test_Client/src/main/java/client/ASM_6025_TestCase.java
AU        sca-assembly/Test_Client/src/main/java/client/ASM_5019_TestCase.java
AU        sca-assembly/Test_Client/src/main/java/client/ASM_8007_TestCase.java
AU        sca-assembly/Test_Client/src/main/java/client/ASM_6029_TestCase.java
AU        sca-assembly/Test_Client/src/main/java/client/ASM_12011_TestCase.java
AU        sca-assembly/Test_Client/src/main/java/client/RuntimeBridge.java
AU        sca-assembly/Test_Client/src/main/java/client/ASM_13002_TestCase.java
AU        sca-assembly/Test_Client/src/main/java/client/ASM_13006_TestCase.java
AU        sca-assembly/Test_Client/src/main/java/client/ASM_5020_TestCase.java
AU        sca-assembly/Test_Client/src/main/java/client/ASM_6011_TestCase.java
AU        sca-assembly/Test_Client/src/main/java/client/ASM_7002_TestCase.java
AU        sca-assembly/Test_Client/src/main/java/client/ASM_6030_TestCase.java
AU        sca-assembly/Test_Client/src/main/java/client/ASM_5005_TestCase.java
AU        sca-assembly/Test_Client/src/main/java/client/ASM_8012_TestCase.java
AU        sca-assembly/Test_Client/src/main/java/client/ASM_5024_TestCase.java
AU        sca-assembly/Test_Client/src/main/java/client/ASM_6015_TestCase.java
AU        sca-assembly/Test_Client/src/main/java/client/ASM_9003_TestCase.java
AU        sca-assembly/Test_Client/src/main/java/client/ASM_7006_TestCase.java
AU        sca-assembly/Test_Client/src/main/java/client/ASM_5009_TestCase.java
AU        sca-assembly/Test_Client/src/main/java/client/ASM_8016_TestCase.java
AU        sca-assembly/Test_Client/src/main/java/client/ASM_5028_TestCase.java
AU        sca-assembly/Test_Client/src/main/java/client/ASM_6019_TestCase.java
AU        sca-assembly/Test_Client/src/main/java/client/ASM_12001_TestCase.java
A         sca-assembly/Test_Client/src/main/java/testClient
AU        sca-assembly/Test_Client/src/main/java/testClient/package-info.java
AU        sca-assembly/Test_Client/src/main/java/testClient/TestInvocation.java
AU        sca-assembly/Test_Client/src/main/java/testClient/InvokeTestResponse.java
AU        sca-assembly/Test_Client/src/main/java/testClient/TestInvocationService.java
AU        sca-assembly/Test_Client/src/main/java/testClient/InvokeTest.java
AU        sca-assembly/Test_Client/src/main/java/testClient/README.txt
AU        sca-assembly/Test_Client/src/main/java/testClient/TestException_Exception.java
AU        sca-assembly/Test_Client/src/main/java/testClient/ObjectFactory.java
AU        sca-assembly/Test_Client/src/main/java/testClient/TestException.java
A         sca-assembly/Test_Client/src/main/resources
A         sca-assembly/Test_Client/src/main/resources/META-INF
A         sca-assembly/Test_Client/src/main/resources/META-INF/MANIFEST.MF
AU        sca-assembly/Test_Client/src/main/resources/TestInvocation.wsdl
AU        sca-assembly/Test_Client/src/main/resources/TestClient.wsdl
AU        sca-assembly/Test_Client/src/main/resources/commons-logging.properties
AU        sca-assembly/Test_Client/src/main/resources/log4j.properties
AU        sca-assembly/Test_Client/src/main/resources/openjpa.xml
AU        sca-assembly/Test_Client/src/main/resources/tuscany-oasis-sca-tests-errors.properties
AU        sca-assembly/Test_Client/src/main/resources/oasis-sca-tests.properties
AU        sca-assembly/Test_Client/pom.xml
 U        sca-assembly/Test_Client
At revision 372
At revision 828627
Parsing POMs
ERROR: Failed to parse POMs
org.apache.maven.project.ProjectBuildingException: Cannot find parent: org.oasis-open.sca.assembly:assembly-modules
for project: null:Test_Client:jar:null for project null:Test_Client:jar:null
	at org.apache.maven.project.DefaultMavenProjectBuilder.assembleLineage(DefaultMavenProjectBuilder.java:1370)
	at org.apache.maven.project.DefaultMavenProjectBuilder.buildInternal(DefaultMavenProjectBuilder.java:821)
	at org.apache.maven.project.DefaultMavenProjectBuilder.buildFromSourceFileInternal(DefaultMavenProjectBuilder.java:506)
	at org.apache.maven.project.DefaultMavenProjectBuilder.build(DefaultMavenProjectBuilder.java:215)
	at hudson.maven.MavenEmbedder.readProject(MavenEmbedder.java:334)
	at hudson.maven.MavenUtil.resolveModules(MavenUtil.java:187)
	at hudson.maven.MavenModuleSetBuild$PomParser.invoke(MavenModuleSetBuild.java:861)
	at hudson.maven.MavenModuleSetBuild$PomParser.invoke(MavenModuleSetBuild.java:784)
	at hudson.FilePath.act(FilePath.java:676)
	at hudson.FilePath.act(FilePath.java:660)
	at hudson.maven.MavenModuleSetBuild$RunnerImpl.parsePoms(MavenModuleSetBuild.java:530)
	at hudson.maven.MavenModuleSetBuild$RunnerImpl.doRun(MavenModuleSetBuild.java:390)
	at hudson.model.AbstractBuild$AbstractRunner.run(AbstractBuild.java:354)
	at hudson.model.Run.run(Run.java:1120)
	at hudson.maven.MavenModuleSetBuild.run(MavenModuleSetBuild.java:303)
	at hudson.model.ResourceController.execute(ResourceController.java:88)
	at hudson.model.Executor.run(Executor.java:123)
Caused by: org.apache.maven.project.ProjectBuildingException: POM 'org.oasis-open.sca.assembly:assembly-modules'
not found in repository: Unable to download the artifact from any repository

  org.oasis-open.sca.assembly:assembly-modules:pom:1.0

from the specified remote repositories:
  central (http://repo1.maven.org/maven2)
 for project org.oasis-open.sca.assembly:assembly-modules
	at org.apache.maven.project.DefaultMavenProjectBuilder.findModelFromRepository(DefaultMavenProjectBuilder.java:603)
	at org.apache.maven.project.DefaultMavenProjectBuilder.assembleLineage(DefaultMavenProjectBuilder.java:1366)
	... 16 more
Caused by: org.apache.maven.artifact.resolver.ArtifactNotFoundException: Unable to download
the artifact from any repository

  org.oasis-open.sca.assembly:assembly-modules:pom:1.0

from the specified remote repositories:
  central (http://repo1.maven.org/maven2)

	at org.apache.maven.artifact.resolver.DefaultArtifactResolver.resolve(DefaultArtifactResolver.java:212)
	at org.apache.maven.artifact.resolver.DefaultArtifactResolver.resolve(DefaultArtifactResolver.java:74)
	at org.apache.maven.project.DefaultMavenProjectBuilder.findModelFromRepository(DefaultMavenProjectBuilder.java:556)
	... 17 more
Caused by: org.apache.maven.wagon.ResourceDoesNotExistException: Unable to download the artifact
from any repository
	at org.apache.maven.artifact.manager.DefaultWagonManager.getArtifact(DefaultWagonManager.java:331)
	at org.apache.maven.artifact.resolver.DefaultArtifactResolver.resolve(DefaultArtifactResolver.java:200)
	... 19 more


Mime
View raw message