turbine-dev mailing list archives

Site index · List index
Message view « Date » · « Thread »
Top « Date » · « Thread »
From fulcrum-yaafi development <...@turbine.apache.org>
Subject [GUMP@vmgump]: Project fulcrum-yaafi-crypto (in module turbine-fulcrum) failed
Date Thu, 02 Dec 2010 09:00:28 GMT
To whom it may engage...
        
This is an automated request, but not an unsolicited one. For 
more information please visit http://gump.apache.org/nagged.html, 
and/or contact the folk at general@gump.apache.org.

Project fulcrum-yaafi-crypto has an issue affecting its community integration.
This issue affects 27 projects,
 and has been outstanding for 168 runs.
The current state of this project is 'Failed', with reason 'Build Failed'.
For reference only, the following projects are affected by this:
    - fulcrum-bsf :  Services Framework
    - fulcrum-cache :  Services Framework
    - fulcrum-cache-test :  Services Framework
    - fulcrum-configuration-impl :  Services Framework
    - fulcrum-crypto :  Services Framework
    - fulcrum-dvsl :  Services Framework
    - fulcrum-factory :  Services Framework
    - fulcrum-hsqldb :  Services Framework
    - fulcrum-intake :  Services Framework
    - fulcrum-localization :  Services Framework
    - fulcrum-mimetype :  Services Framework
    - fulcrum-naming :  Services Framework
    - fulcrum-osworkflow :  Services Framework
    - fulcrum-parser :  Services Framework
    - fulcrum-pool :  Services Framework
    - fulcrum-quartz :  Services Framework
    - fulcrum-quartz-test :  Services Framework
    - fulcrum-security-memory :  Services Framework
    - fulcrum-security-nt :  Services Framework
    - fulcrum-testcontainer :  Services Framework
    - fulcrum-upload :  Services Framework
    - fulcrum-xmlrpc :  Services Framework
    - fulcrum-xslt :  Services Framework
    - fulcrum-yaafi :  Services Framework
    - fulcrum-yaafi-crypto :  Services Framework
    - fulcrum_fulcrum-testcontainer :  Services Framework
    - fulcrum_fulcrum-yaafi :  Services Framework


Full details are available at:
    http://vmgump.apache.org/gump/public/turbine-fulcrum/fulcrum-yaafi-crypto/index.html

That said, some information snippets are provided here.

The following annotations (debug/informational/warning/error messages) were provided:
 -DEBUG- Sole jar output [fulcrum-yaafi-crypto-1.0.7-SNAPSHOT.jar] identifier set to project
name
 -DEBUG- (Apache Gump generated) Apache Maven Settings in: /srv/gump/public/workspace/turbine-fulcrum/yaafi-crypto/gump_mvn_settings.xml
 -INFO- Failed with reason build failed
 -DEBUG- Maven POM in: /srv/gump/public/workspace/turbine-fulcrum/yaafi-crypto/pom.xml
 -DEBUG- Extracted fallback artifacts from Gump Repository



The following work was performed:
http://vmgump.apache.org/gump/public/turbine-fulcrum/fulcrum-yaafi-crypto/gump_work/build_turbine-fulcrum_fulcrum-yaafi-crypto.html
Work Name: build_turbine-fulcrum_fulcrum-yaafi-crypto (Type: Build)
Work ended in a state of : Failed
Elapsed: 4 mins
Command Line: /opt/maven2/bin/mvn --batch-mode --settings /srv/gump/public/workspace/turbine-fulcrum/yaafi-crypto/gump_mvn_settings.xml
package 
[Working Directory: /srv/gump/public/workspace/turbine-fulcrum/yaafi-crypto]
M2_HOME: /opt/maven2
---------------------------------------------
[WARNING] *** CHECKSUM FAILED - Checksum failed on download: local = 'd3da43ced39ee7454e34d2caeb1ee215cde0bd4d';
remote = '<html>
<head>
' - IGNORING
[INFO] ------------------------------------------------------------------------
[ERROR] FATAL ERROR
[INFO] ------------------------------------------------------------------------
[INFO] Error building POM (may not be this project's POM).


Project ID: null:fulcrum-yaafi-crypto:jar:1.0.7-SNAPSHOT

Reason: Cannot find parent: org.apache.fulcrum:fulcrum-parent for project: null:fulcrum-yaafi-crypto:jar:1.0.7-SNAPSHOT
for project null:fulcrum-yaafi-crypto:jar:1.0.7-SNAPSHOT


[INFO] ------------------------------------------------------------------------
[INFO] Trace
org.apache.maven.reactor.MavenExecutionException: Cannot find parent: org.apache.fulcrum:fulcrum-parent
for project: null:fulcrum-yaafi-crypto:jar:1.0.7-SNAPSHOT for project null:fulcrum-yaafi-crypto:jar:1.0.7-SNAPSHOT
	at org.apache.maven.DefaultMaven.getProjects(DefaultMaven.java:404)
	at org.apache.maven.DefaultMaven.doExecute(DefaultMaven.java:272)
	at org.apache.maven.DefaultMaven.execute(DefaultMaven.java:138)
	at org.apache.maven.cli.MavenCli.main(MavenCli.java:362)
	at org.apache.maven.cli.compat.CompatibleMain.main(CompatibleMain.java:60)
	at sun.reflect.NativeMethodAccessorImpl.invoke0(Native Method)
	at sun.reflect.NativeMethodAccessorImpl.invoke(NativeMethodAccessorImpl.java:57)
	at sun.reflect.DelegatingMethodAccessorImpl.invoke(DelegatingMethodAccessorImpl.java:43)
	at java.lang.reflect.Method.invoke(Method.java:616)
	at org.codehaus.classworlds.Launcher.launchEnhanced(Launcher.java:315)
	at org.codehaus.classworlds.Launcher.launch(Launcher.java:255)
	at org.codehaus.classworlds.Launcher.mainWithExitCode(Launcher.java:430)
	at org.codehaus.classworlds.Launcher.main(Launcher.java:375)
Caused by: org.apache.maven.project.ProjectBuildingException: Cannot find parent: org.apache.fulcrum:fulcrum-parent
for project: null:fulcrum-yaafi-crypto:jar:1.0.7-SNAPSHOT for project null:fulcrum-yaafi-crypto:jar:1.0.7-SNAPSHOT
	at org.apache.maven.project.DefaultMavenProjectBuilder.assembleLineage(DefaultMavenProjectBuilder.java:1396)
	at org.apache.maven.project.DefaultMavenProjectBuilder.buildInternal(DefaultMavenProjectBuilder.java:823)
	at org.apache.maven.project.DefaultMavenProjectBuilder.buildFromSourceFileInternal(DefaultMavenProjectBuilder.java:508)
	at org.apache.maven.project.DefaultMavenProjectBuilder.build(DefaultMavenProjectBuilder.java:200)
	at org.apache.maven.DefaultMaven.getProject(DefaultMaven.java:604)
	at org.apache.maven.DefaultMaven.collectProjects(DefaultMaven.java:487)
	at org.apache.maven.DefaultMaven.getProjects(DefaultMaven.java:391)
	... 12 more
Caused by: org.apache.maven.project.InvalidProjectModelException: Not a v4.0.0 POM. for project
org.apache.fulcrum:fulcrum-parent at /srv/gump/public/workspace/mvnlocalrepo/shared/org/apache/fulcrum/fulcrum-parent/1/fulcrum-parent-1.pom
	at org.apache.maven.project.DefaultMavenProjectBuilder.readModel(DefaultMavenProjectBuilder.java:1599)
	at org.apache.maven.project.DefaultMavenProjectBuilder.readModel(DefaultMavenProjectBuilder.java:1571)
	at org.apache.maven.project.DefaultMavenProjectBuilder.findModelFromRepository(DefaultMavenProjectBuilder.java:562)
	at org.apache.maven.project.DefaultMavenProjectBuilder.assembleLineage(DefaultMavenProjectBuilder.java:1392)
	... 18 more
[INFO] ------------------------------------------------------------------------
[INFO] Total time: 3 minutes 59 seconds
[INFO] Finished at: Thu Dec 02 09:00:25 UTC 2010
[INFO] Final Memory: 2M/15M
[INFO] ------------------------------------------------------------------------
---------------------------------------------

To subscribe to this information via syndicated feeds:
- RSS: http://vmgump.apache.org/gump/public/turbine-fulcrum/fulcrum-yaafi-crypto/rss.xml
- Atom: http://vmgump.apache.org/gump/public/turbine-fulcrum/fulcrum-yaafi-crypto/atom.xml

============================== Gump Tracking Only ===
Produced by Apache Gump(TM) version 2.3.
Gump Run 11000602122010, vmgump.apache.org:vmgump:11000602122010
Gump E-mail Identifier (unique within run) #7.

--
Apache Gump
http://gump.apache.org/ [Instance: vmgump]

---------------------------------------------------------------------
To unsubscribe, e-mail: dev-unsubscribe@turbine.apache.org
For additional commands, e-mail: dev-help@turbine.apache.org


Mime
View raw message