turbine-dev mailing list archives

Site index · List index
Message view « Date » · « Thread »
Top « Date » · « Thread »
From fulcrum-quartz development <...@turbine.apache.org>
Subject [GUMP@vmgump]: Project fulcrum-quartz (in module turbine-fulcrum) failed
Date Mon, 17 Aug 2009 14:31:47 GMT
To whom it may engage...
        
This is an automated request, but not an unsolicited one. For 
more information please visit http://gump.apache.org/nagged.html, 
and/or contact the folk at general@gump.apache.org.

Project fulcrum-quartz has an issue affecting its community integration.
This issue affects 2 projects.
The current state of this project is 'Failed', with reason 'Build Failed'.
For reference only, the following projects are affected by this:
    - fulcrum-quartz :  Services Framework
    - fulcrum-quartz-test :  Services Framework


Full details are available at:
    http://vmgump.apache.org/gump/public/turbine-fulcrum/fulcrum-quartz/index.html

That said, some information snippets are provided here.

The following annotations (debug/informational/warning/error messages) were provided:
 -DEBUG- Sole output [fulcrum-quartz-1.1-SNAPSHOT.jar] identifier set to project name
 -DEBUG- (Gump generated) Maven2 Settings in: /srv/gump/public/workspace/turbine-fulcrum/quartz/gump_mvn_settings.xml
 -INFO- Failed with reason build failed
 -DEBUG- Maven POM in: /srv/gump/public/workspace/turbine-fulcrum/quartz/pom.xml
 -INFO- Failed to extract fallback artifacts from Gump Repository



The following work was performed:
http://vmgump.apache.org/gump/public/turbine-fulcrum/fulcrum-quartz/gump_work/build_turbine-fulcrum_fulcrum-quartz.html
Work Name: build_turbine-fulcrum_fulcrum-quartz (Type: Build)
Work ended in a state of : Failed
Elapsed: 16 secs
Command Line: mvn --batch-mode --settings /srv/gump/public/workspace/turbine-fulcrum/quartz/gump_mvn_settings.xml
package 
[Working Directory: /srv/gump/public/workspace/turbine-fulcrum/quartz]
CLASSPATH: /usr/lib/jvm/java-6-sun/lib/tools.jar:/srv/gump/public/workspace/turbine-fulcrum/quartz/target/classes:/srv/gump/public/workspace/ant/dist/lib/ant-jmf.jar:/srv/gump/public/workspace/ant/dist/lib/ant-swing.jar:/srv/gump/public/workspace/ant/dist/lib/ant-apache-resolver.jar:/srv/gump/public/workspace/ant/dist/lib/ant-apache-xalan2.jar:/srv/gump/public/workspace/ant/dist/lib/ant-trax.jar:/srv/gump/public/workspace/ant/dist/lib/ant-junit.jar:/srv/gump/public/workspace/ant/dist/lib/ant-launcher.jar:/srv/gump/public/workspace/ant/dist/lib/ant-nodeps.jar:/srv/gump/public/workspace/ant/dist/lib/ant.jar:/srv/gump/public/workspace/excalibur/framework/api/target/avalon-framework-api-4.3.2-SNAPSHOT.jar:/srv/gump/public/workspace/excalibur/framework/impl/target/avalon-framework-impl-4.3.2-SNAPSHOT.jar:/srv/gump/public/workspace/turbine-fulcrum/yaafi/target/fulcrum-yaafi-1.0.7-SNAPSHOT.jar:/srv/gump/public/workspace/turbine-fulcrum/testcontainer/target/fulcrum-testcontainer-1.0.
 7-SNAPSHOT.jar:/srv/gump/public/workspace/junit/dist/junit-17082009.jar:/srv/gump/public/workspace/apache-commons/lang/target/commons-lang-3.0-SNAPSHOT.jar:/srv/gump/public/workspace/apache-commons/collections/build/commons-collections-17082009.jar:/srv/gump/public/workspace/apache-commons/logging/target/commons-logging-17082009.jar:/srv/gump/public/workspace/apache-commons/logging/target/commons-logging-api-17082009.jar:/srv/gump/public/workspace/quartz/lib/quartz.jar:/srv/gump/public/workspace/xstream/xstream/target/xstream-1.4-SNAPSHOT.jar
---------------------------------------------
	at org.apache.maven.surefire.Surefire.run(Surefire.java:177)
	at sun.reflect.NativeMethodAccessorImpl.invoke0(Native Method)
	at sun.reflect.NativeMethodAccessorImpl.invoke(NativeMethodAccessorImpl.java:39)
	at sun.reflect.DelegatingMethodAccessorImpl.invoke(DelegatingMethodAccessorImpl.java:25)
	at java.lang.reflect.Method.invoke(Method.java:597)
	at org.apache.maven.surefire.booter.SurefireBooter.runSuitesInProcess(SurefireBooter.java:345)
	at org.apache.maven.surefire.booter.SurefireBooter.main(SurefireBooter.java:1009)
Caused by: org.apache.avalon.framework.configuration.ConfigurationException: com.thoughtworks.xstream.converters.ConversionException:
Cannot deserialize object with new readObject()/writeObject() methods
---- Debugging information ----
class               : org.quartz.CronTrigger
required-type       : org.quartz.CronTrigger
path                : /list/org.quartz.CronTrigger
class[1]            : java.util.ArrayList
-------------------------------
	at org.apache.fulcrum.quartz.impl.DefaultQuartzScheduler.initialize(DefaultQuartzScheduler.java:135)
	at org.apache.fulcrum.yaafi.framework.component.AvalonServiceComponentImpl.initialize(AvalonServiceComponentImpl.java:404)
	at org.apache.fulcrum.yaafi.framework.component.AvalonServiceComponentImpl.incarnateInstance(AvalonServiceComponentImpl.java:106)
	at org.apache.fulcrum.yaafi.framework.component.ServiceComponentImpl.getInstance(ServiceComponentImpl.java:139)
	at org.apache.fulcrum.yaafi.framework.component.ServiceComponentImpl.incarnate(ServiceComponentImpl.java:154)
	... 31 more
Tests run: 1, Failures: 0, Errors: 1, Skipped: 0, Time elapsed: 0.084 sec <<< FAILURE!

Results :

Tests in error: 
  testGetJobs(org.apache.fulcrum.quartz.DefaultQuartzSchedulerImplTest)
  testJobListener(org.apache.fulcrum.quartz.DefaultQuartzSchedulerImplTest)
  testJobExecutionWithManager(org.apache.fulcrum.quartz.DefaultQuartzSchedulerImplTest)
  testJobExecution(org.apache.fulcrum.quartz.DefaultQuartzSchedulerImplTest)
  testJobExecutionWithCron(org.apache.fulcrum.quartz.DefaultQuartzSchedulerImplTest)
  testJobDetailMap(org.apache.fulcrum.quartz.DefaultQuartzSchedulerImplTest)
  testTriggerMap(org.apache.fulcrum.quartz.DefaultQuartzSchedulerImplTest)
  testPreScheduled(org.apache.fulcrum.quartz.DefaultQuartzSchedulerImplTest)
  testAddRemoveTrigger(org.apache.fulcrum.quartz.SchedulerShutDownTest)

Tests run: 11, Failures: 0, Errors: 9, Skipped: 0

[INFO] ------------------------------------------------------------------------
[ERROR] BUILD FAILURE
[INFO] ------------------------------------------------------------------------
[INFO] There are test failures.

Please refer to /srv/gump/public/workspace/turbine-fulcrum/quartz/target/surefire-reports
for the individual test results.
[INFO] ------------------------------------------------------------------------
[INFO] For more information, run Maven with the -e switch
[INFO] ------------------------------------------------------------------------
[INFO] Total time: 15 seconds
[INFO] Finished at: Mon Aug 17 14:31:40 PDT 2009
[INFO] Final Memory: 17M/32M
[INFO] ------------------------------------------------------------------------
---------------------------------------------

To subscribe to this information via syndicated feeds:
- RSS: http://vmgump.apache.org/gump/public/turbine-fulcrum/fulcrum-quartz/rss.xml
- Atom: http://vmgump.apache.org/gump/public/turbine-fulcrum/fulcrum-quartz/atom.xml

============================== Gump Tracking Only ===
Produced by Gump version 2.3.
Gump Run 07000817082009, vmgump:vmgump-public:07000817082009
Gump E-mail Identifier (unique within run) #28.

--
Apache Gump
http://gump.apache.org/ [Instance: vmgump]

---------------------------------------------------------------------
To unsubscribe, e-mail: dev-unsubscribe@turbine.apache.org
For additional commands, e-mail: dev-help@turbine.apache.org


Mime
View raw message