turbine-dev mailing list archives

Site index · List index
Message view « Date » · « Thread »
Top « Date » · « Thread »
From fulcrum-yaafi development <...@turbine.apache.org>
Subject [GUMP@vmgump]: Project fulcrum-yaafi-crypto (in module turbine-fulcrum) failed
Date Sun, 31 Aug 2008 00:54:15 GMT
To whom it may engage...
        
This is an automated request, but not an unsolicited one. For 
more information please visit http://gump.apache.org/nagged.html, 
and/or contact the folk at general@gump.apache.org.

Project fulcrum-yaafi-crypto has an issue affecting its community integration.
This issue affects 26 projects,
 and has been outstanding for 29 runs.
The current state of this project is 'Failed', with reason 'Build Failed'.
For reference only, the following projects are affected by this:
    - fulcrum-bsf :  Services Framework
    - fulcrum-cache :  Services Framework
    - fulcrum-configuration-impl :  Services Framework
    - fulcrum-crypto :  Services Framework
    - fulcrum-dvsl :  Services Framework
    - fulcrum-factory :  Services Framework
    - fulcrum-hsqldb :  Services Framework
    - fulcrum-intake :  Services Framework
    - fulcrum-localization :  Services Framework
    - fulcrum-mimetype :  Services Framework
    - fulcrum-naming :  Services Framework
    - fulcrum-osworkflow :  Services Framework
    - fulcrum-parser :  Services Framework
    - fulcrum-pool :  Services Framework
    - fulcrum-quartz :  Services Framework
    - fulcrum-security-api :  Services Framework
    - fulcrum-security-memory :  Services Framework
    - fulcrum-security-nt :  Services Framework
    - fulcrum-template :  Services Framework
    - fulcrum-testcontainer :  Services Framework
    - fulcrum-upload :  Services Framework
    - fulcrum-xmlrpc :  Services Framework
    - fulcrum-xslt :  Services Framework
    - fulcrum-yaafi :  Services Framework
    - fulcrum-yaafi-crypto :  Services Framework
    - turbine-core :  A servlet based framework.


Full details are available at:
    http://vmgump.apache.org/gump/public/turbine-fulcrum/fulcrum-yaafi-crypto/index.html

That said, some information snippets are provided here.

The following annotations (debug/informational/warning/error messages) were provided:
 -DEBUG- Sole output [fulcrum-yaafi-crypto-1.0.6-SNAPSHOT.jar] identifier set to project name
 -DEBUG- (Gump generated) Maven2 Settings in: /srv/gump/public/workspace/turbine-fulcrum/yaafi-crypto/gump_mvn_settings.xml
 -INFO- Failed with reason build failed
 -DEBUG- Maven POM in: /srv/gump/public/workspace/turbine-fulcrum/yaafi-crypto/pom.xml
 -INFO- Failed to extract fallback artifacts from Gump Repository



The following work was performed:
http://vmgump.apache.org/gump/public/turbine-fulcrum/fulcrum-yaafi-crypto/gump_work/build_turbine-fulcrum_fulcrum-yaafi-crypto.html
Work Name: build_turbine-fulcrum_fulcrum-yaafi-crypto (Type: Build)
Work ended in a state of : Failed
Elapsed: 2 secs
Command Line: mvn --batch-mode --settings /srv/gump/public/workspace/turbine-fulcrum/yaafi-crypto/gump_mvn_settings.xml
package 
[Working Directory: /srv/gump/public/workspace/turbine-fulcrum/yaafi-crypto]
CLASSPATH: /usr/lib/jvm/java-1.5.0-sun/lib/tools.jar
---------------------------------------------
	at org.apache.maven.DefaultMaven.doExecute(DefaultMaven.java:292)
	at org.apache.maven.DefaultMaven.execute(DefaultMaven.java:129)
	at org.apache.maven.cli.MavenCli.main(MavenCli.java:287)
	at sun.reflect.NativeMethodAccessorImpl.invoke0(Native Method)
	at sun.reflect.NativeMethodAccessorImpl.invoke(NativeMethodAccessorImpl.java:39)
	at sun.reflect.DelegatingMethodAccessorImpl.invoke(DelegatingMethodAccessorImpl.java:25)
	at java.lang.reflect.Method.invoke(Method.java:585)
	at org.codehaus.classworlds.Launcher.launchEnhanced(Launcher.java:315)
	at org.codehaus.classworlds.Launcher.launch(Launcher.java:255)
	at org.codehaus.classworlds.Launcher.mainWithExitCode(Launcher.java:430)
	at org.codehaus.classworlds.Launcher.main(Launcher.java:375)
Caused by: org.apache.maven.project.ProjectBuildingException: Cannot find parent: fulcrum:fulcrum-parent
for project: null:fulcrum-yaafi-crypto:jar:1.0.6-SNAPSHOT for project null:fulcrum-yaafi-crypto:jar:1.0.6-SNAPSHOT
	at org.apache.maven.project.DefaultMavenProjectBuilder.assembleLineage(DefaultMavenProjectBuilder.java:1370)
	at org.apache.maven.project.DefaultMavenProjectBuilder.buildInternal(DefaultMavenProjectBuilder.java:821)
	at org.apache.maven.project.DefaultMavenProjectBuilder.buildFromSourceFileInternal(DefaultMavenProjectBuilder.java:506)
	at org.apache.maven.project.DefaultMavenProjectBuilder.build(DefaultMavenProjectBuilder.java:198)
	at org.apache.maven.DefaultMaven.getProject(DefaultMaven.java:583)
	at org.apache.maven.DefaultMaven.collectProjects(DefaultMaven.java:461)
	at org.apache.maven.DefaultMaven.getProjects(DefaultMaven.java:365)
	... 11 more
Caused by: org.apache.maven.project.ProjectBuildingException: POM 'fulcrum:fulcrum-parent'
not found in repository: Unable to download the artifact from any repository

  fulcrum:fulcrum-parent:pom:1-SNAPSHOT

from the specified remote repositories:
  Gump (http://localhost:8192/maven2)
 for project fulcrum:fulcrum-parent
	at org.apache.maven.project.DefaultMavenProjectBuilder.findModelFromRepository(DefaultMavenProjectBuilder.java:603)
	at org.apache.maven.project.DefaultMavenProjectBuilder.assembleLineage(DefaultMavenProjectBuilder.java:1366)
	... 17 more
Caused by: org.apache.maven.artifact.resolver.ArtifactNotFoundException: Unable to download
the artifact from any repository

  fulcrum:fulcrum-parent:pom:1-SNAPSHOT

from the specified remote repositories:
  Gump (http://localhost:8192/maven2)

	at org.apache.maven.artifact.resolver.DefaultArtifactResolver.resolve(DefaultArtifactResolver.java:212)
	at org.apache.maven.artifact.resolver.DefaultArtifactResolver.resolve(DefaultArtifactResolver.java:74)
	at org.apache.maven.project.DefaultMavenProjectBuilder.findModelFromRepository(DefaultMavenProjectBuilder.java:556)
	... 18 more
Caused by: org.apache.maven.wagon.ResourceDoesNotExistException: Unable to download the artifact
from any repository
	at org.apache.maven.artifact.manager.DefaultWagonManager.getArtifact(DefaultWagonManager.java:331)
	at org.apache.maven.artifact.resolver.DefaultArtifactResolver.resolve(DefaultArtifactResolver.java:200)
	... 20 more
[INFO] ------------------------------------------------------------------------
[INFO] Total time: < 1 second
[INFO] Finished at: Sat Aug 30 23:54:15 GMT-08:00 2008
[INFO] Final Memory: 1M/2M
[INFO] ------------------------------------------------------------------------
---------------------------------------------

To subscribe to this information via syndicated feeds:
- RSS: http://vmgump.apache.org/gump/public/turbine-fulcrum/fulcrum-yaafi-crypto/rss.xml
- Atom: http://vmgump.apache.org/gump/public/turbine-fulcrum/fulcrum-yaafi-crypto/atom.xml

============================== Gump Tracking Only ===
Produced by Gump version 2.3.
Gump Run 08010031082008, vmgump:vmgump-public:08010031082008
Gump E-mail Identifier (unique within run) #3.

--
Apache Gump
http://gump.apache.org/ [Instance: vmgump]

---------------------------------------------------------------------
To unsubscribe, e-mail: dev-unsubscribe@turbine.apache.org
For additional commands, e-mail: dev-help@turbine.apache.org


Mime
View raw message