tomee-commits mailing list archives

Site index · List index
Message view « Date » · « Thread »
Top « Date » · « Thread »
From Apache Jenkins Server <jenk...@builds.apache.org>
Subject Build failed in Jenkins: TomEE » jakarta-deploy #551
Date Wed, 04 Aug 2021 04:55:12 GMT
See <https://ci-builds.apache.org/job/Tomee/job/jakarta-deploy/551/display/redirect>

Changes:


------------------------------------------
[...truncated 220.99 KB...]
[INFO] Downloaded from Apache Snapshots: https://repository.apache.org/content/repositories/snapshots/org/apache/tomee/utils/8.0.8-SNAPSHOT/maven-metadata.xml
(602 B at 931 B/s)
[INFO] Downloaded from apache-snapshots: https://repository.apache.org/content/groups/snapshots/org/apache/tomee/utils/8.0.8-SNAPSHOT/maven-metadata.xml
(602 B at 919 B/s)
[WARNING] Could not transfer metadata org.apache.tomee:utils:8.0.8-SNAPSHOT/maven-metadata.xml
from/to sonatype-snapshots (https://oss.sonatype.org/content/repositories/snapshots): authorization
failed for https://oss.sonatype.org/content/repositories/snapshots/org/apache/tomee/utils/8.0.8-SNAPSHOT/maven-metadata.xml,
status: 403 Forbidden
[INFO] Failure detected.
[INFO] 
[INFO] ------------------------------------------------------------------------
[INFO] Skipping TomEE :: TomEE :: Apache TomEE
[INFO] This project has been banned from the build due to previous failures.
[INFO] ------------------------------------------------------------------------
[INFO] ------------------------------------------------------------------------
[INFO] Reactor Summary:
[INFO] 
[INFO] TomEE :: TomEE :: Apache TomEE 9 9.0.0-M8-SNAPSHOT . SUCCESS [ 17.545 s]
[INFO] TomEE :: Jakarta EE 9 Full API 9.1.1-SNAPSHOT ...... SUCCESS [ 34.455 s]
[INFO] TomEE :: TomEE 9.0.0-M8-SNAPSHOT ................... SUCCESS [ 18.942 s]
[INFO] TomEE :: Transform 9.0.0-M8-SNAPSHOT ............... SUCCESS [  9.451 s]
[INFO] TomEE :: TomEE :: WebProfile Webapp 9.0.0-M8-SNAPSHOT FAILURE [ 21.393 s]
[INFO] TomEE :: TomEE :: MicroProfile Webapp 9.0.0-M8-SNAPSHOT FAILURE [ 22.594 s]
[INFO] TomEE :: TomEE :: Plus Webapp 9.0.0-M8-SNAPSHOT .... FAILURE [  5.548 s]
[INFO] TomEE :: TomEE :: Plume Webapp 9.0.0-M8-SNAPSHOT ... FAILURE [  7.550 s]
[INFO] TomEE :: TomEE :: Apache TomEE 9.0.0-M8-SNAPSHOT ... SKIPPED
[INFO] ------------------------------------------------------------------------
[INFO] BUILD FAILURE
[INFO] ------------------------------------------------------------------------
[INFO] Total time:  02:56 min
[INFO] Finished at: 2021-08-04T04:54:52Z
[INFO] ------------------------------------------------------------------------
ERROR: Asynchronous execution failure
java.util.concurrent.ExecutionException: java.lang.NullPointerException
	at hudson.remoting.Channel$2.adapt(Channel.java:1039)
	at hudson.remoting.Channel$2.adapt(Channel.java:1033)
	at hudson.remoting.FutureAdapter.get(FutureAdapter.java:59)
	at hudson.maven.AbstractMavenBuilder.waitForAsynchronousExecutions(AbstractMavenBuilder.java:186)
	at hudson.maven.Maven3Builder.call(Maven3Builder.java:144)
	at hudson.maven.Maven3Builder.call(Maven3Builder.java:70)
	at hudson.remoting.UserRequest.perform(UserRequest.java:211)
	at hudson.remoting.UserRequest.perform(UserRequest.java:54)
	at hudson.remoting.Request$2.run(Request.java:375)
	at hudson.remoting.InterceptingExecutorService$1.call(InterceptingExecutorService.java:73)
	at java.util.concurrent.FutureTask.run(FutureTask.java:266)
	at java.util.concurrent.ThreadPoolExecutor.runWorker(ThreadPoolExecutor.java:1149)
	at java.util.concurrent.ThreadPoolExecutor$Worker.run(ThreadPoolExecutor.java:624)
	at java.lang.Thread.run(Thread.java:748)
Caused by: java.lang.NullPointerException
ERROR: Asynchronous execution failure
java.util.concurrent.ExecutionException: java.lang.NullPointerException
	at hudson.remoting.Channel$2.adapt(Channel.java:1039)
	at hudson.remoting.Channel$2.adapt(Channel.java:1033)
	at hudson.remoting.FutureAdapter.get(FutureAdapter.java:59)
	at hudson.maven.AbstractMavenBuilder.waitForAsynchronousExecutions(AbstractMavenBuilder.java:186)
	at hudson.maven.Maven3Builder.call(Maven3Builder.java:144)
	at hudson.maven.Maven3Builder.call(Maven3Builder.java:70)
	at hudson.remoting.UserRequest.perform(UserRequest.java:211)
	at hudson.remoting.UserRequest.perform(UserRequest.java:54)
	at hudson.remoting.Request$2.run(Request.java:375)
	at hudson.remoting.InterceptingExecutorService$1.call(InterceptingExecutorService.java:73)
	at java.util.concurrent.FutureTask.run(FutureTask.java:266)
	at java.util.concurrent.ThreadPoolExecutor.runWorker(ThreadPoolExecutor.java:1149)
	at java.util.concurrent.ThreadPoolExecutor$Worker.run(ThreadPoolExecutor.java:624)
	at java.lang.Thread.run(Thread.java:748)
Caused by: java.lang.NullPointerException
ERROR: Asynchronous execution failure
java.util.concurrent.ExecutionException: java.lang.NullPointerException
	at hudson.remoting.Channel$2.adapt(Channel.java:1039)
	at hudson.remoting.Channel$2.adapt(Channel.java:1033)
	at hudson.remoting.FutureAdapter.get(FutureAdapter.java:59)
	at hudson.maven.AbstractMavenBuilder.waitForAsynchronousExecutions(AbstractMavenBuilder.java:186)
	at hudson.maven.Maven3Builder.call(Maven3Builder.java:144)
	at hudson.maven.Maven3Builder.call(Maven3Builder.java:70)
	at hudson.remoting.UserRequest.perform(UserRequest.java:211)
	at hudson.remoting.UserRequest.perform(UserRequest.java:54)
	at hudson.remoting.Request$2.run(Request.java:375)
	at hudson.remoting.InterceptingExecutorService$1.call(InterceptingExecutorService.java:73)
	at java.util.concurrent.FutureTask.run(FutureTask.java:266)
	at java.util.concurrent.ThreadPoolExecutor.runWorker(ThreadPoolExecutor.java:1149)
	at java.util.concurrent.ThreadPoolExecutor$Worker.run(ThreadPoolExecutor.java:624)
	at java.lang.Thread.run(Thread.java:748)
Caused by: java.lang.NullPointerException
ERROR: Asynchronous execution failure
java.util.concurrent.ExecutionException: java.lang.NullPointerException
	at hudson.remoting.Channel$2.adapt(Channel.java:1039)
	at hudson.remoting.Channel$2.adapt(Channel.java:1033)
	at hudson.remoting.FutureAdapter.get(FutureAdapter.java:59)
	at hudson.maven.AbstractMavenBuilder.waitForAsynchronousExecutions(AbstractMavenBuilder.java:186)
	at hudson.maven.Maven3Builder.call(Maven3Builder.java:144)
	at hudson.maven.Maven3Builder.call(Maven3Builder.java:70)
	at hudson.remoting.UserRequest.perform(UserRequest.java:211)
	at hudson.remoting.UserRequest.perform(UserRequest.java:54)
	at hudson.remoting.Request$2.run(Request.java:375)
	at hudson.remoting.InterceptingExecutorService$1.call(InterceptingExecutorService.java:73)
	at java.util.concurrent.FutureTask.run(FutureTask.java:266)
	at java.util.concurrent.ThreadPoolExecutor.runWorker(ThreadPoolExecutor.java:1149)
	at java.util.concurrent.ThreadPoolExecutor$Worker.run(ThreadPoolExecutor.java:624)
	at java.lang.Thread.run(Thread.java:748)
Caused by: java.lang.NullPointerException
ERROR: Asynchronous execution failure
java.util.concurrent.ExecutionException: java.lang.NullPointerException
	at hudson.remoting.Channel$2.adapt(Channel.java:1039)
	at hudson.remoting.Channel$2.adapt(Channel.java:1033)
	at hudson.remoting.FutureAdapter.get(FutureAdapter.java:59)
	at hudson.maven.AbstractMavenBuilder.waitForAsynchronousExecutions(AbstractMavenBuilder.java:186)
	at hudson.maven.Maven3Builder.call(Maven3Builder.java:144)
	at hudson.maven.Maven3Builder.call(Maven3Builder.java:70)
	at hudson.remoting.UserRequest.perform(UserRequest.java:211)
	at hudson.remoting.UserRequest.perform(UserRequest.java:54)
	at hudson.remoting.Request$2.run(Request.java:375)
	at hudson.remoting.InterceptingExecutorService$1.call(InterceptingExecutorService.java:73)
	at java.util.concurrent.FutureTask.run(FutureTask.java:266)
	at java.util.concurrent.ThreadPoolExecutor.runWorker(ThreadPoolExecutor.java:1149)
	at java.util.concurrent.ThreadPoolExecutor$Worker.run(ThreadPoolExecutor.java:624)
	at java.lang.Thread.run(Thread.java:748)
Caused by: java.lang.NullPointerException
ERROR: Asynchronous execution failure
java.util.concurrent.ExecutionException: java.lang.NullPointerException
	at hudson.remoting.Channel$2.adapt(Channel.java:1039)
	at hudson.remoting.Channel$2.adapt(Channel.java:1033)
	at hudson.remoting.FutureAdapter.get(FutureAdapter.java:59)
	at hudson.maven.AbstractMavenBuilder.waitForAsynchronousExecutions(AbstractMavenBuilder.java:186)
	at hudson.maven.Maven3Builder.call(Maven3Builder.java:144)
	at hudson.maven.Maven3Builder.call(Maven3Builder.java:70)
	at hudson.remoting.UserRequest.perform(UserRequest.java:211)
	at hudson.remoting.UserRequest.perform(UserRequest.java:54)
	at hudson.remoting.Request$2.run(Request.java:375)
	at hudson.remoting.InterceptingExecutorService$1.call(InterceptingExecutorService.java:73)
	at java.util.concurrent.FutureTask.run(FutureTask.java:266)
	at java.util.concurrent.ThreadPoolExecutor.runWorker(ThreadPoolExecutor.java:1149)
	at java.util.concurrent.ThreadPoolExecutor$Worker.run(ThreadPoolExecutor.java:624)
	at java.lang.Thread.run(Thread.java:748)
Caused by: java.lang.NullPointerException
ERROR: Asynchronous execution failure
java.util.concurrent.ExecutionException: java.lang.NullPointerException
	at hudson.remoting.Channel$2.adapt(Channel.java:1039)
	at hudson.remoting.Channel$2.adapt(Channel.java:1033)
	at hudson.remoting.FutureAdapter.get(FutureAdapter.java:59)
	at hudson.maven.AbstractMavenBuilder.waitForAsynchronousExecutions(AbstractMavenBuilder.java:186)
	at hudson.maven.Maven3Builder.call(Maven3Builder.java:144)
	at hudson.maven.Maven3Builder.call(Maven3Builder.java:70)
	at hudson.remoting.UserRequest.perform(UserRequest.java:211)
	at hudson.remoting.UserRequest.perform(UserRequest.java:54)
	at hudson.remoting.Request$2.run(Request.java:375)
	at hudson.remoting.InterceptingExecutorService$1.call(InterceptingExecutorService.java:73)
	at java.util.concurrent.FutureTask.run(FutureTask.java:266)
	at java.util.concurrent.ThreadPoolExecutor.runWorker(ThreadPoolExecutor.java:1149)
	at java.util.concurrent.ThreadPoolExecutor$Worker.run(ThreadPoolExecutor.java:624)
	at java.lang.Thread.run(Thread.java:748)
Caused by: java.lang.NullPointerException
ERROR: Asynchronous execution failure
java.util.concurrent.ExecutionException: java.lang.NullPointerException
	at hudson.remoting.Channel$2.adapt(Channel.java:1039)
	at hudson.remoting.Channel$2.adapt(Channel.java:1033)
	at hudson.remoting.FutureAdapter.get(FutureAdapter.java:59)
	at hudson.maven.AbstractMavenBuilder.waitForAsynchronousExecutions(AbstractMavenBuilder.java:186)
	at hudson.maven.Maven3Builder.call(Maven3Builder.java:144)
	at hudson.maven.Maven3Builder.call(Maven3Builder.java:70)
	at hudson.remoting.UserRequest.perform(UserRequest.java:211)
	at hudson.remoting.UserRequest.perform(UserRequest.java:54)
	at hudson.remoting.Request$2.run(Request.java:375)
	at hudson.remoting.InterceptingExecutorService$1.call(InterceptingExecutorService.java:73)
	at java.util.concurrent.FutureTask.run(FutureTask.java:266)
[ERROR] Failed to execute goal on project tomee-webprofile-webapp: Could not resolve dependencies
for project org.apache.tomee:tomee-webprofile-webapp:jar:9.0.0-M8-SNAPSHOT: Failed to collect
dependencies at org.apache.tomee:tomee-mojarra:jar:8.0.8-SNAPSHOT -> org.apache.tomee:openejb-core:jar:8.0.8-SNAPSHOT
-> org.apache.tomee:openejb-jee:jar:8.0.8-SNAPSHOT -> org.apache.tomee.bom:jaxb-runtime:pom:9.0.0-M8-SNAPSHOT:
Failed to read artifact descriptor for org.apache.tomee.bom:jaxb-runtime:pom:9.0.0-M8-SNAPSHOT:
Could not transfer artifact org.apache.tomee.bom:jaxb-runtime:pom:9.0.0-M8-SNAPSHOT from/to
sonatype-snapshots (https://oss.sonatype.org/content/repositories/snapshots): authorization
failed for https://oss.sonatype.org/content/repositories/snapshots/org/apache/tomee/bom/jaxb-runtime/9.0.0-M8-SNAPSHOT/jaxb-runtime-9.0.0-M8-SNAPSHOT.pom,
status: 403 Forbidden -> [Help 1]
	at java.util.concurrent.ThreadPoolExecutor.runWorker(ThreadPoolExecutor.java:1149)
	at java.util.concurrent.ThreadPoolExecutor$Worker.run(ThreadPoolExecutor.java:624)
[ERROR] Failed to execute goal org.apache.maven.plugins:maven-remote-resources-plugin:1.5:process
(process-resource-bundles) on project tomee-microprofile-webapp: Failed to resolve dependencies
for one or more projects in the reactor. Reason: Unable to get dependency information for
org.apache.tomee.bom:jaxb-runtime:pom:9.0.0-M8-SNAPSHOT: Failed to retrieve POM for org.apache.tomee.bom:jaxb-runtime:pom:9.0.0-M8-SNAPSHOT:
org.apache.tomee.bom:jaxb-runtime:pom:9.0.0-M8-SNAPSHOT failed to transfer from https://oss.sonatype.org/content/repositories/snapshots
during a previous attempt. This failure was cached in the local repository and resolution
is not reattempted until the update interval of sonatype-snapshots has elapsed or updates
are forced. Original error: Could not transfer artifact org.apache.tomee.bom:jaxb-runtime:pom:9.0.0-M8-SNAPSHOT
from/to sonatype-snapshots (https://oss.sonatype.org/content/repositories/snapshots): authorization
failed for https://oss.sonatype.org/content/repositories/snapshots/org/apache/tomee/bom/jaxb-runtime/9.0.0-M8-SNAPSHOT/jaxb-runtime-9.0.0-M8-SNAPSHOT.pom,
status: 403 Forbidden
	at java.lang.Thread.run(Thread.java:748)
[ERROR] org.apache.tomee.bom:jaxb-runtime:pom:9.0.0-M8-SNAPSHOT
Caused by: java.lang.NullPointerException
[ERROR] 
[ERROR] from the specified remote repositories:
[ERROR] Nexus (http://repository.apache.org/snapshots, releases=false, snapshots=true),
[ERROR] central (https://repo.maven.apache.org/maven2, releases=true, snapshots=false),
[ERROR] Apache Snapshots (https://repository.apache.org/content/repositories/snapshots, releases=false,
snapshots=true),
[ERROR] apache-snapshots (https://repository.apache.org/content/groups/snapshots, releases=false,
snapshots=true),
[ERROR] apache (https://repository.apache.org/content/repositories/releases/, releases=true,
snapshots=false),
[ERROR] sonatype-snapshots (https://oss.sonatype.org/content/repositories/snapshots, releases=false,
snapshots=true),
[ERROR] JBoss Repository (https://repository.jboss.org/nexus/content/groups/public-jboss,
releases=true, snapshots=true)
[ERROR] Path to dependency:
[ERROR] 1) org.apache.tomee:tomee-microprofile-webapp:jar:9.0.0-M8-SNAPSHOT
[ERROR] 2) org.apache.tomee:mp-common:jar:8.0.8-SNAPSHOT
[ERROR] 3) org.apache.tomee:openejb-core:jar:8.0.8-SNAPSHOT
[ERROR] 4) org.apache.tomee:openejb-jee:jar:8.0.8-SNAPSHOT
[ERROR] -> [Help 2]
[ERROR] Failed to execute goal org.apache.maven.plugins:maven-remote-resources-plugin:1.5:process
(process-resource-bundles) on project tomee-plus-webapp: Failed to resolve dependencies for
one or more projects in the reactor. Reason: Unable to get dependency information for org.apache.tomee.bom:jaxb-runtime:pom:9.0.0-M8-SNAPSHOT:
Failed to retrieve POM for org.apache.tomee.bom:jaxb-runtime:pom:9.0.0-M8-SNAPSHOT: org.apache.tomee.bom:jaxb-runtime:pom:9.0.0-M8-SNAPSHOT
failed to transfer from https://oss.sonatype.org/content/repositories/snapshots during a previous
attempt. This failure was cached in the local repository and resolution is not reattempted
until the update interval of sonatype-snapshots has elapsed or updates are forced. Original
error: Could not transfer artifact org.apache.tomee.bom:jaxb-runtime:pom:9.0.0-M8-SNAPSHOT
from/to sonatype-snapshots (https://oss.sonatype.org/content/repositories/snapshots): authorization
failed for https://oss.sonatype.org/content/repositories/snapshots/org/apache/tomee/bom/jaxb-runtime/9.0.0-M8-SNAPSHOT/jaxb-runtime-9.0.0-M8-SNAPSHOT.pom,
status: 403 Forbidden
[ERROR] org.apache.tomee.bom:jaxb-runtime:pom:9.0.0-M8-SNAPSHOT
[ERROR] 
[ERROR] from the specified remote repositories:
[ERROR] Nexus (http://repository.apache.org/snapshots, releases=false, snapshots=true),
[ERROR] central (https://repo.maven.apache.org/maven2, releases=true, snapshots=false),
[ERROR] Apache Snapshots (https://repository.apache.org/content/repositories/snapshots, releases=false,
snapshots=true),
[ERROR] apache-snapshots (https://repository.apache.org/content/groups/snapshots, releases=false,
snapshots=true),
[ERROR] apache (https://repository.apache.org/content/repositories/releases/, releases=true,
snapshots=false),
[ERROR] sonatype-snapshots (https://oss.sonatype.org/content/repositories/snapshots, releases=false,
snapshots=true),
[ERROR] JBoss Repository (https://repository.jboss.org/nexus/content/groups/public-jboss,
releases=true, snapshots=true)
[ERROR] Path to dependency:
[ERROR] 1) org.apache.tomee:tomee-plus-webapp:jar:9.0.0-M8-SNAPSHOT
[ERROR] 2) org.apache.tomee:mp-common:jar:8.0.8-SNAPSHOT
[ERROR] 3) org.apache.tomee:openejb-core:jar:8.0.8-SNAPSHOT
[ERROR] 4) org.apache.tomee:openejb-jee:jar:8.0.8-SNAPSHOT
[ERROR] -> [Help 2]
[ERROR] Failed to execute goal org.apache.maven.plugins:maven-remote-resources-plugin:1.5:process
(process-resource-bundles) on project tomee-plume-webapp: Failed to resolve dependencies for
one or more projects in the reactor. Reason: Unable to get dependency information for org.apache.tomee.bom:jaxb-runtime:pom:9.0.0-M8-SNAPSHOT:
Failed to retrieve POM for org.apache.tomee.bom:jaxb-runtime:pom:9.0.0-M8-SNAPSHOT: org.apache.tomee.bom:jaxb-runtime:pom:9.0.0-M8-SNAPSHOT
failed to transfer from https://oss.sonatype.org/content/repositories/snapshots during a previous
attempt. This failure was cached in the local repository and resolution is not reattempted
until the update interval of sonatype-snapshots has elapsed or updates are forced. Original
error: Could not transfer artifact org.apache.tomee.bom:jaxb-runtime:pom:9.0.0-M8-SNAPSHOT
from/to sonatype-snapshots (https://oss.sonatype.org/content/repositories/snapshots): authorization
failed for https://oss.sonatype.org/content/repositories/snapshots/org/apache/tomee/bom/jaxb-runtime/9.0.0-M8-SNAPSHOT/jaxb-runtime-9.0.0-M8-SNAPSHOT.pom,
status: 403 Forbidden
[ERROR] org.apache.tomee.bom:jaxb-runtime:pom:9.0.0-M8-SNAPSHOT
[ERROR] 
[ERROR] from the specified remote repositories:
[ERROR] Nexus (http://repository.apache.org/snapshots, releases=false, snapshots=true),
[ERROR] central (https://repo.maven.apache.org/maven2, releases=true, snapshots=false),
[ERROR] Apache Snapshots (https://repository.apache.org/content/repositories/snapshots, releases=false,
snapshots=true),
[ERROR] apache-snapshots (https://repository.apache.org/content/groups/snapshots, releases=false,
snapshots=true),
[ERROR] apache (https://repository.apache.org/content/repositories/releases/, releases=true,
snapshots=false),
[ERROR] sonatype-snapshots (https://oss.sonatype.org/content/repositories/snapshots, releases=false,
snapshots=true),
[ERROR] JBoss Repository (https://repository.jboss.org/nexus/content/groups/public-jboss,
releases=true, snapshots=true)
[ERROR] Path to dependency:
[ERROR] 1) org.apache.tomee:tomee-plume-webapp:jar:9.0.0-M8-SNAPSHOT
[ERROR] 2) org.apache.tomee:mp-common:jar:8.0.8-SNAPSHOT
[ERROR] 3) org.apache.tomee:openejb-core:jar:8.0.8-SNAPSHOT
[ERROR] 4) org.apache.tomee:openejb-jee:jar:8.0.8-SNAPSHOT
[ERROR] -> [Help 2]
[ERROR] 
[ERROR] To see the full stack trace of the errors, re-run Maven with the -e switch.
[ERROR] Re-run Maven using the -X switch to enable full debug logging.
[ERROR] 
[ERROR] For more information about the errors and possible solutions, please read the following
articles:
[ERROR] [Help 1] http://cwiki.apache.org/confluence/display/MAVEN/DependencyResolutionException
[ERROR] [Help 2] http://cwiki.apache.org/confluence/display/MAVEN/MojoExecutionException
[ERROR] 
[ERROR] After correcting the problems, you can resume the build with the command
[ERROR]   mvn <goals> -rf :tomee-webprofile-webapp
[JENKINS] Archiving <https://ci-builds.apache.org/job/Tomee/job/jakarta-deploy/ws/pom.xml>
to org.apache.tomee/tomee-project/9.0.0-M8-SNAPSHOT/tomee-project-9.0.0-M8-SNAPSHOT.pom
[Fast Archiver] Compressed 47.08 KB of artifacts by 68.0% relative to #550
[JENKINS] Archiving <https://ci-builds.apache.org/job/Tomee/job/jakarta-deploy/ws/tomee/tomee-webprofile-webapp/pom.xml>
to org.apache.tomee/tomee-webprofile-webapp/9.0.0-M8-SNAPSHOT/tomee-webprofile-webapp-9.0.0-M8-SNAPSHOT.pom
[JENKINS] Archiving <https://ci-builds.apache.org/job/Tomee/job/jakarta-deploy/ws/tomee/apache-tomee/pom.xml>
to org.apache.tomee/apache-tomee/9.0.0-M8-SNAPSHOT/apache-tomee-9.0.0-M8-SNAPSHOT.pom
[JENKINS] Archiving <https://ci-builds.apache.org/job/Tomee/job/jakarta-deploy/ws/tomee/tomee-plume-webapp/pom.xml>
to org.apache.tomee/tomee-plume-webapp/9.0.0-M8-SNAPSHOT/tomee-plume-webapp-9.0.0-M8-SNAPSHOT.pom
[JENKINS] Archiving <https://ci-builds.apache.org/job/Tomee/job/jakarta-deploy/ws/tomee/pom.xml>
to org.apache.tomee/tomee/9.0.0-M8-SNAPSHOT/tomee-9.0.0-M8-SNAPSHOT.pom
[JENKINS] Archiving <https://ci-builds.apache.org/job/Tomee/job/jakarta-deploy/ws/jakartaee-api/pom.xml>
to org.apache.tomee/jakartaee-api/9.1.1-SNAPSHOT/jakartaee-api-9.1.1-SNAPSHOT.pom
[JENKINS] Archiving <https://ci-builds.apache.org/job/Tomee/job/jakarta-deploy/ws/jakartaee-api/target/jakartaee-api-9.1.1-SNAPSHOT.jar>
to org.apache.tomee/jakartaee-api/9.1.1-20210804.045241-145/jakartaee-api-9.1.1-20210804.045241-145.jar
[JENKINS] Archiving <https://ci-builds.apache.org/job/Tomee/job/jakarta-deploy/ws/jakartaee-api/target/javaee-api-libs-9.1.1-SNAPSHOT.zip>
to org.apache.tomee/jakartaee-api/9.1.1-20210804.045241-145/jakartaee-api-9.1.1-20210804.045241-145.zip
[JENKINS] Archiving <https://ci-builds.apache.org/job/Tomee/job/jakarta-deploy/ws/jakartaee-api/target/jakartaee-api-9.1.1-SNAPSHOT-tomcat.jar>
to org.apache.tomee/jakartaee-api/9.1.1-20210804.045241-145/jakartaee-api-9.1.1-20210804.045241-145-tomcat.jar
[JENKINS] Archiving <https://ci-builds.apache.org/job/Tomee/job/jakarta-deploy/ws/jakartaee-api/target/jakartaee-api-9.1.1-SNAPSHOT-tomcat-sources.jar>
to org.apache.tomee/jakartaee-api/9.1.1-20210804.045241-145/jakartaee-api-9.1.1-20210804.045241-145-tomcat-sources.jar
[JENKINS] Archiving <https://ci-builds.apache.org/job/Tomee/job/jakarta-deploy/ws/jakartaee-api/target/jakartaee-api-9.1.1-SNAPSHOT-sources.jar>
to org.apache.tomee/jakartaee-api/9.1.1-20210804.045241-145/jakartaee-api-9.1.1-20210804.045241-145-sources.jar
[JENKINS] Archiving <https://ci-builds.apache.org/job/Tomee/job/jakarta-deploy/ws/jakartaee-api/target/classes/javaee-api-feature.xml>
to org.apache.tomee/jakartaee-api/9.1.1-20210804.045241-145/jakartaee-api-9.1.1-20210804.045241-145-features.xml
[Fast Archiver] Compressed 8.71 MB of artifacts by 25.5% relative to #550
[JENKINS] Archiving <https://ci-builds.apache.org/job/Tomee/job/jakarta-deploy/ws/tomee/tomee-plus-webapp/pom.xml>
to org.apache.tomee/tomee-plus-webapp/9.0.0-M8-SNAPSHOT/tomee-plus-webapp-9.0.0-M8-SNAPSHOT.pom
[JENKINS] Archiving <https://ci-builds.apache.org/job/Tomee/job/jakarta-deploy/ws/tomee/tomee-microprofile-webapp/pom.xml>
to org.apache.tomee/tomee-microprofile-webapp/9.0.0-M8-SNAPSHOT/tomee-microprofile-webapp-9.0.0-M8-SNAPSHOT.pom
[JENKINS] Archiving <https://ci-builds.apache.org/job/Tomee/job/jakarta-deploy/ws/transform/pom.xml>
to org.apache.tomee/transform/9.0.0-M8-SNAPSHOT/transform-9.0.0-M8-SNAPSHOT.pom
[JENKINS] Archiving <https://ci-builds.apache.org/job/Tomee/job/jakarta-deploy/ws/transform/target/transform-9.0.0-M8-SNAPSHOT.jar>
to org.apache.tomee/transform/9.0.0-M8-20210804.045327-144/transform-9.0.0-M8-20210804.045327-144.jar
Sending e-mails to: commits@tomee.apache.org
No mail will be sent out, as 'TomEE » jakarta-deploy » TomEE :: TomEE :: Apache TomEE
#551' does not have a result yet. Please make sure you set a proper result in case of pipeline/build
scripts.
Sending e-mails to: commits@tomee.apache.org
Sending e-mails to: commits@tomee.apache.org
Sending e-mails to: commits@tomee.apache.org
channel stopped

Mime
View raw message