tomee-commits mailing list archives

Site index · List index
Message view « Date » · « Thread »
Top « Date » · « Thread »
From "ASF GitHub Bot (JIRA)" <j...@apache.org>
Subject [jira] [Commented] (TOMEE-2322) Build issues - iTest failures
Date Thu, 06 Dec 2018 17:34:00 GMT

    [ https://issues.apache.org/jira/browse/TOMEE-2322?page=com.atlassian.jira.plugin.system.issuetabpanels:comment-tabpanel&focusedCommentId=16711761#comment-16711761
] 

ASF GitHub Bot commented on TOMEE-2322:
---------------------------------------

Github user asfgit closed the pull request at:

    https://github.com/apache/tomee/pull/258


> Build issues - iTest failures
> -----------------------------
>
>                 Key: TOMEE-2322
>                 URL: https://issues.apache.org/jira/browse/TOMEE-2322
>             Project: TomEE
>          Issue Type: Task
>    Affects Versions: 8.0.0-Final
>            Reporter: Jonathan Gallimore
>            Assignee: Jonathan Gallimore
>            Priority: Major
>              Labels: pull-request-available
>
> Something has introduced some build failures in master in the itest module:
> [ERROR] Tests run: 1, Failures: 0, Errors: 1, Skipped: 0, Time elapsed: 241.487 s <<<
FAILURE! - in org.apache.openejb.itest.failover.RandomConnectionStrategyTest
> [ERROR] Tests run: 1, Failures: 0, Errors: 1, Skipped: 0, Time elapsed: 121.155 s <<<
FAILURE! - in org.apache.openejb.itest.failover.ReconnectDelayListSelfTest
> [ERROR] Tests run: 1, Failures: 0, Errors: 1, Skipped: 0, Time elapsed: 181.446 s <<<
FAILURE! - in org.apache.openejb.itest.failover.RoundRobinConnectionStrategyTest
> [ERROR] Tests run: 1, Failures: 0, Errors: 1, Skipped: 0, Time elapsed: 60.895 s <<<
FAILURE! - in org.apache.openejb.itest.failover.StickyConnectionStrategyTest
> [ERROR] Tests run: 1, Failures: 0, Errors: 1, Skipped: 0, Time elapsed: 121.137 s <<<
FAILURE! - in org.apache.openejb.itest.failover.ReconnectDelayCaseInsensitiveTest
> [ERROR] Tests run: 1, Failures: 0, Errors: 1, Skipped: 0, Time elapsed: 121.128 s <<<
FAILURE! - in org.apache.openejb.itest.failover.ReconnectDelayTest
> [ERROR] Tests run: 1, Failures: 0, Errors: 1, Skipped: 0, Time elapsed: 181.491 s <<<
FAILURE! - in org.apache.openejb.itest.legacy.LegacyClientTest
> [ERROR] Tests run: 1, Failures: 0, Errors: 1, Skipped: 0, Time elapsed: 241.482 s <<<
FAILURE! - in org.apache.openejb.itest.legacy.LegacyServerTest
> These appear on both buildbot and local builds.



--
This message was sent by Atlassian JIRA
(v7.6.3#76005)

Mime
View raw message